{"text_format":"1","workbook":"xlsx","n_sheets":3,"sheets":["BalanceComprobacion","Data","BC"],"not_rendered":{"charts":0,"images":0,"macros":1,"external_links":0,"defined_names":2,"comments":0,"pivot_tables":0},"unopened":[],"bounds":{"document_bytes":16777216,"sheet_cells":100000,"rows_first":2000,"rows_last":500,"rows_between":2000,"halvings":0,"cell_chars":16384,"cell_head_chars":4096},"cells_cut":0,"cells_raw":0,"read":"whole","date_system":"1900"}

{"sheet":"BalanceComprobacion","index":0,"n_rows":965,"n_cols":7,"rows_kept":965,"cut":false,"hidden":false,"merged":[]}
[]
[]
[null,{"$f":"IF(Data!A2=\"\",\"\",Data!M1)","v":"Municipalidad de Buenos Aires"}]
[null,"Balance de Comprobación"]
[null,{"$f":"IF(Data!A2=\"\",\"\",CONCATENATE(\"Del 01 de enero \",Data!$D$2,\" al \",VLOOKUP(Data!C2,Data!F1:H24,2,FALSE),\" \",\"de\",\" \",Data!D2))","v":"Del 01 de enero 2024 al 31 de Mayo de 2024"}]
[null,{"$f":"IF(Data!A2=\"\",\"\",\"Código Institucional: \" & Data!B2)","v":"Código Institucional: 15603"}]
[null,"Moneda: CRC"]
[null,{"$f":"IF(Data!A2=\"\",\"\",CONCATENATE(\"Periodo:\",\" \",VLOOKUP(Data!C2,Data!F1:H24,3,FALSE)))","v":"Periodo: 5"}]
["CODIGO SEGMENTO","CUENTA (REPORTAR MÁXIMO A NIVEL 8)","NOMBRE CUENTA","SALDO INICIAL","DEBITOS PERIODO","CREDITOS PERIODO","SALDO FINAL"]
[3.1,"1.","ACTIVO",165832845328.79001,8752435484.8199997,6125581688.3800001,168459699125.23001]
[3.1,"1.1.","Activo Corriente",2822037062.1700001,8538190244.0200005,5913443926.3699999,5446783379.8199997]
[3.1,"1.1.1.","Efectivo  equivalentes de efectivo",2106811911.3199999,3514521067.9000001,3517425890.48,2103907088.74]
[3.1,"1.1.1.01.","Efectivo",2106811911.3199999,2846689297.0900002,3517425890.48,1436075317.9300001]
[3.1,"1.1.1.01.02.","Depósitos bancarios",2103561911.3199999,2846689297.0900002,3517425890.48,1432825317.9300001]
[3.1,"1.1.1.01.02.02.","Depósitos bancarios en el sector público interno",2103561911.3199999,2846689297.0900002,3517425890.48,1432825317.9300001]
[3.1,"1.1.1.01.02.02.2.","Cuentas corrientes en el sector público interno",687233539.54999995,912770483.08000004,1522199477.3199999,77804545.310000002]
[3.1,"1.1.1.01.02.02.2.21101","Banco Costa Rica",372598001.66000003,104424477.15000001,475258912.64999998,1763566.16]
[3.1,"1.1.1.01.02.02.2.21103","Banco Nacional de Costa Rica",314635537.88999999,808346005.92999995,1046940564.67,76040979.150000006]
[3.1,"1.1.1.01.02.02.3.","Caja Única",1416328371.77,1933918814.01,1995226413.1600001,1355020772.6199999]
[3.1,"1.1.1.01.02.02.3.11206","Ministerio de Hacienda",1416328371.77,1933918814.01,1995226413.1600001,1355020772.6199999]
[3.1,"1.1.1.01.03.","Cajas chicas  fondos rotatorios",3250000,0,0,3250000]
[3.1,"1.1.1.01.03.01.","Cajas chicas",2250000,0,0,2250000]
[3.1,"1.1.1.01.03.01.2.","Cajas chicas en el país",2250000,0,0,2250000]
[3.1,"1.1.1.01.03.01.2.99999","Cajas chicas en el país",2250000,0,0,2250000]
[3.1,"1.1.1.01.03.02.","Fondos rotatorios",1000000,0,0,1000000]
[3.1,"1.1.1.01.03.02.2.","Fondos rotatorios en el sector público interno",1000000,0,0,1000000]
[3.1,"1.1.1.01.03.02.2.99999","Fondos rotatorios en el sector público interno",1000000,0,0,1000000]
[3.1,"1.1.1.02.","Equivalentes de efectivo",0,667831770.80999994,0,667831770.80999994]
[3.1,"1.1.1.02.99.","Otros equivalentes de efectivo",0,667831770.80999994,0,667831770.80999994]
[3.1,"1.1.1.02.99.02.","Otros equivalentes de efectivo en el sector público interno",0,667831770.80999994,0,667831770.80999994]
[3.1,"1.1.1.02.99.02.0.","Otros equivalentes de efectivo en el sector público interno",0,667831770.80999994,0,667831770.80999994]
[3.1,"1.1.1.02.99.02.0.21101","Banco Costa Rica",0,333937091.62,0,333937091.62]
[3.1,"1.1.1.02.99.02.0.21103","Banco Nacional de Costa Rica",0,333894679.19,0,333894679.19]
[3.1,"1.1.3.","Cuentas a cobrar a c/p",495942436.38999999,4972510761.2799997,2343894977.2600002,3124558220.4099998]
[3.1,"1.1.3.01.","Impuestos a cobrar a c/p",488369513.36000001,746681273.01999998,738530576.02999997,496520210.35000002]
[3.1,"1.1.3.01.02.","Impuestos sobre la propiedad a cobrar c/p",454864572.41000003,576428574.85000002,584066107.24000001,447227040.01999998]
[3.1,"1.1.3.01.02.01.","Impuesto sobre la propiedad de bienes inmuebles a cobrar c/p",454864572.41000003,576428574.85000002,584066107.24000001,447227040.01999998]
[3.1,"1.1.3.01.02.01.0.","Impuesto sobre la propiedad de bienes inmuebles a cobrar c/p",454864572.41000003,576428574.85000002,584066107.24000001,447227040.01999998]
[3.1,"1.1.3.01.02.01.0.99999","Impuesto sobre la propiedad de bienes inmuebles a cobrar c/p",454864572.41000003,576428574.85000002,584066107.24000001,447227040.01999998]
[3.1,"1.1.3.01.03.","Impuestos sobre bienes y servicios a cobrar c/p",33504940.949999999,170252698.16999999,154464468.78999999,49293170.329999998]
[3.1,"1.1.3.01.03.99.","Otros Impuestos sobre bienes y servicios a cobrar c/p",33504940.949999999,170252698.16999999,154464468.78999999,49293170.329999998]
[3.1,"1.1.3.01.03.99.1.","Licencias profesionales, comerciales y otros permisos a cobrar c/p",30044160.510000002,162077559.87,148017657.47,44104062.909999996]
[3.1,"1.1.3.01.03.99.1.99999","Licencias profesionales, comerciales y otros permisos a cobrar c/p",30044160.510000002,162077559.87,148017657.47,44104062.909999996]
[3.1,"1.1.3.01.03.99.9.","Otros impuestos varios sobre bienes y servicios a cobrar c/p",3460780.44,8175138.2999999998,6446811.3200000003,5189107.42]
[3.1,"1.1.3.01.03.99.9.99999","Otros impuestos varios sobre bienes y servicios a cobrar c/p",3460780.44,8175138.2999999998,6446811.3200000003,5189107.42]
[3.1,"1.1.3.04.","Servicios y derechos a cobrar a corto plazo",180183637.80000001,437248629.08999997,341472069.04000002,275960197.85000002]
[3.1,"1.1.3.04.01.","Servicios a cobrar c/p",179741182.80000001,436629150.75999999,340881574.04000002,275488759.51999998]
[3.1,"1.1.3.04.01.04.","Servicios comunitarios a cobrar c/p",179741182.80000001,436629150.75999999,340881574.04000002,275488759.51999998]
[3.1,"1.1.3.04.01.04.0.","Servicios comunitarios a cobrar c/p",179741182.80000001,436629150.75999999,340881574.04000002,275488759.51999998]
[3.1,"1.1.3.04.01.04.0.99999","Servicios comunitarios a cobrar c/p",179741182.80000001,436629150.75999999,340881574.04000002,275488759.51999998]
[3.1,"1.1.3.04.02.","Derechos administrativos a cobrar c/p",442455,619478.32999999996,590495,471438.33]
[3.1,"1.1.3.04.02.01.","Derechos administrativos a los servicios de transporte a cobrar c/p",50000,390000,400000,40000]
[3.1,"1.1.3.04.02.01.0.","Derechos administrativos a los servicios de transporte a cobrar c/p",50000,390000,400000,40000]
[3.1,"1.1.3.04.02.01.0.99999","Derechos administrativos a los servicios de transporte a cobrar c/p  Derecho de piso  uso terminal",50000,390000,400000,40000]
[3.1,"1.1.3.04.02.99.","Otros derechos administrativos a cobrar c/p",392455,229478.33,190495,431438.33]
[3.1,"1.1.3.04.02.99.0.","Otros derechos administrativos a cobrar c/p",392455,229478.33,190495,431438.33]
[3.1,"1.1.3.04.02.99.0.99999","Otros derechos administrativos a cobrar c/p Derecho cementerio",392455,229478.33,190495,431438.33]
[3.1,"1.1.3.06.","Transferencias a cobrar a c/p",0,3784139549.0700002,1261372841.0899999,2522766707.98]
[3.1,"1.1.3.06.02.","Transferencias del sector público interno a cobrar c/p",0,3784139549.0700002,1261372841.0899999,2522766707.98]
[3.1,"1.1.3.06.02.01.","Transferencias del Gobierno Central a cobrar c/p",0,3772816719,1257605572.96,2515211146.04]
[3.1,"1.1.3.06.02.01.0.","Transferencias del Gobierno Central a cobrar c/p",0,3772816719,1257605572.96,2515211146.04]
[3.1,"1.1.3.06.02.01.0.11206","Ministerio de Hacienda",0,3772816719,1257605572.96,2515211146.04]
[3.1,"1.1.3.06.02.03.","Transferencias de Instituciones Descentralizadas no Empresariales a cobrar c/p",0,11322830.07,3767268.13,7555561.9400000004]
[3.1,"1.1.3.06.02.03.0.","Transferencias de Instituciones Descentralizadas no Empresariales a cobrar c/p",0,11322830.07,3767268.13,7555561.9400000004]
[3.1,"1.1.3.06.02.03.0.14226","Transferencias de Instituciones Descentralizadas no Empresariales a cobrar c/p (Aporte IFAM Licores Nacionales y Ext)",0,11322830.07,3767268.13,7555561.9400000004]
[3.1,"1.1.3.98.","Otras cuentas a cobrar a corto plazo",2767182.6,4441310.0999999996,2519491.1,4689001.5999999996]
[3.1,"1.1.3.98.01.","Multas, sanciones, remates y confiscaciones de origen no tributario a cobrar c/p",2267182.6,4441310.0999999996,2519491.1,4189001.6]
[3.1,"1.1.3.98.01.01.","Multas y sanciones administrativas a cobrar c/p",2267182.6,4441310.0999999996,2519491.1,4189001.6]
[3.1,"1.1.3.98.01.01.0.","Multas y sanciones administrativas a cobrar c/p",2267182.6,4441310.0999999996,2519491.1,4189001.6]
[3.1,"1.1.3.98.01.01.0.99999","Multas y sanciones administrativas a cobrar c/p",2267182.6,4441310.0999999996,2519491.1,4189001.6]
[3.1,"1.1.3.98.03.","Depósitos en garantía c/p",500000,0,0,500000]
[3.1,"1.1.3.98.03.02.","Depósitos en garantía en el sector público interno c/p",500000,0,0,500000]
[3.1,"1.1.3.98.03.02.0.","Depósitos en garantía en el sector público interno c/p",500000,0,0,500000]
[3.1,"1.1.3.98.03.02.0.99999","Depósitos en garantía en el sector público interno c/p",500000,0,0,500000]
[3.1,"1.1.3.99.","Previsiones para deterioro de cuentas a cobrar a corto plazo *",-175377897.37,0,0,-175377897.37]
[3.1,"1.1.3.99.01.","Previsiones para impuestos a cobrar c/p *",-116983004.63,0,0,-116983004.63]
[3.1,"1.1.3.99.01.02.","Previsiones para impuestos sobre la propiedad a cobrar c/p *",-106283608.29000001,0,0,-106283608.29000001]
[3.1,"1.1.3.99.01.02.0.","Previsiones para impuestos sobre la propiedad a cobrar c/p *",-106283608.29000001,0,0,-106283608.29000001]
[3.1,"1.1.3.99.01.02.0.99999","Previsiones para impuestos sobre la propiedad a cobrar c/p *",-106283608.29000001,0,0,-106283608.29000001]
[3.1,"1.1.3.99.01.03.","Previsiones para impuestos sobre bienes y servicios a cobrar c/p *",-9270015.0099999998,0,0,-9270015.0099999998]
[3.1,"1.1.3.99.01.03.0.","Previsiones para impuestos sobre bienes y servicios a cobrar c/p *",-9270015.0099999998,0,0,-9270015.0099999998]
[3.1,"1.1.3.99.01.03.0.99999","Previsiones para impuestos sobre bienes y servicios a cobrar c/p *",-9270015.0099999998,0,0,-9270015.0099999998]
[3.1,"1.1.3.99.01.99.","Previsiones para otros impuestos a cobrar c/p *",-1429381.33,0,0,-1429381.33]
[3.1,"1.1.3.99.01.99.0.","Previsiones para otros impuestos a cobrar c/p *",-1429381.33,0,0,-1429381.33]
[3.1,"1.1.3.99.01.99.0.99999","Previsiones para otros impuestos a cobrar c/p *",-1429381.33,0,0,-1429381.33]
[3.1,"1.1.3.99.04.","Previsiones para servicios a cobrar c/p *",-51378929.549999997,0,0,-51378929.549999997]
[3.1,"1.1.3.99.04.01.","Previsiones para ventas de servicios a cobrar c/p *",-50738208.689999998,0,0,-50738208.689999998]
[3.1,"1.1.3.99.04.01.0.","Previsiones para ventas de servicios a cobrar c/p *",-50738208.689999998,0,0,-50738208.689999998]
[3.1,"1.1.3.99.04.01.0.99999","Previsiones para ventas de servicios a cobrar c/p *",-50738208.689999998,0,0,-50738208.689999998]
[3.1,"1.1.3.99.04.02.","Previsiones para derechos administrativos a cobrar c/p *",-640720.86,0,0,-640720.86]
[3.1,"1.1.3.99.04.02.0.","Previsiones para derechos administrativos a cobrar c/p *",-640720.86,0,0,-640720.86]
[3.1,"1.1.3.99.04.02.0.99999","Previsiones para derechos administrativos a cobrar c/p *",-640720.86,0,0,-640720.86]
[3.1,"1.1.3.99.05.","Previsiones para ingresos de la propiedad a cobrar c/p *",-7015963.1900000004,0,0,-7015963.1900000004]
[3.1,"1.1.3.99.05.01.","Previsiones para alquileres y derechos sobre bienes a cobrar c/p *",-7015963.1900000004,0,0,-7015963.1900000004]
[3.1,"1.1.3.99.05.01.0.","Previsiones para alquileres y derechos sobre bienes a cobrar c/p *",-7015963.1900000004,0,0,-7015963.1900000004]
[3.1,"1.1.3.99.05.01.0.99999","Previsiones para alquileres y derechos sobre bienes a cobrar c/p *",-7015963.1900000004,0,0,-7015963.1900000004]
[3.1,"1.1.4.","Inventarios",192987092.22,28680156.84,23914522.199999999,197752726.86000001]
[3.1,"1.1.4.01.","Materiales y suministros para consumo y prestación de servicios",192987092.22,28680156.84,23914522.199999999,197752726.86000001]
[3.1,"1.1.4.01.01.","Productos químicos y conexos",21280495.09,800642.7,5597712.6699999999,16483425.119999999]
[3.1,"1.1.4.01.01.01.","Combustibles y lubricantes",17684339.460000001,0,4867463.0199999996,12816876.439999999]
[3.1,"1.1.4.01.01.01.0.","Combustibles y lubricantes",17684339.460000001,0,4867463.0199999996,12816876.439999999]
[3.1,"1.1.4.01.01.01.0.99999","Combustibles y lubricantes",17684339.460000001,0,4867463.0199999996,12816876.439999999]
[3.1,"1.1.4.01.01.02.","Productos farmacéuticos y medicinales",6400,0,6400,0]
[3.1,"1.1.4.01.01.02.0.","Productos farmacéuticos y medicinales",6400,0,6400,0]
[3.1,"1.1.4.01.01.02.0.99999","Productos farmacéuticos y medicinales",6400,0,6400,0]
[3.1,"1.1.4.01.01.04.","Tintas, pinturas y diluyentes",2775593.63,767042.7,453009.75,3089626.58]
[3.1,"1.1.4.01.01.04.0.","Tintas, pinturas y diluyentes",2775593.63,767042.7,453009.75,3089626.58]
[3.1,"1.1.4.01.01.04.0.99999","Tintas, pinturas y diluyentes",2775593.63,767042.7,453009.75,3089626.58]
[3.1,"1.1.4.01.01.99.","Otros productos químicos y conexos",814162,33600,270839.90000000002,576922.1]
[3.1,"1.1.4.01.01.99.0.","Otros productos químicos y conexos",814162,33600,270839.90000000002,576922.1]
[3.1,"1.1.4.01.01.99.0.99999","Otros productos químicos y conexos",814162,33600,270839.90000000002,576922.1]
[3.1,"1.1.4.01.03.","Materiales y productos de uso en la construcción y mantenimiento",30127789.25,3332210.2,2813833.79,30646165.66]
[3.1,"1.1.4.01.03.01.","Materiales y productos metálicos",25238704.199999999,263620,572076.38,24930247.82]
[3.1,"1.1.4.01.03.01.0.","Materiales y productos metálicos",25238704.199999999,263620,572076.38,24930247.82]
[3.1,"1.1.4.01.03.01.0.99999","Materiales y productos metálicos",25238704.199999999,263620,572076.38,24930247.82]
[3.1,"1.1.4.01.03.02.","Materiales y productos minerales y asfálticos",3708677,3004645.2,1918220,4795102.2]
[3.1,"1.1.4.01.03.02.0.","Materiales y productos minerales y asfálticos",3708677,3004645.2,1918220,4795102.2]
[3.1,"1.1.4.01.03.02.0.99999","Materiales y productos minerales y asfálticos",3708677,3004645.2,1918220,4795102.2]
[3.1,"1.1.4.01.03.03.","Madera y sus derivados",896515,63945,309285,651175]
[3.1,"1.1.4.01.03.03.0.","Madera y sus derivados",896515,63945,309285,651175]
[3.1,"1.1.4.01.03.03.0.99999","Madera y sus derivados",896515,63945,309285,651175]
[3.1,"1.1.4.01.03.04.","Materiales y productos eléctricos, telefónicos y de cómputo",135171.56,0,14252.41,120919.15]
[3.1,"1.1.4.01.03.04.0.","Materiales y productos eléctricos, telefónicos y de cómputo",135171.56,0,14252.41,120919.15]
[3.1,"1.1.4.01.03.04.0.99999","Materiales y productos eléctricos, telefónicos y de cómputo",135171.56,0,14252.41,120919.15]
[3.1,"1.1.4.01.03.06.","Materiales y productos de plástico",148721.49,0,0,148721.49]
[3.1,"1.1.4.01.03.06.0.","Materiales y productos de plástico",148721.49,0,0,148721.49]
[3.1,"1.1.4.01.03.06.0.99999","Materiales y productos de plástico",148721.49,0,0,148721.49]
[3.1,"1.1.4.01.04.","Herramientas, repuestos y accesorios",131278007.78,11554099.48,6049097.5599999996,136783009.69999999]
[3.1,"1.1.4.01.04.01.","Herramientas e instrumentos",1233641.5,412156.69,387506.69,1258291.5]
[3.1,"1.1.4.01.04.01.0.","Herramientas e instrumentos",1233641.5,412156.69,387506.69,1258291.5]
[3.1,"1.1.4.01.04.01.0.99999","Herramientas e instrumentos",1233641.5,412156.69,387506.69,1258291.5]
[3.1,"1.1.4.01.04.02.","Repuestos y accesorios Nuevos",130044366.28,11141942.789999999,5661590.8700000001,135524718.19999999]
[3.1,"1.1.4.01.04.02.0.","Repuestos y accesorios Nuevos",130044366.28,11141942.789999999,5661590.8700000001,135524718.19999999]
[3.1,"1.1.4.01.04.02.0.99999","Repuestos y accesorios Nuevos",130044366.28,11141942.789999999,5661590.8700000001,135524718.19999999]
[3.1,"1.1.4.01.99.","Útiles, materiales y suministros diversos",10300800.1,12993204.460000001,9453878.1799999997,13840126.380000001]
[3.1,"1.1.4.01.99.01.","Útiles y materiales de oficina y cómputo",1943168.61,293056.44,509877.48,1726347.57]
[3.1,"1.1.4.01.99.01.0.","Útiles y materiales de oficina y cómputo",1943168.61,293056.44,509877.48,1726347.57]
[3.1,"1.1.4.01.99.01.0.99999","Útiles y materiales de oficina y cómputo",1943168.61,293056.44,509877.48,1726347.57]
[3.1,"1.1.4.01.99.02.","Útiles y materiales médico, hospitalario y de investigación",0,675000,0,675000]
[3.1,"1.1.4.01.99.02.0.","Útiles y materiales médico, hospitalario y de investigación",0,675000,0,675000]
[3.1,"1.1.4.01.99.02.0.99999","Útiles y materiales médico, hospitalario y de investigación",0,675000,0,675000]
[3.1,"1.1.4.01.99.03.","Productos de papel, cartón e impresos",2730589.18,476667.61,616819.09,2590437.7000000002]
[3.1,"1.1.4.01.99.03.0.","Productos de papel, cartón e impresos",2730589.18,476667.61,616819.09,2590437.7000000002]
[3.1,"1.1.4.01.99.03.0.99999","Productos de papel, cartón e impresos",2730589.18,476667.61,616819.09,2590437.7000000002]
[3.1,"1.1.4.01.99.04.","Textiles y vestuario",306936.34999999998,5217922,5121779,403079.35]
[3.1,"1.1.4.01.99.04.0.","Textiles y vestuario",306936.34999999998,5217922,5121779,403079.35]
[3.1,"1.1.4.01.99.04.0.99999","Textiles y vestuario",306936.34999999998,5217922,5121779,403079.35]
[3.1,"1.1.4.01.99.05.","Útiles y materiales de limpieza",2737377.74,1464470.37,1039755.56,3162092.55]
[3.1,"1.1.4.01.99.05.0.","Útiles y materiales de limpieza",2737377.74,1464470.37,1039755.56,3162092.55]
[3.1,"1.1.4.01.99.05.0.99999","Útiles y materiales de limpieza",2737377.74,1464470.37,1039755.56,3162092.55]
[3.1,"1.1.4.01.99.06.","Útiles y materiales de resguardo y seguridad",2042904.22,4609053.04,2081277.05,4570680.21]
[3.1,"1.1.4.01.99.06.0.","Útiles y materiales de resguardo y seguridad",2042904.22,4609053.04,2081277.05,4570680.21]
[3.1,"1.1.4.01.99.06.0.99999","Útiles y materiales de resguardo y seguridad",2042904.22,4609053.04,2081277.05,4570680.21]
[3.1,"1.1.4.01.99.99.","Otros útiles, materiales y suministros diversos",539824,257035,84370,712489]
[3.1,"1.1.4.01.99.99.0.","Otros útiles, materiales y suministros diversos",539824,257035,84370,712489]
[3.1,"1.1.4.01.99.99.0.99999","Otros útiles, materiales y suministros diversos",539824,257035,84370,712489]
[3.1,"1.1.9.","Otros activos a corto plazo",26295622.239999998,22478258,28208536.43,20565343.809999999]
[3.1,"1.1.9.01.","Gastos a devengar a corto plazo",26295622.239999998,22478258,28208536.43,20565343.809999999]
[3.1,"1.1.9.01.01.","Servicios a devengar c/p",26295622.239999998,22478258,28208536.43,20565343.809999999]
[3.1,"1.1.9.01.01.01.","Primas y gastos de seguros a devengar c/p",26295622.239999998,22478258,28208536.43,20565343.809999999]
[3.1,"1.1.9.01.01.01.0.","Primas y gastos de seguros a devengar c/p",26295622.239999998,22478258,28208536.43,20565343.809999999]
[3.1,"1.1.9.01.01.01.0.99999","Primas y gastos de seguros a devengar c/p",26295622.239999998,22478258,28208536.43,20565343.809999999]
[3.1,"1.2.","Activo No Corriente",163010808266.62,214245240.80000001,212137762.00999999,163012915745.41]
[3.1,"1.2.5.","Bienes no concesionados",163010808266.62,214245240.80000001,212137762.00999999,163012915745.41]
[3.1,"1.2.5.01.","Propiedades, planta y equipos explotados",2155163988.3499999,212718185.94999999,201520243.44999999,2166361930.8499999]
[3.1,"1.2.5.01.02.","Edificios",1250873080.6600001,45381425.829999998,40795041.619999997,1255459464.8699999]
[3.1,"1.2.5.01.02.01.","Edificios de oficinas  atención al públ",439702157.05000001,1436968.18,4296068.13,436843057.10000002]
[3.1,"1.2.5.01.02.01.1.","Edificios de oficinas y atención público Valores Origen",258127776.78999999,0,0,258127776.78999999]
[3.1,"1.2.5.01.02.01.1.99999","Edificios de oficinas y atención público Valores Origen",258127776.78999999,0,0,258127776.78999999]
[3.1,"1.2.5.01.02.01.3.","Edificios oficinas y atención público Depreciación Acumulada",-9149119.7400000002,1436968.18,4296068.13,-12008219.689999999]
[3.1,"1.2.5.01.02.01.3.99999","Edificios oficinas y atención público Depreciación Acumulada",-9149119.7400000002,1436968.18,4296068.13,-12008219.689999999]
[3.1,"1.2.5.01.02.01.6.","Edificios oficinas y atención público Porción Terreno Valores Origen",190723500,0,0,190723500]
[3.1,"1.2.5.01.02.01.6.99999","Edificios oficinas y atención público Porción Terreno Valores Origen",190723500,0,0,190723500]
[3.1,"1.2.5.01.02.04.","Bodegas",0,15931666.67,8558333.3399999999,7373333.3300000001]
[3.1,"1.2.5.01.02.04.1.","Bodegas Valores de origen",0,15800000,0,15800000]
[3.1,"1.2.5.01.02.04.1.99999","Bodegas Valores de origen",0,15800000,0,15800000]
[3.1,"1.2.5.01.02.04.3.","Bodegas Depreciaciones acumuladas *",0,131666.67000000001,8558333.3399999999,-8426666.6699999999]
[3.1,"1.2.5.01.02.04.3.99999","Bodegas Depreciaciones acumuladas *",0,131666.67000000001,8558333.3399999999,-8426666.6699999999]
[3.1,"1.2.5.01.02.05.","Locales",297585392.31,7750489.0099999998,4388164.4000000004,300947716.92000002]
[3.1,"1.2.5.01.02.05.1.","Locales Valores de origen",198576095.40000001,0,0,198576095.40000001]
[3.1,"1.2.5.01.02.05.1.99999","Locales Valores de origen",198576095.40000001,0,0,198576095.40000001]
[3.1,"1.2.5.01.02.05.3.","Locales Depreciaciones acumuladas *",-6823353.0899999999,2180339.0099999998,4388164.4000000004,-9031178.4800000004]
[3.1,"1.2.5.01.02.05.3.99999","Locales Depreciaciones acumuladas *",-6823353.0899999999,2180339.0099999998,4388164.4000000004,-9031178.4800000004]
[3.1,"1.2.5.01.02.05.5.","Locales Mejoras",0,5570150,0,5570150]
[3.1,"1.2.5.01.02.05.5.99999","Locales Mejoras",0,5570150,0,5570150]
[3.1,"1.2.5.01.02.05.6.","Locales Porción terreno: valores de origen",105832650,0,0,105832650]
[3.1,"1.2.5.01.02.05.6.99999","Locales Porción terreno: valores de origen",105832650,0,0,105832650]
[3.1,"1.2.5.01.02.99.","Otros edificios",513585531.30000001,20262301.969999999,23552475.75,510295357.51999998]
[3.1,"1.2.5.01.02.99.1.","Otros edificios Valores de origen",362322050.91000003,20205550,20205550,362322050.91000003]
[3.1,"1.2.5.01.02.99.1.99999","Otros edificios Valores de origen",362322050.91000003,20205550,20205550,362322050.91000003]
[3.1,"1.2.5.01.02.99.3.","Otros edificios Depreciaciones acumuladas *",-10193719.609999999,56751.97,3346925.75,-13483893.390000001]
[3.1,"1.2.5.01.02.99.3.99999","Otros edificios Depreciaciones acumuladas *",-10193719.609999999,56751.97,3346925.75,-13483893.390000001]
[3.1,"1.2.5.01.02.99.6.","Otros edificios Porción terreno: valores de origen",161457200,0,0,161457200]
[3.1,"1.2.5.01.02.99.6.99999","Otros edificios Porción terreno: valores de origen",161457200,0,0,161457200]
[3.1,"1.2.5.01.03.","Maquinaria  equipos para la producción",786374545.99000001,88070316.980000004,116719355.09,757725507.88]
[3.1,"1.2.5.01.03.01.","Maquinaria para la construcción",754306983.34000003,81323390.090000004,112078486.51000001,723551886.91999996]
[3.1,"1.2.5.01.03.01.1.","Maquinaria para la construcción Valores de origen",1997638163.9000001,80651295.959999993,0,2078289459.8599999]
[3.1,"1.2.5.01.03.01.1.99999","Maquinaria para la construcción Valores de origen",1997638163.9000001,80651295.959999993,0,2078289459.8599999]
[3.1,"1.2.5.01.03.01.3.","Maq para la construcción Depreciaciones acumuladas",-1243331180.5599999,672094.13,112078486.51000001,-1354737572.9400001]
[3.1,"1.2.5.01.03.01.3.99999","Maq para la construcción Depreciaciones acumuladas",-1243331180.5599999,672094.13,112078486.51000001,-1354737572.9400001]
[3.1,"1.2.5.01.03.03.","Planta eléctrica",3500057.28,0,144157.9,3355899.38]
[3.1,"1.2.5.01.03.03.1.","Planta eléctrica Valores de origen",5189684.8,0,0,5189684.8]
[3.1,"1.2.5.01.03.03.1.99999","Planta eléctrica Valores de origen",5189684.8,0,0,5189684.8]
[3.1,"1.2.5.01.03.03.3.","Planta eléctrica Depreciaciones acumuladas *",-1689627.52,0,144157.9,-1833785.42]
[3.1,"1.2.5.01.03.03.3.99999","Planta eléctrica Depreciaciones acumuladas *",-1689627.52,0,144157.9,-1833785.42]
[3.1,"1.2.5.01.03.06.","Equipos hidráulicos",181634.5,0,8817.2000000000007,172817.3]
[3.1,"1.2.5.01.03.06.1.","Equipos hidráulicos Valores de origen",280058,0,0,280058]
[3.1,"1.2.5.01.03.06.1.99999","Equipos hidráulicos Valores de origen",280058,0,0,280058]
[3.1,"1.2.5.01.03.06.3.","Equipos hidráulicos Depreciaciones acumuladas *",-98423.5,0,8817.2000000000007,-107240.7]
[3.1,"1.2.5.01.03.06.3.99999","Equipos hidráulicos Depreciaciones acumuladas *",-98423.5,0,8817.2000000000007,-107240.7]
[3.1,"1.2.5.01.03.08.","Equipos de medición",948171.86,0,265348.90999999997,682822.95]
[3.1,"1.2.5.01.03.08.1.","Equipos de medición Valores de origen",6734898.7300000004,0,0,6734898.7300000004]
[3.1,"1.2.5.01.03.08.1.99999","Equipos de medición Valores de origen",6734898.7300000004,0,0,6734898.7300000004]
[3.1,"1.2.5.01.03.08.3.","Equipos de medición Depreciaciones acumuladas *",-5786726.8700000001,0,265348.90999999997,-6052075.7800000003]
[3.1,"1.2.5.01.03.08.3.99999","Equipos de medición Depreciaciones acumuladas *",-5786726.8700000001,0,265348.90999999997,-6052075.7800000003]
[3.1,"1.2.5.01.03.09.","Bombas",5578043.8700000001,0,309670.34000000003,5268373.53]
[3.1,"1.2.5.01.03.09.1.","Bombas Valores de origen",7392803,0,0,7392803]
[3.1,"1.2.5.01.03.09.1.99999","Bombas Valores de origen",7392803,0,0,7392803]
[3.1,"1.2.5.01.03.09.3.","Bombas Depreciaciones acumuladas *",-1814759.13,0,309670.34000000003,-2124429.4700000002]
[3.1,"1.2.5.01.03.09.3.99999","Bombas Depreciaciones acumuladas *",-1814759.13,0,309670.34000000003,-2124429.4700000002]
[3.1,"1.2.5.01.03.99.","Otra maquinarias y equipos para la producción",21859655.140000001,6746926.8899999997,3912874.23,24693707.800000001]
[3.1,"1.2.5.01.03.99.1.","Otra maquinarias y equipos para la producción Valor Origen",34343856.07,6686805.8499999996,0,41030661.920000002]
[3.1,"1.2.5.01.03.99.1.99999","Otra maquinarias y equipos para la producción Valor Origen",34343856.07,6686805.8499999996,0,41030661.920000002]
[3.1,"1.2.5.01.03.99.3.","Otra maquinarias y equipos para la producción Depreciación Acumulada",-12484200.93,60121.04,3912874.23,-16336954.119999999]
[3.1,"1.2.5.01.03.99.3.99999","Otra maquinarias y equipos para la producción Depreciación Acumulada",-12484200.93,60121.04,3912874.23,-16336954.119999999]
[3.1,"1.2.5.01.04.","Equipos de transporte, tracción  elevación",35355981.640000001,49444630,30884017.780000001,53916593.859999999]
[3.1,"1.2.5.01.04.01.","Motocicletas",1403960.4,0,203970.4,1199990]
[3.1,"1.2.5.01.04.01.1.","Motocicletas Valores de origen",10870894,0,0,10870894]
[3.1,"1.2.5.01.04.01.1.99999","Motocicletas Valores de origen",10870894,0,0,10870894]
[3.1,"1.2.5.01.04.01.3.","Motocicletas Depreciaciones acumuladas *",-9466933.5999999996,0,203970.4,-9670904]
[3.1,"1.2.5.01.04.01.3.99999","Motocicletas Depreciaciones acumuladas *",-9466933.5999999996,0,203970.4,-9670904]
[3.1,"1.2.5.01.04.02.","Vehículos",33329396.640000001,49444630,30651486.629999999,52122540.009999998]
[3.1,"1.2.5.01.04.02.1.","Vehículos Valores de origen",159744469.75,49444630,0,209189099.75]
[3.1,"1.2.5.01.04.02.1.99999","Vehículos Valores de origen",159744469.75,49444630,0,209189099.75]
[3.1,"1.2.5.01.04.02.3.","Vehículos Depreciaciones acumuladas *",-126415073.11,0,30651486.629999999,-157066559.74000001]
[3.1,"1.2.5.01.04.02.3.99999","Vehículos Depreciaciones acumuladas *",-126415073.11,0,30651486.629999999,-157066559.74000001]
[3.1,"1.2.5.01.04.99.","Otros equipos de transporte",622624.6,0,28560.75,594063.85]
[3.1,"1.2.5.01.04.99.1.","Otros equipos de transporte Valores de origen",685458.25,0,0,685458.25]
[3.1,"1.2.5.01.04.99.1.99999","Otros equipos de transporte Valores de origen",685458.25,0,0,685458.25]
[3.1,"1.2.5.01.04.99.3.","Otros equipos transporte Depreciaciones acumuladas *",-62833.65,0,28560.75,-91394.4]
[3.1,"1.2.5.01.04.99.3.99999","Otros equipos transporte Depreciaciones acumuladas *",-62833.65,0,28560.75,-91394.4]
[3.1,"1.2.5.01.05.","Equipos de comunicación",18834276.370000001,2140124,1427732.27,19546668.100000001]
[3.1,"1.2.5.01.05.01.","Antenas  radares",617686.27,1586480,23346.28,2180819.9900000002]
[3.1,"1.2.5.01.05.01.1.","Antenas y radares Valores de origen",803325.36,1586480,0,2389805.36]
[3.1,"1.2.5.01.05.01.1.99999","Antenas y radares Valores de origen",803325.36,1586480,0,2389805.36]
[3.1,"1.2.5.01.05.01.3.","Antenas y radares Depreciaciones acumuladas *",-185639.09,0,23346.28,-208985.37]
[3.1,"1.2.5.01.05.01.3.99999","Antenas y radares Depreciaciones acumuladas *",-185639.09,0,23346.28,-208985.37]
[3.1,"1.2.5.01.05.02.","Equipos de telefonía",715883.61,0,76157.850000000006,639725.76]
[3.1,"1.2.5.01.05.02.1.","Equipos de telefonía Valores de origen",3458113.3,0,0,3458113.3]
[3.1,"1.2.5.01.05.02.1.99999","Equipos de telefonía Valores de origen",3458113.3,0,0,3458113.3]
[3.1,"1.2.5.01.05.02.3.","Equipos de telefonía Depreciaciones acumuladas *",-2742229.69,0,76157.850000000006,-2818387.54]
[3.1,"1.2.5.01.05.02.3.99999","Equipos de telefonía Depreciaciones acumuladas *",-2742229.69,0,76157.850000000006,-2818387.54]
[3.1,"1.2.5.01.05.04.","Equipos de audio  video",12505413.4,553644,1107197.49,11951859.91]
[3.1,"1.2.5.01.05.04.1.","Equipos de audio y video Valores de origen",22576099.77,553644,0,23129743.77]
[3.1,"1.2.5.01.05.04.1.99999","Equipos de audio y video Valores de origen",22576099.77,553644,0,23129743.77]
[3.1,"1.2.5.01.05.04.3.","Equipos de audio y video Depreciaciones acumuladas",-10070686.369999999,0,1107197.49,-11177883.859999999]
[3.1,"1.2.5.01.05.04.3.99999","Equipos de audio y video Depreciaciones acumuladas",-10070686.369999999,0,1107197.49,-11177883.859999999]
[3.1,"1.2.5.01.05.99.","Otros equipos de comunicación",4995293.09,0,221030.65,4774262.4400000004]
[3.1,"1.2.5.01.05.99.1.","Otros equipos de comunicación Valores de origen",5304736,0,0,5304736]
[3.1,"1.2.5.01.05.99.1.99999","Otros equipos de comunicación Valores de origen",5304736,0,0,5304736]
[3.1,"1.2.5.01.05.99.3.","Otros equipos de comunicaciónDepreciaciones acumuladas",-309442.90999999997,0,221030.65,-530473.56000000006]
[3.1,"1.2.5.01.05.99.3.99999","Otros equipos de comunicaciónDepreciaciones acumuladas",-309442.90999999997,0,221030.65,-530473.56000000006]
[3.1,"1.2.5.01.06.","Equipos  mobiliario de oficina",33924782.57,6554791.0700000003,4373207.45,36106366.189999998]
[3.1,"1.2.5.01.06.01.","Archivadores, bibliotecas  armarios",6140371.3799999999,380518.34,560351.99,5960537.7300000004]
[3.1,"1.2.5.01.06.01.1.","Archivadores, bibliotecas y armarios Valor Origen",17592360.27,379225,0,17971585.27]
[3.1,"1.2.5.01.06.01.1.99999","Archivadores, bibliotecas y armarios Valor Origen",17592360.27,379225,0,17971585.27]
[3.1,"1.2.5.01.06.01.3.","Archivadores bibliotecas y armarios Deprec Acum",-11451988.890000001,1293.3399999999999,560351.99,-12011047.539999999]
[3.1,"1.2.5.01.06.01.3.99999","Archivadores bibliotecas y armarios Deprec Acum",-11451988.890000001,1293.3399999999999,560351.99,-12011047.539999999]
[3.1,"1.2.5.01.06.02.","Mesas  escritorios",7882463.8700000001,708311,586657.98,8004116.8899999997]
[3.1,"1.2.5.01.06.02.1.","Mesas y escritorios Valores de origen",14653856.369999999,708311,0,15362167.369999999]
[3.1,"1.2.5.01.06.02.1.99999","Mesas y escritorios Valores de origen",14653856.369999999,708311,0,15362167.369999999]
[3.1,"1.2.5.01.06.02.3.","Mesas y escritorios Depreciaciones acumuladas *",-6771392.5,0,586657.98,-7358050.4800000004]
[3.1,"1.2.5.01.06.02.3.99999","Mesas y escritorios Depreciaciones acumuladas *",-6771392.5,0,586657.98,-7358050.4800000004]
[3.1,"1.2.5.01.06.03.","Sillas  bancos",5051640.6900000004,277396,384008.43,4945028.26]
[3.1,"1.2.5.01.06.03.1.","Sillas y bancos Valores de origen",9996276.9199999999,277396,0,10273672.92]
[3.1,"1.2.5.01.06.03.1.99999","Sillas y bancos Valores de origen",9996276.9199999999,277396,0,10273672.92]
[3.1,"1.2.5.01.06.03.3.","Sillas y bancos Depreciaciones acumuladas *",-4944636.2300000004,0,384008.43,-5328644.66]
[3.1,"1.2.5.01.06.03.3.99999","Sillas y bancos Depreciaciones acumuladas *",-4944636.2300000004,0,384008.43,-5328644.66]
[3.1,"1.2.5.01.06.05.","Equipos de ventilación",10651401.060000001,3377208.34,2027615.65,12000993.75]
[3.1,"1.2.5.01.06.05.1.","Equipos de ventilación Valores de origen",19490955,3362500,0,22853455]
[3.1,"1.2.5.01.06.05.1.99999","Equipos de ventilación Valores de origen",19490955,3362500,0,22853455]
[3.1,"1.2.5.01.06.05.3.","Equipos de ventilación Depreciaciones acumuladas *",-8839553.9399999995,14708.34,2027615.65,-10852461.25]
[3.1,"1.2.5.01.06.05.3.99999","Equipos de ventilación Depreciaciones acumuladas *",-8839553.9399999995,14708.34,2027615.65,-10852461.25]
[3.1,"1.2.5.01.06.99.","Otros equipos  mobiliario",4198905.57,1811357.39,814573.4,5195689.5599999996]
[3.1,"1.2.5.01.06.99.1.","Otros equipos y mobiliario Valores de origen",8129156.3399999999,1809524,0,9938680.3399999999]
[3.1,"1.2.5.01.06.99.1.99999","Otros equipos y mobiliario Valores de origen",8129156.3399999999,1809524,0,9938680.3399999999]
[3.1,"1.2.5.01.06.99.3.","Otros equipos y mobiliario Depreciaciones acumuladas",-3930250.77,1833.39,814573.4,-4742990.78]
[3.1,"1.2.5.01.06.99.3.99999","Otros equipos y mobiliario Depreciaciones acumuladas",-3930250.77,1833.39,814573.4,-4742990.78]
[3.1,"1.2.5.01.07.","Equipos para computación",25812942.670000002,7718387.0700000003,5888815.9000000004,27642513.84]
[3.1,"1.2.5.01.07.01.","Computadoras",15771655.710000001,5567670.2000000002,3606288.7,17733037.210000001]
[3.1,"1.2.5.01.07.01.1.","Computadoras Valores de origen",62424668.5,5493835,0,67918503.5]
[3.1,"1.2.5.01.07.01.1.99999","Computadoras Valores de origen",62424668.5,5493835,0,67918503.5]
[3.1,"1.2.5.01.07.01.3.","Computadoras Depreciaciones acumuladas *",-46653012.789999999,73835.199999999997,3606288.7,-50185466.289999999]
[3.1,"1.2.5.01.07.01.3.99999","Computadoras Depreciaciones acumuladas *",-46653012.789999999,73835.199999999997,3606288.7,-50185466.289999999]
[3.1,"1.2.5.01.07.02.","Impresoras",4395203.12,483046,957146.06,3921103.06]
[3.1,"1.2.5.01.07.02.1.","Impresoras Valores de origen",18223755.879999999,483046,0,18706801.879999999]
[3.1,"1.2.5.01.07.02.1.99999","Impresoras Valores de origen",18223755.879999999,483046,0,18706801.879999999]
[3.1,"1.2.5.01.07.02.3.","Impresoras Depreciaciones acumuladas *",-13828552.76,0,957146.06,-14785698.82]
[3.1,"1.2.5.01.07.02.3.99999","Impresoras Depreciaciones acumuladas *",-13828552.76,0,957146.06,-14785698.82]
[3.1,"1.2.5.01.07.04.","Monitores",2262347.1800000002,984321.87,690121.53,2556547.52]
[3.1,"1.2.5.01.07.04.1.","Monitores Valores de origen",8849612.7400000002,616590,0,9466202.7400000002]
[3.1,"1.2.5.01.07.04.1.99999","Monitores Valores de origen",8849612.7400000002,616590,0,9466202.7400000002]
[3.1,"1.2.5.01.07.04.3.","Monitores Depreciaciones acumuladas *",-6587265.5599999996,367731.87,690121.53,-6909655.2199999997]
[3.1,"1.2.5.01.07.04.3.99999","Monitores Depreciaciones acumuladas *",-6587265.5599999996,367731.87,690121.53,-6909655.2199999997]
[3.1,"1.2.5.01.07.05.","UPS",161609.03,63274,31199.97,193683.06]
[3.1,"1.2.5.01.07.05.1.","UPS Valores de origen",1260960.6499999999,63274,0,1324234.6499999999]
[3.1,"1.2.5.01.07.05.1.99999","UPS Valores de origen",1260960.6499999999,63274,0,1324234.6499999999]
[3.1,"1.2.5.01.07.05.3.","UPS Depreciaciones acumuladas *",-1099351.6200000001,0,31199.97,-1130551.5900000001]
[3.1,"1.2.5.01.07.05.3.99999","UPS Depreciaciones acumuladas *",-1099351.6200000001,0,31199.97,-1130551.5900000001]
[3.1,"1.2.5.01.07.99.","Otros equipos de cómputo",3222127.63,620075,604059.64,3238142.99]
[3.1,"1.2.5.01.07.99.1.","Otros equipos de cómputo Valores de origen",8565461.8399999999,620075,0,9185536.8399999999]
[3.1,"1.2.5.01.07.99.1.99999","Otros equipos de cómputo Valores de origen",8565461.8399999999,620075,0,9185536.8399999999]
[3.1,"1.2.5.01.07.99.3.","Otros equipos de cómputo Depreciaciones acumuladas *",-5343334.21,0,604059.64,-5947393.8499999996]
[3.1,"1.2.5.01.07.99.3.99999","Otros equipos de cómputo Depreciaciones acumuladas *",-5343334.21,0,604059.64,-5947393.8499999996]
[3.1,"1.2.5.01.09.","Equipos y  mobiliario educacional deportivo  recreativo",0,12633214.119999999,631660.71,12001553.41]
[3.1,"1.2.5.01.09.05.","Equipos de entretenimiento",0,12633214.119999999,631660.71,12001553.41]
[3.1,"1.2.5.01.09.05.1.","Equipos de entretenimiento Valores de origen",0,12633214.119999999,0,12633214.119999999]
[3.1,"1.2.5.01.09.05.1.99999","Equipos de entretenimiento Valores de origen",0,12633214.119999999,0,12633214.119999999]
[3.1,"1.2.5.01.09.05.3.","Equip de entretenimiento Depreciaciones acumuladas",0,0,631660.71,-631660.71]
[3.1,"1.2.5.01.09.05.3.99999","Equip de entretenimiento Depreciaciones acumuladas",0,0,631660.71,-631660.71]
[3.1,"1.2.5.01.10.","Equipos de seguridad, orden, vigilancia y control público",1566953.8,775296.88,603054.81999999995,1739195.86]
[3.1,"1.2.5.01.10.01.","Equipos de protección contra incendios",1215568.82,210000,41017.57,1384551.25]
[3.1,"1.2.5.01.10.01.1.","Equipos de protección contra incendios Valores Origen",1350632,210000,0,1560632]
[3.1,"1.2.5.01.10.01.1.99999","Equipos de protección contra incendios Valores Origen",1350632,210000,0,1560632]
[3.1,"1.2.5.01.10.01.3.","Equipos de protección contra incendios Depreciación Acumulada",-135063.18,0,41017.57,-176080.75]
[3.1,"1.2.5.01.10.01.3.99999","Equipos de protección contra incendios Depreciación Acumulada",-135063.18,0,41017.57,-176080.75]
[3.1,"1.2.5.01.10.03.","Armas",21562.49,0,4687.5,16874.990000000002]
[3.1,"1.2.5.01.10.03.1.","Armas Valores de origen",225000,0,0,225000]
[3.1,"1.2.5.01.10.03.1.99999","Armas Valores de origen",225000,0,0,225000]
[3.1,"1.2.5.01.10.03.3.","Armas Depreciaciones acumuladas *",-203437.51,0,4687.5,-208125.01]
[3.1,"1.2.5.01.10.03.3.99999","Armas Depreciaciones acumuladas *",-203437.51,0,4687.5,-208125.01]
[3.1,"1.2.5.01.10.99.","Otros equipos de seguridad, orden, vigilancia y control público",329822.49,565296.88,557349.75,337769.62]
[3.1,"1.2.5.01.10.99.1.","Otros Equipos seguridad orden vigilancia control público Valor rigen",758241.92,560625,0,1318866.92]
[3.1,"1.2.5.01.10.99.1.99999","Otros Equipos seguridad orden vigilancia control público Valor rigen",758241.92,560625,0,1318866.92]
[3.1,"1.2.5.01.10.99.3.","Otros Equipos seguridad orden vigilancia control Público Depreciacion Acumulada",-428419.43,4671.88,557349.75,-981097.3]
[3.1,"1.2.5.01.10.99.3.99999","Otros Equipos seguridad orden vigilancia control Público Depreciacion Acumulada",-428419.43,4671.88,557349.75,-981097.3]
[3.1,"1.2.5.01.99.","Maquinarias, equipos  mobiliarios diversos",2421424.65,0,197357.81,2224066.84]
[3.1,"1.2.5.01.99.02.","Equipos  mobiliario doméstico",464154.19,0,54512.4,409641.79]
[3.1,"1.2.5.01.99.02.1.","Equipos y mobiliario doméstico Valores de origen",1551357.89,0,0,1551357.89]
[3.1,"1.2.5.01.99.02.1.99999","Equipos y mobiliario doméstico Valores de origen",1551357.89,0,0,1551357.89]
[3.1,"1.2.5.01.99.02.3.","Equip y Mobiliario doméstico Depreciaciones acumuladas",-1087203.7,0,54512.4,-1141716.1000000001]
[3.1,"1.2.5.01.99.02.3.99999","Equip y Mobiliario doméstico Depreciaciones acumuladas",-1087203.7,0,54512.4,-1141716.1000000001]
[3.1,"1.2.5.01.99.03.","Equipos fotográficos  de revelado",1957270.46,0,142845.41,1814425.05]
[3.1,"1.2.5.01.99.03.1.","Equipos fotográficos y de revelado Valores origen",3870352.18,0,0,3870352.18]
[3.1,"1.2.5.01.99.03.1.99999","Equipos fotográficos y de revelado Valores origen",3870352.18,0,0,3870352.18]
[3.1,"1.2.5.01.99.03.3.","Equip fotográficos y revelado Depreciaioón Acumulada",-1913081.72,0,142845.41,-2055927.13]
[3.1,"1.2.5.01.99.03.3.99999","Equip fotográficos y revelado Depreciaioón Acumulada",-1913081.72,0,142845.41,-2055927.13]
[3.1,"1.2.5.04.","Bienes de infraestructura y de beneficio y uso público en servicio",160765498081.76001,0,0,160765498081.76001]
[3.1,"1.2.5.04.01.","Vías de comunicación terrestre",156731927507.54001,0,0,156731927507.54001]
[3.1,"1.2.5.04.01.01.","Carreteras  caminos",143329792712.5,0,0,143329792712.5]
[3.1,"1.2.5.04.01.01.1.","Carreteras y caminos Valores de origen",22435224766.720001,0,0,22435224766.720001]
[3.1,"1.2.5.04.01.01.1.99999","Carreteras y caminos Valores de origen",22435224766.720001,0,0,22435224766.720001]
[3.1,"1.2.5.04.01.01.6.","Carreteras y caminos Porción terreno: Valor Origen",120894567945.78,0,0,120894567945.78]
[3.1,"1.2.5.04.01.01.6.99999","Carreteras y caminos Porción terreno: Valor Origen",120894567945.78,0,0,120894567945.78]
[3.1,"1.2.5.04.01.03.","Puentes",13385469370.68,0,0,13385469370.68]
[3.1,"1.2.5.04.01.03.1.","Puentes Valores de origen",7882316153.8999996,0,0,7882316153.8999996]
[3.1,"1.2.5.04.01.03.1.99999","Puentes Valores de origen",7882316153.8999996,0,0,7882316153.8999996]
[3.1,"1.2.5.04.01.03.6.","Puentes Porción terreno: valores de origen",5503153216.7799997,0,0,5503153216.7799997]
[3.1,"1.2.5.04.01.03.6.99999","Puentes Porción terreno: valores de origen",5503153216.7799997,0,0,5503153216.7799997]
[3.1,"1.2.5.04.01.99.","Otras vías de comunicación terrestre",16665424.359999999,0,0,16665424.359999999]
[3.1,"1.2.5.04.01.99.1.","Otras vías de comunicación terrestre  Valores Origen",16665424.359999999,0,0,16665424.359999999]
[3.1,"1.2.5.04.01.99.1.99999","Otras vías de comunicación terrestre  Valores Origen",16665424.359999999,0,0,16665424.359999999]
[3.1,"1.2.5.04.03.","Centrales  redes de comunicación  energía",4013723664.2199998,0,0,4013723664.2199998]
[3.1,"1.2.5.04.03.01.","Centrales  redes acuíferas, cloacales  pluviales",4013723664.2199998,0,0,4013723664.2199998]
[3.1,"1.2.5.04.03.01.1.","Centrales  redes acuíferas, cloacales  pluviales Valor Origen",4013723664.2199998,0,0,4013723664.2199998]
[3.1,"1.2.5.04.03.01.1.99999","Centrales  redes acuíferas, cloacales  pluviales Valor Origen",4013723664.2199998,0,0,4013723664.2199998]
[3.1,"1.2.5.04.99.","Otros bienes de infraestructura y de beneficio y uso público en servicio",19846910,0,0,19846910]
[3.1,"1.2.5.04.99.99.","Otros bienes de infraestructura y de beneficio y uso público diversos",19846910,0,0,19846910]
[3.1,"1.2.5.04.99.99.1.","Otros bienes de infraestructura y de beneficio y uso público diversos Valores de origen",19846910,0,0,19846910]
[3.1,"1.2.5.04.99.99.1.99999","Otros bienes de infraestructura y de beneficio y uso público diversos Valores de origen",19846910,0,0,19846910]
[3.1,"1.2.5.08.","Bienes intangibles no concesionados",12565235.460000001,1527054.85,10617518.560000001,3474771.75]
[3.1,"1.2.5.08.03.","Software  programas",12565235.460000001,997294.85,10087758.560000001,3474771.75]
[3.1,"1.2.5.08.03.01.","Software y programas Valores de origen",12565235.460000001,997294.85,10087758.560000001,3474771.75]
[3.1,"1.2.5.08.03.01.0.","Software y programas Valores de origen",12565235.460000001,997294.85,10087758.560000001,3474771.75]
[3.1,"1.2.5.08.03.01.0.99999","Software y programas Valores de origen",12565235.460000001,997294.85,10087758.560000001,3474771.75]
[3.1,"1.2.5.08.99.","Otros bienes intangibles",0,529760,529760,0]
[3.1,"1.2.5.08.99.01.","Otros bienes intangibles Valores de origen",0,529760,529760,0]
[3.1,"1.2.5.08.99.01.0.","Otros bienes intangibles Valores de origen",0,529760,529760,0]
[3.1,"1.2.5.08.99.01.0.99999","Otros bienes intangibles Valores de origen",0,529760,529760,0]
[3.1,"1.2.5.99.","Bienes no concesionados en proceso de producción",77580961.049999997,0,0,77580961.049999997]
[3.1,"1.2.5.99.08.","Bienes intangibles en proceso de producción",77580961.049999997,0,0,77580961.049999997]
[3.1,"1.2.5.99.08.03.","Producción en proceso de software y programas",77580961.049999997,0,0,77580961.049999997]
[3.1,"1.2.5.99.08.03.0.","Producción en proceso de software y programas",77580961.049999997,0,0,77580961.049999997]
[3.1,"1.2.5.99.08.03.0.99999","Producción en proceso de software y programas",77580961.049999997,0,0,77580961.049999997]
[3.1,"2.","PASIVO",1698526087.6199999,3012373214,3204364062.1599998,1890516935.78]
[3.1,"2.1.","Pasivo Corriente",152486979.41,2224451202.9200001,2888451010.0999999,816486786.59000003]
[3.1,"2.1.1.","Deudas a corto plazo",86261732.549999997,2011663149.4200001,2198367204.1900001,272965787.31999999]
[3.1,"2.1.1.01.","Deudas comerciales a corto plazo",1108985.7,1258761223.6099999,1428856468.51,171204230.59999999]
[3.1,"2.1.1.01.01.","Deudas por adquisición de inventarios c/p",1108985.7,280004903.17000002,298265729.67000002,19369812.199999999]
[3.1,"2.1.1.01.01.01.","Deudas comerciales por adquisición de materiales y suministros para consumo y prestación de servicios c/p",1108985.7,230004903.16999999,248265729.66999999,19369812.199999999]
[3.1,"2.1.1.01.01.01.0.","Deudas comerciales por adquisición de materiales y suministros para consumo y prestación de servicios c/p",1108985.7,230004903.16999999,248265729.66999999,19369812.199999999]
[3.1,"2.1.1.01.01.01.0.99999","Deudas comerciales por adquisición de materiales y suministros para consumo y prestación de servicios c/p",1108985.7,230004903.16999999,248265729.66999999,19369812.199999999]
[3.1,"2.1.1.01.01.02.","Deudas comerciales por adquisición de bienes para la venta c/p",0,50000000,50000000,0]
[3.1,"2.1.1.01.01.02.0.","Deudas comerciales por adquisición de bienes para la venta c/p",0,50000000,50000000,0]
[3.1,"2.1.1.01.01.02.0.99999","Deudas comerciales por adquisición de bienes para la venta c/p",0,50000000,50000000,0]
[3.1,"2.1.1.01.02.","Deudas por adquisición de bienes distintos de inventarios c/p",0,731351227.08000004,877163902.58000004,145812675.5]
[3.1,"2.1.1.01.02.01.","Deudas comerciales por adquisición de propiedades, planta y equipos en explotación c/p",0,27830783.120000001,27830783.120000001,0]
[3.1,"2.1.1.01.02.01.0.","Deudas comerciales por adquisición de propiedades, planta y equipos en explotación c/p",0,27830783.120000001,27830783.120000001,0]
[3.1,"2.1.1.01.02.01.0.99999","Deudas comerciales por adquisición de propiedades, planta y equipos en explotación c/p",0,27830783.120000001,27830783.120000001,0]
[3.1,"2.1.1.01.02.04.","Deudas comerciales por adquisición de bienes de infraestructura y de beneficio y uso público c/p",0,701302486.13,847115161.63,145812675.5]
[3.1,"2.1.1.01.02.04.0.","Deudas comerciales por adquisición de bienes de infraestructura y de beneficio y uso público c/p",0,701302486.13,847115161.63,145812675.5]
[3.1,"2.1.1.01.02.04.0.99999","Deudas comerciales por adquisición de bienes de infraestructura y de beneficio y uso público c/p",0,701302486.13,847115161.63,145812675.5]
[3.1,"2.1.1.01.02.08.","Deudas comerciales por adquisición de bienes intangibles c/p",0,2217957.83,2217957.83,0]
[3.1,"2.1.1.01.02.08.0.","Deudas comerciales por adquisición de bienes intangibles c/p",0,2217957.83,2217957.83,0]
[3.1,"2.1.1.01.02.08.0.99999","Deudas comerciales por adquisición de bienes intangibles c/p",0,2217957.83,2217957.83,0]
[3.1,"2.1.1.01.04.","Deudas por adquisición de servicios c/p",0,247405093.36000001,253426836.25999999,6021742.9000000004]
[3.1,"2.1.1.01.04.01.","Deudas comerciales por alquileres y derechos sobre bienes c/p",0,76424440.799999997,76424440.799999997,0]
[3.1,"2.1.1.01.04.01.0.","Deudas comerciales por alquileres y derechos sobre bienes c/p",0,76424440.799999997,76424440.799999997,0]
[3.1,"2.1.1.01.04.01.0.99999","Deudas comerciales por alquileres y derechos sobre bienes c/p",0,76424440.799999997,76424440.799999997,0]
[3.1,"2.1.1.01.04.02.","Deudas comerciales por servicios básicos c/p",0,69865393.760000005,69865393.760000005,0]
[3.1,"2.1.1.01.04.02.0.","Deudas comerciales por servicios básicos c/p",0,69865393.760000005,69865393.760000005,0]
[3.1,"2.1.1.01.04.02.0.99999","Deudas comerciales por servicios básicos c/p",0,69865393.760000005,69865393.760000005,0]
[3.1,"2.1.1.01.04.03.","Deudas comerciales por servicios comerciales y financieros c/p",0,7318476.7000000002,7318476.7000000002,0]
[3.1,"2.1.1.01.04.03.0.","Deudas comerciales por servicios comerciales y financieros c/p",0,7318476.7000000002,7318476.7000000002,0]
[3.1,"2.1.1.01.04.03.0.99999","Deudas comerciales por servicios comerciales y financieros c/p",0,7318476.7000000002,7318476.7000000002,0]
[3.1,"2.1.1.01.04.04.","Deudas comerciales por servicios de gestión y apoyo c/p",0,51490355.310000002,54995998.210000001,3505642.9]
[3.1,"2.1.1.01.04.04.0.","Deudas comerciales por servicios de gestión y apoyo c/p",0,51490355.310000002,54995998.210000001,3505642.9]
[3.1,"2.1.1.01.04.04.0.99999","Deudas comerciales por servicios de gestión y apoyo c/p",0,51490355.310000002,54995998.210000001,3505642.9]
[3.1,"2.1.1.01.04.05.","Deudas comerciales por gastos de viaje y transporte c/p",0,3709190,3709190,0]
[3.1,"2.1.1.01.04.05.0.","Deudas comerciales por gastos de viaje y transporte c/p",0,3709190,3709190,0]
[3.1,"2.1.1.01.04.05.0.99999","Deudas comerciales por gastos de viaje y transporte c/p",0,3709190,3709190,0]
[3.1,"2.1.1.01.04.06.","Deudas comerciales por seguros, reaseguros y otras obligaciones c/p",0,6459311,6459311,0]
[3.1,"2.1.1.01.04.06.0.","Deudas comerciales por seguros, reaseguros y otras obligaciones c/p",0,6459311,6459311,0]
[3.1,"2.1.1.01.04.06.0.99999","Deudas comerciales por seguros, reaseguros y otras obligaciones c/p",0,6459311,6459311,0]
[3.1,"2.1.1.01.04.07.","Deudas comerciales por capacitación y protocolo c/p",0,10860000,10860000,0]
[3.1,"2.1.1.01.04.07.0.","Deudas comerciales por capacitación y protocolo c/p",0,10860000,10860000,0]
[3.1,"2.1.1.01.04.07.0.99999","Deudas comerciales por capacitación y protocolo c/p",0,10860000,10860000,0]
[3.1,"2.1.1.01.04.08.","Deudas comerciales por mantenimiento y reparaciones c/p",0,21277925.789999999,23794025.789999999,2516100]
[3.1,"2.1.1.01.04.08.0.","Deudas comerciales por mantenimiento y reparaciones c/p",0,21277925.789999999,23794025.789999999,2516100]
[3.1,"2.1.1.01.04.08.0.99999","Deudas comerciales por mantenimiento y reparaciones c/p",0,21277925.789999999,23794025.789999999,2516100]
[3.1,"2.1.1.02.","Deudas sociales y fiscales a corto plazo",21545672.420000002,554992288.67999995,609015678.88999999,75569062.629999995]
[3.1,"2.1.1.02.01.","Deudas por beneficios a los empleados c/p",7857628.0099999998,516635177.13,577731201.74000001,68953652.620000005]
[3.1,"2.1.1.02.01.01.","Remuneraciones básicas y eventuales a pagar c/p",699494.06,433711819.75999999,443748079.45999998,10735753.76]
[3.1,"2.1.1.02.01.01.1.","Remuneraciones",699494.06,433711819.75999999,443748079.45999998,10735753.76]
[3.1,"2.1.1.02.01.01.1.99999","Remuneraciones",699494.06,433711819.75999999,443748079.45999998,10735753.76]
[3.1,"2.1.1.02.01.03.","Incentivos salariales a pagar c/p",7158133.9500000002,1505084.57,36424858.880000003,42077908.259999998]
[3.1,"2.1.1.02.01.03.3.","Decimotercer mes a pagar c/p",7158133.9500000002,1505084.57,36424858.880000003,42077908.259999998]
[3.1,"2.1.1.02.01.03.3.99999","Decimotercer mes a pagar c/p",7158133.9500000002,1505084.57,36424858.880000003,42077908.259999998]
[3.1,"2.1.1.02.01.04.","Contribuciones patronales al desarrollo y la seguridad social a pagar c/p",0,81418272.799999997,97558263.400000006,16139990.6]
[3.1,"2.1.1.02.01.04.0.","Contribuciones patronales al desarrollo y la seguridad social a pagar c/p",0,81418272.799999997,97558263.400000006,16139990.6]
[3.1,"2.1.1.02.01.04.0.14120","Contribuciones patronales al desarrollo y la seguridad social a pagar c/p (Aporte Patronal FCL - CCSS)",0,81418272.799999997,97558263.400000006,16139990.6]
[3.1,"2.1.1.02.01.04.0.31104","Contribuciones patronales al desarrollo y la seguridad social a pagar c/p (Cont. Patronal BPDC)",0,0,0,0]
[3.1,"2.1.1.02.02.","Deudas fiscales c/p",13688044.41,38357111.549999997,31284477.16,6615410.0199999996]
[3.1,"2.1.1.02.02.02.","Retenciones de impuestos nacionales a pagar c/p",13688044.41,33081570.449999999,26008936.059999999,6615410.0199999996]
[3.1,"2.1.1.02.02.02.0.","Retenciones de impuestos nacionales a pagar c/p",13688044.41,33081570.449999999,26008936.059999999,6615410.0199999996]
[3.1,"2.1.1.02.02.02.0.11206","Ministerio de Hacienda (MHD)",13688044.41,33081570.449999999,26008936.059999999,6615410.0199999996]
[3.1,"2.1.1.02.02.04.","Retenciones de impuestos entidades relacionadas a pagar c/p",0,5275541.0999999996,5275541.0999999996,0]
[3.1,"2.1.1.02.02.04.0.","Retenciones de impuestos entidades relacionadas a pagar c/p",0,5275541.0999999996,5275541.0999999996,0]
[3.1,"2.1.1.02.02.04.0.12784","Retenciones de impuestos entidades relacionadas a pagar c/p",0,5275541.0999999996,5275541.0999999996,0]
[3.1,"2.1.1.03.","Transferencias a pagar a corto plazo",63607074.43,56381407.850000001,18966827.510000002,26192494.09]
[3.1,"2.1.1.03.02.","Transferencias al sector público interno a pagar c/p",63607074.43,56381407.850000001,18966827.510000002,26192494.09]
[3.1,"2.1.1.03.02.01.","Transferencias al Gobierno Central a pagar c/p",983027.41,0,0,983027.41]
[3.1,"2.1.1.03.02.01.0.","Transferencias al Gobierno Central a pagar c/p",983027.41,0,0,983027.41]
[3.1,"2.1.1.03.02.01.0.11206","Transferencias al Gobierno Central a pagar c/p",648323.05000000005,0,0,648323.05000000005]
[3.1,"2.1.1.03.02.01.0.11219","Transferencias al Gobierno Central a pagar c/p",334704.36,0,0,334704.36]
[3.1,"2.1.1.03.02.02.","Transferencias a Órganos Desconcentrados a pagar c/p",2002155.83,0,0,2002155.83]
[3.1,"2.1.1.03.02.02.0.","Transferencias a Órganos Desconcentrados a pagar c/p",2002155.83,0,0,2002155.83]
[3.1,"2.1.1.03.02.02.0.12553","Transferencias a Órganos Desconcentrados a pagar c/p",53127.68,0,0,53127.68]
[3.1,"2.1.1.03.02.02.0.12581","Consejo Nacional de Personas con Discapacidad - CONAPDIS",652382.05000000005,0,0,652382.05000000005]
[3.1,"2.1.1.03.02.02.0.12784","Transferencias a Órganos Desconcentrados a pagar c/p",1296646.1000000001,0,0,1296646.1000000001]
[3.1,"2.1.1.03.02.03.","Transferencias a Instituciones Descentralizadas no Empresariales a pagar c/p",56381407.850000001,56381407.850000001,18966827.510000002,18966827.510000002]
[3.1,"2.1.1.03.02.03.0.","Transferencias a Instituciones Descentralizadas no Empresariales a pagar c/p",56381407.850000001,56381407.850000001,18966827.510000002,18966827.510000002]
[3.1,"2.1.1.03.02.03.0.14253","Transferencias a Instituciones Descentralizadas no Empresariales a pagar c/p",56381407.850000001,56381407.850000001,18966827.510000002,18966827.510000002]
[3.1,"2.1.1.03.02.99.","Transferencias a otras Instituciones de Gobiernos Locales a pagar c/p",4240483.34,0,0,4240483.34]
[3.1,"2.1.1.03.02.99.0.","Transferencias a otras Instituciones de Gobiernos Locales a pagar c/p",4240483.34,0,0,4240483.34]
[3.1,"2.1.1.03.02.99.0.15910","Comités Cantonales de Deportes y Recreación",3914292.31,0,0,3914292.31]
[3.1,"2.1.1.03.02.99.0.15980","Unión Nacional de Gobiernos Locales",326191.03000000003,0,0,326191.03000000003]
[3.1,"2.1.1.99.","Otras deudas a corto plazo",0,141528229.28,141528229.28,0]
[3.1,"2.1.1.99.99.","Deudas varias c/p",0,141528229.28,141528229.28,0]
[3.1,"2.1.1.99.99.02.","Deudas varias con el sector público interno c/p",0,141528229.28,141528229.28,0]
[3.1,"2.1.1.99.99.02.0.","Deudas varias con el sector público interno c/p",0,141528229.28,141528229.28,0]
[3.1,"2.1.1.99.99.02.0.99999","Deudas varias con el sector público interno c/p",0,141528229.28,141528229.28,0]
[3.1,"2.1.2.","Endeudamiento público a corto plazo",0,194210370.37,679756970,485546599.63]
[3.1,"2.1.2.02.","Préstamos a pagar a corto plazo",0,194210370.37,679756970,485546599.63]
[3.1,"2.1.2.02.02.","Préstamos del sector público interno a pagar c/p",0,194210370.37,679756970,485546599.63]
[3.1,"2.1.2.02.02.99.","Préstamos de otras Instituciones de Gobiernos Locales a pagar c/p",0,194210370.37,679756970,485546599.63]
[3.1,"2.1.2.02.02.99.1.","Préstamos de otras Instituciones de Gobiernos Locales a pagar c/p - Capital",0,194210370.37,679756970,485546599.63]
[3.1,"2.1.2.02.02.99.1.14226","Instituto de Fomento y Asesoría Municipal (IFAM) Préstamo corto Plazo",0,194210370.37,679756970,485546599.63]
[3.1,"2.1.3.","Fondos de terceros y en garantía",66225246.859999999,18577683.129999999,10326835.91,57974399.640000001]
[3.1,"2.1.3.03.","Depósitos en garantía",66225246.859999999,18577683.129999999,10326835.91,57974399.640000001]
[3.1,"2.1.3.03.01.","Depósitos en garantía del sector privado interno",66225246.859999999,18577683.129999999,10326835.91,57974399.640000001]
[3.1,"2.1.3.03.01.02.","Depósitos en garantía de empresas privadas",66225246.859999999,18577683.129999999,10326835.91,57974399.640000001]
[3.1,"2.1.3.03.01.02.0.","Depósitos en garantía de empresas privadas",66225246.859999999,18577683.129999999,10326835.91,57974399.640000001]
[3.1,"2.1.3.03.01.02.0.99999","Depósitos en garantía de empresas privadas",66225246.859999999,18577683.129999999,10326835.91,57974399.640000001]
[3.1,"2.2.","Pasivo No Corriente",1546039108.21,787922011.08000004,315913052.06,1074030149.1900001]
[3.1,"2.2.2.","Endeudamiento público a largo plazo",1522925878.21,786838411.08000004,298894682.06,1034982149.1900001]
[3.1,"2.2.2.02.","Préstamos a pagar a largo plazo",1522925878.21,786838411.08000004,298894682.06,1034982149.1900001]
[3.1,"2.2.2.02.02.","Préstamos del sector público interno a pagar l/p",1522925878.21,786838411.08000004,298894682.06,1034982149.1900001]
[3.1,"2.2.2.02.02.99.","Préstamos de otras Instituciones de Gobiernos Locales a pagar l/p",1522925878.21,786838411.08000004,298894682.06,1034982149.1900001]
[3.1,"2.2.2.02.02.99.1.","Préstamos de otras Instituciones de Gobiernos Locales a pagar l/p - Capital",1522925878.21,786838411.08000004,298894682.06,1034982149.1900001]
[3.1,"2.2.2.02.02.99.1.14226","Instituto de Fomento y Asesoría Municipal (IFAM) P Largo Plazo",1522925878.21,786838411.08000004,298894682.06,1034982149.1900001]
[3.1,"2.2.4.","Provisiones y reservas técnicas a largo plazo",23113230,1083600,17018370,39048000]
[3.1,"2.2.4.01.","Provisiones a largo plazo",23113230,1083600,17018370,39048000]
[3.1,"2.2.4.01.03.","Provisiones para beneficios a los empleados l/p",23113230,1083600,17018370,39048000]
[3.1,"2.2.4.01.03.02.","Provisiones para beneficios por terminación l/p",23113230,1083600,17018370,39048000]
[3.1,"2.2.4.01.03.02.0.","Provisiones para beneficios por terminación l/p",23113230,1083600,17018370,39048000]
[3.1,"2.2.4.01.03.02.0.99999","Provisiones para beneficios por terminación l/p",23113230,1083600,17018370,39048000]
[3.1,"3.","PATRIMONIO",164134319241.19,4543402953.96,4528583574.1499996,164119499861.38]
[3.1,"3.1.","Patrimonio público",164134319241.19,4543402953.96,4528583574.1499996,164119499861.38]
[3.1,"3.1.1.","Capital",524.79999999999995,0,0,524.79999999999995]
[3.1,"3.1.1.01.","Capital inicial",524.79999999999995,0,0,524.79999999999995]
[3.1,"3.1.1.01.01.","Capital inicial a valores históricos",524.79999999999995,0,0,524.79999999999995]
[3.1,"3.1.1.01.01.00.","Capital inicial a valores históricos",524.79999999999995,0,0,524.79999999999995]
[3.1,"3.1.1.01.01.00.0.","Capital inicial a valores históricos",524.79999999999995,0,0,524.79999999999995]
[3.1,"3.1.1.01.01.00.0.99999","Capital inicial a valores históricos",524.79999999999995,0,0,524.79999999999995]
[3.1,"3.1.4.","Variaciones no asignables a reservas",0,4365184120.7299995,4365184120.7299995,0]
[3.1,"3.1.4.99.","Otras variaciones no asignables a reservas",0,4365184120.7299995,4365184120.7299995,0]
[3.1,"3.1.4.99.99.","Otras variaciones no asignables a reservas varias",0,4365184120.7299995,4365184120.7299995,0]
[3.1,"3.1.4.99.99.00.","Otras variaciones no asignables a reservas varias",0,4365184120.7299995,4365184120.7299995,0]
[3.1,"3.1.4.99.99.00.0.","Otras variaciones no asignables a reservas varias",0,4365184120.7299995,4365184120.7299995,0]
[3.1,"3.1.4.99.99.00.0.99999","Otras variaciones no asignables a reservas varias",0,4365184120.7299995,4365184120.7299995,0]
[3.1,"3.1.5.","Resultados acumulados",164134318716.39001,178218833.22999999,163399453.41999999,164119499336.57999]
[3.1,"3.1.5.01.","Resultados acumulados de ejercicios anteriores",164134318716.39001,178218833.22999999,163399453.41999999,164119499336.57999]
[3.1,"3.1.5.01.01.","Resultados de ejercicios anteriores",164283654503.60001,178218833.22999999,163399453.41999999,164268835123.79001]
[3.1,"3.1.5.01.01.00.","Resultados de ejercicios anteriores",164283654503.60001,178218833.22999999,163399453.41999999,164268835123.79001]
[3.1,"3.1.5.01.01.00.0.","Resultados de ejercicios anteriores",164283654503.60001,178218833.22999999,163399453.41999999,164268835123.79001]
[3.1,"3.1.5.01.01.00.0.99999","Resultados de ejercicios anteriores",164283654503.60001,178218833.22999999,163399453.41999999,164268835123.79001]
[3.1,"3.1.5.01.02.","Ajuste de resultados de ejercicios anteriores",-149335787.21000001,0,0,-149335787.21000001]
[3.1,"3.1.5.01.02.06.","Ajuste de resultados acumulados",-149335787.21000001,0,0,-149335787.21000001]
[3.1,"3.1.5.01.02.06.1.","Ajuste por corrección de errores realizados retroactivamente",-149335787.21000001,0,0,-149335787.21000001]
[3.1,"3.1.5.01.02.06.1.99999","Ajuste por corrección de errores realizados retroactivamente",-149335787.21000001,0,0,-149335787.21000001]
[3.1,"4.","INGRESOS",0,5656978.1500000004,4670690209.0799999,4665033230.9300003]
[3.1,"4.1.","Impuestos",0,2194913.17,514550648.17000002,512355735]
[3.1,"4.1.2.","Impuestos sobre la propiedad",0,471780.17,329029432.45999998,328557652.29000002]
[3.1,"4.1.2.01.","Impuesto sobre la propiedad de bienes inmuebles",0,471780.17,329029432.45999998,328557652.29000002]
[3.1,"4.1.2.01.01.","Impuesto sobre la propiedad de bienes inmuebles",0,471780.17,329029432.45999998,328557652.29000002]
[3.1,"4.1.2.01.01.00.","Impuesto sobre la propiedad de bienes inmuebles",0,471780.17,329029432.45999998,328557652.29000002]
[3.1,"4.1.2.01.01.00.0.","Impuesto sobre la propiedad de bienes inmuebles",0,471780.17,329029432.45999998,328557652.29000002]
[3.1,"4.1.2.01.01.00.0.99999","Impuesto sobre la propiedad de bienes inmuebles",0,471780.17,329029432.45999998,328557652.29000002]
[3.1,"4.1.3.","Impuestos sobre bienes y servicios",0,1723133,185521215.71000001,183798082.71000001]
[3.1,"4.1.3.01.","Impuestos generales y selectivos sobre ventas y consumo",0,1619138,156872088.19999999,155252950.19999999]
[3.1,"4.1.3.01.01.","Impuesto general sobre las ventas de bienes y servicios",0,1619138,156872088.19999999,155252950.19999999]
[3.1,"4.1.3.01.01.01.","Impuesto general sobre las ventas de bienes y servicios internos",0,1619138,156872088.19999999,155252950.19999999]
[3.1,"4.1.3.01.01.01.1.","Impuesto general sobre las ventas de bienes y servicios internos",0,1619138,156872088.19999999,155252950.19999999]
[3.1,"4.1.3.01.01.01.1.99999","Impuesto general sobre las ventas de bienes y servicios internos",0,1619138,156872088.19999999,155252950.19999999]
[3.1,"4.1.3.02.","Impuestos específicos sobre la producción y consumo de bienes y servicios",0,103995,25399127.510000002,25295132.510000002]
[3.1,"4.1.3.02.01.","Impuestos específicos sobre la producción y consumo de bienes",0,0,18806254.649999999,18806254.649999999]
[3.1,"4.1.3.02.01.02.","Impuestos específicos sobre la explotación de recursos naturales y minerales",0,0,1288265.56,1288265.56]
[3.1,"4.1.3.02.01.02.1.","Impuestos específicos sobre la explotación de recursos naturales y minerales",0,0,1288265.56,1288265.56]
[3.1,"4.1.3.02.01.02.1.99999","Impuestos específicos sobre la explotación de recursos naturales y minerales",0,0,1288265.56,1288265.56]
[3.1,"4.1.3.02.01.05.","Impuestos específicos sobre la construcción",0,0,17517989.09,17517989.09]
[3.1,"4.1.3.02.01.05.1.","Impuestos específicos sobre la construcción",0,0,17517989.09,17517989.09]
[3.1,"4.1.3.02.01.05.1.99999","Impuestos específicos sobre la construcción",0,0,17517989.09,17517989.09]
[3.1,"4.1.3.02.02.","Impuestos específicos sobre la producción y consumo de servicios",0,103995,6592872.8600000003,6488877.8600000003]
[3.1,"4.1.3.02.02.03.","Impuestos específicos a los servicios de diversión y esparcimiento",0,0,742500,742500]
[3.1,"4.1.3.02.02.03.1.","Impuestos específicos a los servicios de diversión y esparcimiento",0,0,742500,742500]
[3.1,"4.1.3.02.02.03.1.99999","Impuestos específicos a los servicios de diversión y esparcimiento",0,0,742500,742500]
[3.1,"4.1.3.02.02.99.","Otros impuestos específicos sobre la producción y consumo de servicios",0,103995,5850372.8600000003,5746377.8600000003]
[3.1,"4.1.3.02.02.99.1.","Otros impuestos específicos sobre la producción y consumo de servicios",0,103995,5850372.8600000003,5746377.8600000003]
[3.1,"4.1.3.02.02.99.1.99999","Otros impuestos específicos sobre la producción y consumo de servicios",0,103995,5850372.8600000003,5746377.8600000003]
[3.1,"4.1.3.99.","Otros impuestos sobre bienes y servicios",0,0,3250000,3250000]
[3.1,"4.1.3.99.01.","Licencias profesionales, comerciales y otros permisos",0,0,3250000,3250000]
[3.1,"4.1.3.99.01.02.","Multas por licencias profesionales, comerciales y otros permisos",0,0,3250000,3250000]
[3.1,"4.1.3.99.01.02.0.","Multas por licencias profesionales, comerciales y otros permisos",0,0,3250000,3250000]
[3.1,"4.1.3.99.01.02.0.99999","Multas por licencias profesionales, comerciales y otros permisos",0,0,3250000,3250000]
[3.1,"4.4.","Ingresos y resultados positivos por ventas",0,3462064.98,344801337.18000001,341339272.19999999]
[3.1,"4.4.1.","Ventas de bienes y servicios",0,3462064.98,344472403.85000002,341010338.87]
[3.1,"4.4.1.02.","Ventas de servicios",0,3462064.98,344472403.85000002,341010338.87]
[3.1,"4.4.1.02.04.","Servicios comunitarios",0,3462064.98,314007104.98000002,310545040]
[3.1,"4.4.1.02.04.03.","Servicios de cementerio",0,67400,18259328.329999998,18191928.329999998]
[3.1,"4.4.1.02.04.03.0.","Servicios de cementerio",0,67400,18259328.329999998,18191928.329999998]
[3.1,"4.4.1.02.04.03.0.99999","Servicios de cementerio",0,67400,18259328.329999998,18191928.329999998]
[3.1,"4.4.1.02.04.04.","Servicios de saneamiento ambiental",0,3394664.98,295747776.64999998,292353111.67000002]
[3.1,"4.4.1.02.04.04.0.","Servicios de saneamiento ambiental",0,3394664.98,295747776.64999998,292353111.67000002]
[3.1,"4.4.1.02.04.04.0.99999","Servicios de saneamiento ambiental",0,3394664.98,295747776.64999998,292353111.67000002]
[3.1,"4.4.1.02.99.","Otras ventas de servicios",0,0,30465298.870000001,30465298.870000001]
[3.1,"4.4.1.02.99.99.","Otras ventas de servicios varios",0,0,30465298.870000001,30465298.870000001]
[3.1,"4.4.1.02.99.99.0.","Otras ventas de servicios varios",0,0,30465298.870000001,30465298.870000001]
[3.1,"4.4.1.02.99.99.0.99999","Otras ventas de servicios varios",0,0,30465298.870000001,30465298.870000001]
[3.1,"4.4.2.","Derechos administrativos",0,0,328933.33,328933.33]
[3.1,"4.4.2.01.","Derechos administrativos a los servicios de transporte",0,0,200000,200000]
[3.1,"4.4.2.01.01.","Derechos administrativos a los servicios de transporte por carretera",0,0,200000,200000]
[3.1,"4.4.2.01.01.00.","Derechos administrativos a los servicios de transporte por carretera",0,0,200000,200000]
[3.1,"4.4.2.01.01.00.0.","Derechos administrativos a los servicios de transporte por carretera",0,0,200000,200000]
[3.1,"4.4.2.01.01.00.0.99999","Derechos administrativos a los servicios de transporte por carretera",0,0,200000,200000]
[3.1,"4.4.2.99.","Otros derechos administrativos",0,0,128933.33,128933.33]
[3.1,"4.4.2.99.99.","Otros derechos administrativos varios",0,0,128933.33,128933.33]
[3.1,"4.4.2.99.99.00.","Otros derechos administrativos varios",0,0,128933.33,128933.33]
[3.1,"4.4.2.99.99.00.0.","Otros derechos administrativos varios",0,0,128933.33,128933.33]
[3.1,"4.4.2.99.99.00.0.99999","Otros derechos administrativos varios",0,0,128933.33,128933.33]
[3.1,"4.5.","Ingresos de la propiedad",0,0,27071573.91,27071573.91]
[3.1,"4.5.1.","Rentas de inversiones y de colocación de efectivo",0,0,9118183.0099999998,9118183.0099999998]
[3.1,"4.5.1.01.","Intereses por equivalentes de efectivo",0,0,1286412.2,1286412.2]
[3.1,"4.5.1.01.02.","Intereses por otros equivalentes de efectivo",0,0,1286412.2,1286412.2]
[3.1,"4.5.1.01.02.02.","Intereses por otros equivalentes de efectivo en el sector público interno",0,0,1286412.2,1286412.2]
[3.1,"4.5.1.01.02.02.0.","Intereses por otros equivalentes de efectivo en el sector público interno",0,0,1286412.2,1286412.2]
[3.1,"4.5.1.01.02.02.0.21101","BANCO DE COSTA RICA (BCR)",0,0,23.31,23.31]
[3.1,"4.5.1.01.02.02.0.21103","BANCO NACIONAL DE COSTA RICA (BNCR)",0,0,1286388.8899999999,1286388.8899999999]
[3.1,"4.5.1.98.","Resultados positivos de otras inversiones",0,0,7831770.8099999996,7831770.8099999996]
[3.1,"4.5.1.98.99.","Intereses por inversiones varias",0,0,7831770.8099999996,7831770.8099999996]
[3.1,"4.5.1.98.99.02.","Intereses por inversiones varias en el sector público interno",0,0,7831770.8099999996,7831770.8099999996]
[3.1,"4.5.1.98.99.02.0.","Intereses por inversiones varias en el sector público interno",0,0,7831770.8099999996,7831770.8099999996]
[3.1,"4.5.1.98.99.02.0.99999","Intereses por inversiones varias en el sector público interno",0,0,7831770.8099999996,7831770.8099999996]
[3.1,"4.5.2.","Alquileres y derechos sobre bienes",0,0,17953390.899999999,17953390.899999999]
[3.1,"4.5.2.01.","Alquileres",0,0,17953390.899999999,17953390.899999999]
[3.1,"4.5.2.01.02.","Alquileres de edificios",0,0,17953390.899999999,17953390.899999999]
[3.1,"4.5.2.01.02.00.","Alquileres de edificios",0,0,17953390.899999999,17953390.899999999]
[3.1,"4.5.2.01.02.00.0.","Alquileres de edificios",0,0,17953390.899999999,17953390.899999999]
[3.1,"4.5.2.01.02.00.0.99999","Alquileres de edificios",0,0,17953390.899999999,17953390.899999999]
[3.1,"4.6.","Transferencias",0,0,3784139549.0700002,3784139549.0700002]
[3.1,"4.6.1.","Transferencias corrientes",0,0,11322830.07,11322830.07]
[3.1,"4.6.1.02.","Transferencias corrientes del sector público interno",0,0,11322830.07,11322830.07]
[3.1,"4.6.1.02.03.","Transferencias corrientes de Instituciones Descentralizadas no Empresariales",0,0,11322830.07,11322830.07]
[3.1,"4.6.1.02.03.06.","Transferencias corrientes de  Instituciones Descentralizadas no Empresariales",0,0,11322830.07,11322830.07]
[3.1,"4.6.1.02.03.06.0.","Transferencias corrientes de  Instituciones Descentralizadas no Empresariales",0,0,11322830.07,11322830.07]
[3.1,"4.6.1.02.03.06.0.14226","Transferencias corrientes de  Instituciones Descentralizadas no Empresariales (Aporte IFAM Licores Nacionales y Ext)",0,0,11322830.07,11322830.07]
[3.1,"4.6.2.","Transferencias de capital",0,0,3772816719,3772816719]
[3.1,"4.6.2.02.","Transferencias de capital del sector público interno",0,0,3772816719,3772816719]
[3.1,"4.6.2.02.01.","Transferencias de capital del Gobierno Central",0,0,3772816719,3772816719]
[3.1,"4.6.2.02.01.06.","Transferencias de capital del Gobierno Central",0,0,3772816719,3772816719]
[3.1,"4.6.2.02.01.06.0.","Transferencias de capital del Gobierno Central",0,0,3772816719,3772816719]
[3.1,"4.6.2.02.01.06.0.11206","Transferencias de capital del Gobierno Central",0,0,3772816719,3772816719]
[3.1,"4.9.","Otros ingresos",0,0,127100.75,127100.75]
[3.1,"4.9.9.","Otros ingresos y resultados positivos",0,0,127100.75,127100.75]
[3.1,"4.9.9.99.","Ingresos y resultados positivos varios",0,0,127100.75,127100.75]
[3.1,"4.9.9.99.99.","Otros resultados positivos",0,0,127100.75,127100.75]
[3.1,"4.9.9.99.99.00.","Otros resultados positivos",0,0,127100.75,127100.75]
[3.1,"4.9.9.99.99.00.0.","Otros resultados positivos",0,0,127100.75,127100.75]
[3.1,"4.9.9.99.99.00.0.99999","Otros resultados positivos",0,0,127100.75,127100.75]
[3.1,"5.","GASTOS",0,2243425511.6199999,28074608.780000001,2215350902.8400002]
[3.1,"5.1.","Gastos de funcionamiento",0,2082254655.3599999,25485924.210000001,2056768731.1500001]
[3.1,"5.1.1.","Gastos en personal",0,608065984.32000005,0,608065984.32000005]
[3.1,"5.1.1.01.","Remuneraciones Básicas",0,310467059.41000003,0,310467059.41000003]
[3.1,"5.1.1.01.01.","Sueldos para cargos fijos",0,278377808.70999998,0,278377808.70999998]
[3.1,"5.1.1.01.01.00.","Sueldos para cargos fijos",0,278377808.70999998,0,278377808.70999998]
[3.1,"5.1.1.01.01.00.0.","Sueldos para cargos fijos",0,278377808.70999998,0,278377808.70999998]
[3.1,"5.1.1.01.01.00.0.99999","Sueldos para cargos fijos",0,278377808.70999998,0,278377808.70999998]
[3.1,"5.1.1.01.02.","Jornales",0,15806093.32,0,15806093.32]
[3.1,"5.1.1.01.02.00.","Jornales",0,15806093.32,0,15806093.32]
[3.1,"5.1.1.01.02.00.0.","Jornales",0,15806093.32,0,15806093.32]
[3.1,"5.1.1.01.02.00.0.99999","Jornales",0,15806093.32,0,15806093.32]
[3.1,"5.1.1.01.03.","Servicios especiales",0,9877550.0600000005,0,9877550.0600000005]
[3.1,"5.1.1.01.03.00.","Servicios especiales",0,9877550.0600000005,0,9877550.0600000005]
[3.1,"5.1.1.01.03.00.0.","Servicios especiales",0,9877550.0600000005,0,9877550.0600000005]
[3.1,"5.1.1.01.03.00.0.99999","Servicios especiales",0,9877550.0600000005,0,9877550.0600000005]
[3.1,"5.1.1.01.05.","Suplencias",0,6405607.3200000003,0,6405607.3200000003]
[3.1,"5.1.1.01.05.00.","Suplencias",0,6405607.3200000003,0,6405607.3200000003]
[3.1,"5.1.1.01.05.00.0.","Suplencias",0,6405607.3200000003,0,6405607.3200000003]
[3.1,"5.1.1.01.05.00.0.99999","Suplencias",0,6405607.3200000003,0,6405607.3200000003]
[3.1,"5.1.1.02.","Remuneraciones eventuales",0,43416426.93,0,43416426.93]
[3.1,"5.1.1.02.01.","Tiempo extraordinario",0,35183254.289999999,0,35183254.289999999]
[3.1,"5.1.1.02.01.00.","Tiempo extraordinario",0,35183254.289999999,0,35183254.289999999]
[3.1,"5.1.1.02.01.00.0.","Tiempo extraordinario",0,35183254.289999999,0,35183254.289999999]
[3.1,"5.1.1.02.01.00.0.99999","Tiempo extraordinario",0,35183254.289999999,0,35183254.289999999]
[3.1,"5.1.1.02.05.","Dietas",0,8233172.6399999997,0,8233172.6399999997]
[3.1,"5.1.1.02.05.00.","Dietas",0,8233172.6399999997,0,8233172.6399999997]
[3.1,"5.1.1.02.05.00.0.","Dietas",0,8233172.6399999997,0,8233172.6399999997]
[3.1,"5.1.1.02.05.00.0.99999","Dietas",0,8233172.6399999997,0,8233172.6399999997]
[3.1,"5.1.1.03.","Incentivos salariales",0,133731045.58,0,133731045.58]
[3.1,"5.1.1.03.01.","Retribución por años servidos",0,67814298.060000002,0,67814298.060000002]
[3.1,"5.1.1.03.01.00.","Hora",0,67814298.060000002,0,67814298.060000002]
[3.1,"5.1.1.03.01.00.0.","Diario",0,67814298.060000002,0,67814298.060000002]
[3.1,"5.1.1.03.01.00.0.99999","Semanal",0,67814298.060000002,0,67814298.060000002]
[3.1,"5.1.1.03.02.","Restricción al ejercicio liberal de la profesión",0,29491888.640000001,0,29491888.640000001]
[3.1,"5.1.1.03.02.01.","Dedicacion exclusiva",0,29491888.640000001,0,29491888.640000001]
[3.1,"5.1.1.03.02.01.0.","Dedicacion exclusiva",0,29491888.640000001,0,29491888.640000001]
[3.1,"5.1.1.03.02.01.0.99999","Dedicacion exclusiva",0,29491888.640000001,0,29491888.640000001]
[3.1,"5.1.1.03.03.","Decimotercer mes",0,36424858.880000003,0,36424858.880000003]
[3.1,"5.1.1.03.03.00.","Bi-Semanal",0,36424858.880000003,0,36424858.880000003]
[3.1,"5.1.1.03.03.00.0.","Mensual",0,36424858.880000003,0,36424858.880000003]
[3.1,"5.1.1.03.03.00.0.99999","Quincenal",0,36424858.880000003,0,36424858.880000003]
[3.1,"5.1.1.04.","Contribuciones patronales al desarrollo y la seguridad social",0,100470286.04000001,0,100470286.04000001]
[3.1,"5.1.1.04.01.","Contribución patronal al Seguro de Salud de la Caja Costarricense del Seguro Social",0,100320951.54000001,0,100320951.54000001]
[3.1,"5.1.1.04.01.00.","Contribución patronal al Seguro de Salud de la Caja Costarricense del Seguro Social",0,100320951.54000001,0,100320951.54000001]
[3.1,"5.1.1.04.01.00.0.","Contribución patronal al Seguro de Salud de la Caja Costarricense del Seguro Social",0,100320951.54000001,0,100320951.54000001]
[3.1,"5.1.1.04.01.00.0.14120","Contribución Patronal al Seguro de Salud de la Caja",0,100320951.54000001,0,100320951.54000001]
[3.1,"5.1.1.04.05.","Contribución patronal al Banco popular y de Desarrollo Comunal",0,149334.5,0,149334.5]
[3.1,"5.1.1.04.05.00.","Contribución patronal al Banco popular y de Desarrollo Comunal",0,149334.5,0,149334.5]
[3.1,"5.1.1.04.05.00.0.","Contribución patronal al Banco popular y de Desarrollo Comunal",0,149334.5,0,149334.5]
[3.1,"5.1.1.04.05.00.0.31104","Contribución Patronal al Banco Popular y de Desarrollo",0,149334.5,0,149334.5]
[3.1,"5.1.1.05.","Contribuciones patronales a fondos de pensiones y a otros fondos de capitalización",0,2962796.36,0,2962796.36]
[3.1,"5.1.1.05.01.","Contribución patronal al Seguro de Pensiones de la Caja Costarricense del Seguro Social",0,1618785.93,0,1618785.93]
[3.1,"5.1.1.05.01.00.","Contribución patronal al Seguro de Pensiones de la Caja Costarricense del Seguro Social",0,1618785.93,0,1618785.93]
[3.1,"5.1.1.05.01.00.0.","Contribución patronal al Seguro de Pensiones de la Caja Costarricense del Seguro Social",0,1618785.93,0,1618785.93]
[3.1,"5.1.1.05.01.00.0.14120","Contribución Patronal al Seguro de Pensiones de la Caja",0,1618785.93,0,1618785.93]
[3.1,"5.1.1.05.02.","Aporte patronal al Régimen Obligatorio de Pensiones Complementarias",0,896006.96,0,896006.96]
[3.1,"5.1.1.05.02.00.","Aporte patronal al Régimen Obligatorio de Pensiones Complementarias",0,896006.96,0,896006.96]
[3.1,"5.1.1.05.02.00.0.","Aporte patronal al Régimen Obligatorio de Pensiones Complementarias",0,896006.96,0,896006.96]
[3.1,"5.1.1.05.02.00.0.99999","Aporte patronal al Régimen Obligatorio de Pensiones Complementarias",0,896006.96,0,896006.96]
[3.1,"5.1.1.05.03.","Aporte patronal al Fondo de Capitalización Laboral",0,448003.47,0,448003.47]
[3.1,"5.1.1.05.03.00.","Aporte patronal al Fondo de Capitalización Laboral",0,448003.47,0,448003.47]
[3.1,"5.1.1.05.03.00.0.","Aporte patronal al Fondo de Capitalización Laboral",0,448003.47,0,448003.47]
[3.1,"5.1.1.05.03.00.0.14120","Aporte Patronal al Fondo de Capitalización Laboral",0,448003.47,0,448003.47]
[3.1,"5.1.1.06.","Asistencia social y beneficios al personal",0,17018370,0,17018370]
[3.1,"5.1.1.06.08.","Indemnizaciones al personal",0,17018370,0,17018370]
[3.1,"5.1.1.06.08.00.","Indemnizaciones al personal",0,17018370,0,17018370]
[3.1,"5.1.1.06.08.00.0.","Indemnizaciones al personal",0,17018370,0,17018370]
[3.1,"5.1.1.06.08.00.0.99999","Indemnizaciones al personal",0,17018370,0,17018370]
[3.1,"5.1.2.","Servicios",0,1118682937.1500001,280249.31,1118402687.8399999]
[3.1,"5.1.2.01.","Alquileres y derechos sobre bienes",0,78112638.629999995,0,78112638.629999995]
[3.1,"5.1.2.01.01.","Alquiler de terrenos, edificios y locales",0,6000000,0,6000000]
[3.1,"5.1.2.01.01.00.","Alquiler de terrenos, edificios y locales",0,6000000,0,6000000]
[3.1,"5.1.2.01.01.00.0.","Alquiler de terrenos, edificios y locales",0,6000000,0,6000000]
[3.1,"5.1.2.01.01.00.0.99999","Alquiler de terrenos, edificios y locales",0,6000000,0,6000000]
[3.1,"5.1.2.01.02.","Alquiler de maquinarias, equipos y mobiliario",0,70424440.799999997,0,70424440.799999997]
[3.1,"5.1.2.01.02.00.","Alquiler de maquinarias, equipos y mobiliario",0,70424440.799999997,0,70424440.799999997]
[3.1,"5.1.2.01.02.00.0.","Alquiler de maquinarias, equipos y mobiliario",0,70424440.799999997,0,70424440.799999997]
[3.1,"5.1.2.01.02.00.0.99999","Alquiler de maquinarias, equipos y mobiliario",0,70424440.799999997,0,70424440.799999997]
[3.1,"5.1.2.01.05.","Derechos o regalías sobre bienes intangibles",0,1688197.83,0,1688197.83]
[3.1,"5.1.2.01.05.00.","Derechos o regalías sobre bienes intangibles",0,1688197.83,0,1688197.83]
[3.1,"5.1.2.01.05.00.0.","Derechos o regalías sobre bienes intangibles",0,1688197.83,0,1688197.83]
[3.1,"5.1.2.01.05.00.0.99999","Derechos o regalías sobre bienes intangibles",0,1688197.83,0,1688197.83]
[3.1,"5.1.2.02.","Servicios básicos",0,63745969.530000001,0,63745969.530000001]
[3.1,"5.1.2.02.01.","Agua y alcantarillado",0,4533772,0,4533772]
[3.1,"5.1.2.02.01.00.","Agua y alcantarillado",0,4533772,0,4533772]
[3.1,"5.1.2.02.01.00.0.","Agua y alcantarillado",0,4533772,0,4533772]
[3.1,"5.1.2.02.01.00.0.99999","Agua y alcantarillado",0,4533772,0,4533772]
[3.1,"5.1.2.02.02.","Energía eléctrica",0,8503515,0,8503515]
[3.1,"5.1.2.02.02.00.","Energía eléctrica",0,8503515,0,8503515]
[3.1,"5.1.2.02.02.00.0.","Energía eléctrica",0,8503515,0,8503515]
[3.1,"5.1.2.02.02.00.0.99999","Energía eléctrica",0,8503515,0,8503515]
[3.1,"5.1.2.02.04.","Servicios de telecomunicaciones",0,1193072.23,0,1193072.23]
[3.1,"5.1.2.02.04.00.","Servicios de telecomunicaciones",0,1193072.23,0,1193072.23]
[3.1,"5.1.2.02.04.00.0.","Servicios de telecomunicaciones",0,1193072.23,0,1193072.23]
[3.1,"5.1.2.02.04.00.0.99999","Servicios de telecomunicaciones",0,1193072.23,0,1193072.23]
[3.1,"5.1.2.02.99.","Otros servicios básicos",0,49515610.299999997,0,49515610.299999997]
[3.1,"5.1.2.02.99.00.","Otros servicios básicos",0,49515610.299999997,0,49515610.299999997]
[3.1,"5.1.2.02.99.00.0.","Otros servicios básicos",0,49515610.299999997,0,49515610.299999997]
[3.1,"5.1.2.02.99.00.0.99999","Otros servicios básicos",0,49515610.299999997,0,49515610.299999997]
[3.1,"5.1.2.03.","Servicios comerciales y financieros",0,13514436.93,0,13514436.93]
[3.1,"5.1.2.03.01.","Servicios de información",0,457776,0,457776]
[3.1,"5.1.2.03.01.00.","Servicios de información",0,457776,0,457776]
[3.1,"5.1.2.03.01.00.0.","Servicios de información",0,457776,0,457776]
[3.1,"5.1.2.03.01.00.0.99999","Servicios de información",0,457776,0,457776]
[3.1,"5.1.2.03.06.","Comisiones y gastos por servicios financieros y comerciales",0,12906924.93,0,12906924.93]
[3.1,"5.1.2.03.06.00.","Comisiones y gastos por servicios financieros y comerciales",0,12906924.93,0,12906924.93]
[3.1,"5.1.2.03.06.00.0.","Comisiones y gastos por servicios financieros y comerciales",0,12906924.93,0,12906924.93]
[3.1,"5.1.2.03.06.00.0.99999","Comisiones y gastos por servicios financieros y comerciales",0,12906924.93,0,12906924.93]
[3.1,"5.1.2.03.07.","Servicios de transferencia electrónica de información",0,149736,0,149736]
[3.1,"5.1.2.03.07.00.","Servicios de transferencia electrónica de información",0,149736,0,149736]
[3.1,"5.1.2.03.07.00.0.","Servicios de transferencia electrónica de información",0,149736,0,149736]
[3.1,"5.1.2.03.07.00.0.99999","Servicios de transferencia electrónica de información",0,149736,0,149736]
[3.1,"5.1.2.04.","Servicios de gestión y apoyo",0,55043998.210000001,11890,55032108.210000001]
[3.1,"5.1.2.04.03.","Servicios de ingeniería",0,4998299,0,4998299]
[3.1,"5.1.2.04.03.00.","Servicios de ingeniería",0,4998299,0,4998299]
[3.1,"5.1.2.04.03.00.0.","Servicios de ingeniería",0,4998299,0,4998299]
[3.1,"5.1.2.04.03.00.0.99999","Servicios de ingeniería",0,4998299,0,4998299]
[3.1,"5.1.2.04.04.","Servicios en ciencias económicas y sociales",0,5042100,0,5042100]
[3.1,"5.1.2.04.04.00.","Servicios en ciencias económicas y sociales",0,5042100,0,5042100]
[3.1,"5.1.2.04.04.00.0.","Servicios en ciencias económicas y sociales",0,5042100,0,5042100]
[3.1,"5.1.2.04.04.00.0.99999","Servicios en ciencias económicas y sociales",0,5042100,0,5042100]
[3.1,"5.1.2.04.06.","Servicios generales",0,31311191.850000001,0,31311191.850000001]
[3.1,"5.1.2.04.06.00.","Servicios generales",0,31311191.850000001,0,31311191.850000001]
[3.1,"5.1.2.04.06.00.0.","Servicios generales",0,31311191.850000001,0,31311191.850000001]
[3.1,"5.1.2.04.06.00.0.99999","Servicios generales",0,31311191.850000001,0,31311191.850000001]
[3.1,"5.1.2.04.99.","Otros servicios de gestión y apoyo",0,13692407.359999999,11890,13680517.359999999]
[3.1,"5.1.2.04.99.00.","Otros servicios de gestión y apoyo",0,13692407.359999999,11890,13680517.359999999]
[3.1,"5.1.2.04.99.00.0.","Otros servicios de gestión y apoyo",0,13692407.359999999,11890,13680517.359999999]
[3.1,"5.1.2.04.99.00.0.99999","Otros servicios de gestión y apoyo",0,13692407.359999999,11890,13680517.359999999]
[3.1,"5.1.2.05.","Gastos de viaje y transporte",0,3858320,268359.31,3589960.69]
[3.1,"5.1.2.05.01.","Transporte dentro del país",0,26720,0,26720]
[3.1,"5.1.2.05.01.00.","Transporte dentro del país",0,26720,0,26720]
[3.1,"5.1.2.05.01.00.0.","Transporte dentro del país",0,26720,0,26720]
[3.1,"5.1.2.05.01.00.0.99999","Transporte dentro del país",0,26720,0,26720]
[3.1,"5.1.2.05.02.","Viáticos dentro del país",0,3831600,268359.31,3563240.69]
[3.1,"5.1.2.05.02.00.","Viáticos dentro del país",0,3831600,268359.31,3563240.69]
[3.1,"5.1.2.05.02.00.0.","Viáticos dentro del país",0,3831600,268359.31,3563240.69]
[3.1,"5.1.2.05.02.00.0.99999","Viáticos dentro del país",0,3831600,268359.31,3563240.69]
[3.1,"5.1.2.06.","Seguros, reaseguros y otras obligaciones",0,28208536.43,0,28208536.43]
[3.1,"5.1.2.06.01.","Seguros",0,28208536.43,0,28208536.43]
[3.1,"5.1.2.06.01.01.","Seguros contra riesgos de trabajo",0,6212022.75,0,6212022.75]
[3.1,"5.1.2.06.01.01.0.","Seguros contra riesgos de trabajo",0,6212022.75,0,6212022.75]
[3.1,"5.1.2.06.01.01.0.99999","Seguros contra riesgos de trabajo",0,6212022.75,0,6212022.75]
[3.1,"5.1.2.06.01.04.","Seguros voluntarios de automóviles",0,21996513.68,0,21996513.68]
[3.1,"5.1.2.06.01.04.0.","Seguros voluntarios de automóviles",0,21996513.68,0,21996513.68]
[3.1,"5.1.2.06.01.04.0.99999","Seguros voluntarios de automóviles",0,21996513.68,0,21996513.68]
[3.1,"5.1.2.07.","Capacitación y protocolo",0,10860000,0,10860000]
[3.1,"5.1.2.07.01.","Actividades de capacitación",0,4860000,0,4860000]
[3.1,"5.1.2.07.01.00.","Actividades de capacitación",0,4860000,0,4860000]
[3.1,"5.1.2.07.01.00.0.","Actividades de capacitación",0,4860000,0,4860000]
[3.1,"5.1.2.07.01.00.0.99999","Actividades de capacitación",0,4860000,0,4860000]
[3.1,"5.1.2.07.02.","Actividades protocolarias y sociales",0,6000000,0,6000000]
[3.1,"5.1.2.07.02.00.","Actividades protocolarias y sociales",0,6000000,0,6000000]
[3.1,"5.1.2.07.02.00.0.","Actividades protocolarias y sociales",0,6000000,0,6000000]
[3.1,"5.1.2.07.02.00.0.99999","Actividades protocolarias y sociales",0,6000000,0,6000000]
[3.1,"5.1.2.08.","Mantenimiento y reparaciones",0,865339037.41999996,0,865339037.41999996]
[3.1,"5.1.2.08.01.","Mantenimiento de terrenos y edificios",0,17760122.5,0,17760122.5]
[3.1,"5.1.2.08.01.99.","Mantenimiento de edificios varios",0,17760122.5,0,17760122.5]
[3.1,"5.1.2.08.01.99.0.","Mantenimiento de edificios varios",0,17760122.5,0,17760122.5]
[3.1,"5.1.2.08.01.99.0.99999","Mantenimiento de edificios varios",0,17760122.5,0,17760122.5]
[3.1,"5.1.2.08.02.","Mantenimiento y reparación de maquinaria y equipos para la producción",0,11117621.800000001,0,11117621.800000001]
[3.1,"5.1.2.08.02.00.","Mantenimiento y reparación de maquinaria y equipos para la producción",0,11117621.800000001,0,11117621.800000001]
[3.1,"5.1.2.08.02.00.0.","Mantenimiento y reparación de maquinaria y equipos para la producción",0,11117621.800000001,0,11117621.800000001]
[3.1,"5.1.2.08.02.00.0.99999","Mantenimiento y reparación de maquinaria y equipos para la producción",0,11117621.800000001,0,11117621.800000001]
[3.1,"5.1.2.08.03.","Mantenimiento y reparación de equipos de transporte, tracción y elevación",0,9270681.5199999996,0,9270681.5199999996]
[3.1,"5.1.2.08.03.00.","Mantenimiento y reparación de equipos de transporte, tracción y elevación",0,9270681.5199999996,0,9270681.5199999996]
[3.1,"5.1.2.08.03.00.0.","Mantenimiento y reparación de equipos de transporte, tracción y elevación",0,9270681.5199999996,0,9270681.5199999996]
[3.1,"5.1.2.08.03.00.0.99999","Mantenimiento y reparación de equipos de transporte, tracción y elevación",0,9270681.5199999996,0,9270681.5199999996]
[3.1,"5.1.2.08.05.","Mantenimiento y reparación de equipos y mobiliario de oficina",0,280999.96999999997,0,280999.96999999997]
[3.1,"5.1.2.08.05.00.","Mantenimiento y reparación de equipos y mobiliario de oficina",0,280999.96999999997,0,280999.96999999997]
[3.1,"5.1.2.08.05.00.0.","Mantenimiento y reparación de equipos y mobiliario de oficina",0,280999.96999999997,0,280999.96999999997]
[3.1,"5.1.2.08.05.00.0.99999","Mantenimiento y reparación de equipos y mobiliario de oficina",0,280999.96999999997,0,280999.96999999997]
[3.1,"5.1.2.08.10.","Mantenimiento y reparación de bienes de infraestructura y de beneficio y uso público",0,826909611.63,0,826909611.63]
[3.1,"5.1.2.08.10.00.","Mantenimiento y reparación de bienes de infraestructura y de beneficio y uso público",0,826909611.63,0,826909611.63]
[3.1,"5.1.2.08.10.00.0.","Mantenimiento y reparación de bienes de infraestructura y de beneficio y uso público",0,826909611.63,0,826909611.63]
[3.1,"5.1.2.08.10.00.0.99999","Mantenimiento y reparación de bienes de infraestructura y de beneficio y uso público",0,826909611.63,0,826909611.63]
[3.1,"5.1.3.","Materiales y suministros consumidos",0,270386601.55000001,25154551.84,245232049.71000001]
[3.1,"5.1.3.01.","Productos químicos y conexos",0,76894056.920000002,1475642.7,75418414.219999999]
[3.1,"5.1.3.01.01.","Combustibles y lubricantes",0,73118074.730000004,0,73118074.730000004]
[3.1,"5.1.3.01.01.00.","Combustibles y lubricantes",0,73118074.730000004,0,73118074.730000004]
[3.1,"5.1.3.01.01.00.0.","Combustibles y lubricantes",0,73118074.730000004,0,73118074.730000004]
[3.1,"5.1.3.01.01.00.0.99999","Combustibles y lubricantes",0,73118074.730000004,0,73118074.730000004]
[3.1,"5.1.3.01.02.","Productos farmacéuticos y medicinales",0,1507742.84,675000,832742.84]
[3.1,"5.1.3.01.02.00.","Productos farmacéuticos y medicinales",0,1507742.84,675000,832742.84]
[3.1,"5.1.3.01.02.00.0.","Productos farmacéuticos y medicinales",0,1507742.84,675000,832742.84]
[3.1,"5.1.3.01.02.00.0.99999","Productos farmacéuticos y medicinales",0,1507742.84,675000,832742.84]
[3.1,"5.1.3.01.04.","Tintas, pinturas y diluyentes",0,1641115.35,767042.7,874072.65]
[3.1,"5.1.3.01.04.00.","Tintas, pinturas y diluyentes",0,1641115.35,767042.7,874072.65]
[3.1,"5.1.3.01.04.00.0.","Tintas, pinturas y diluyentes",0,1641115.35,767042.7,874072.65]
[3.1,"5.1.3.01.04.00.0.99999","Tintas, pinturas y diluyentes",0,1641115.35,767042.7,874072.65]
[3.1,"5.1.3.01.99.","Otros productos químicos y conexos",0,627124,33600,593524]
[3.1,"5.1.3.01.99.00.","Otros productos químicos y conexos",0,627124,33600,593524]
[3.1,"5.1.3.01.99.00.0.","Otros productos químicos y conexos",0,627124,33600,593524]
[3.1,"5.1.3.01.99.00.0.99999","Otros productos químicos y conexos",0,627124,33600,593524]
[3.1,"5.1.3.02.","Alimentos y productos agropecuarios",0,2460705,0,2460705]
[3.1,"5.1.3.02.03.","Alimentos y bebidas",0,2460705,0,2460705]
[3.1,"5.1.3.02.03.00.","Alimentos y bebidas",0,2460705,0,2460705]
[3.1,"5.1.3.02.03.00.0.","Alimentos y bebidas",0,2460705,0,2460705]
[3.1,"5.1.3.02.03.00.0.99999","Alimentos y bebidas",0,2460705,0,2460705]
[3.1,"5.1.3.03.","Material y producto uso en la construc y mantenim",0,107891537.55,3332210.2,104559327.34999999]
[3.1,"5.1.3.03.01.","Materiales y productos metálicos",0,3291369.82,263620,3027749.82]
[3.1,"5.1.3.03.01.00.","Materiales y productos metálicos",0,3291369.82,263620,3027749.82]
[3.1,"5.1.3.03.01.00.0.","Materiales y productos metálicos",0,3291369.82,263620,3027749.82]
[3.1,"5.1.3.03.01.00.0.99999","Materiales y productos metálicos",0,3291369.82,263620,3027749.82]
[3.1,"5.1.3.03.02.","Materiales y productos minerales y asfálticos",0,101038665,3004645.2,98034019.799999997]
[3.1,"5.1.3.03.02.00.","Materiales y productos minerales y asfálticos",0,101038665,3004645.2,98034019.799999997]
[3.1,"5.1.3.03.02.00.0.","Materiales y productos minerales y asfálticos",0,101038665,3004645.2,98034019.799999997]
[3.1,"5.1.3.03.02.00.0.99999","Materiales y productos minerales y asfálticos",0,101038665,3004645.2,98034019.799999997]
[3.1,"5.1.3.03.03.","Madera y sus derivados",0,1531070,63945,1467125]
[3.1,"5.1.3.03.03.00.","Madera y sus derivados",0,1531070,63945,1467125]
[3.1,"5.1.3.03.03.00.0.","Madera y sus derivados",0,1531070,63945,1467125]
[3.1,"5.1.3.03.03.00.0.99999","Madera y sus derivados",0,1531070,63945,1467125]
[3.1,"5.1.3.03.04.","Material y producto eléctrico, telefónic y cómputo",0,1783935.41,0,1783935.41]
[3.1,"5.1.3.03.04.00.","Material y producto eléctrico, telefónic y cómputo",0,1783935.41,0,1783935.41]
[3.1,"5.1.3.03.04.00.0.","Material y producto eléctrico, telefónic y cómputo",0,1783935.41,0,1783935.41]
[3.1,"5.1.3.03.04.00.0.99999","Material y producto eléctrico, telefónic y cómputo",0,1783935.41,0,1783935.41]
[3.1,"5.1.3.03.06.","Materiales y productos de plástico",0,246497.32,0,246497.32]
[3.1,"5.1.3.03.06.00.","Materiales y productos de plástico",0,246497.32,0,246497.32]
[3.1,"5.1.3.03.06.00.0.","Materiales y productos de plástico",0,246497.32,0,246497.32]
[3.1,"5.1.3.03.06.00.0.99999","Materiales y productos de plástico",0,246497.32,0,246497.32]
[3.1,"5.1.3.04.","Herramientas, repuestos y accesorios",0,50390566.350000001,11554099.48,38836466.869999997]
[3.1,"5.1.3.04.01.","Herramientas e instrumentos",0,412156.69,412156.69,0]
[3.1,"5.1.3.04.01.00.","Herramientas e instrumentos",0,412156.69,412156.69,0]
[3.1,"5.1.3.04.01.00.0.","Herramientas e instrumentos nuevos",0,412156.69,412156.69,0]
[3.1,"5.1.3.04.01.00.0.99999","Herramientas e instrumentos nuevos",0,412156.69,412156.69,0]
[3.1,"5.1.3.04.02.","Repuestos y accesorios",0,49978409.659999996,11141942.789999999,38836466.869999997]
[3.1,"5.1.3.04.02.01.","Repuestos y accesorios Nuevos",0,49978409.659999996,11141942.789999999,38836466.869999997]
[3.1,"5.1.3.04.02.01.0.","Repuestos y accesorios Nuevos",0,49978409.659999996,11141942.789999999,38836466.869999997]
[3.1,"5.1.3.04.02.01.0.99999","Repuestos y accesorios Nuevos",0,49978409.659999996,11141942.789999999,38836466.869999997]
[3.1,"5.1.3.99.","Útiles, materiales y suministros diversos",0,32749735.73,8792599.4600000009,23957136.27]
[3.1,"5.1.3.99.01.","Útiles y materiales de oficina y cómputo",0,1538159.95,297931.44,1240228.51]
[3.1,"5.1.3.99.01.00.","Útiles y materiales de oficina y cómputo",0,1538159.95,297931.44,1240228.51]
[3.1,"5.1.3.99.01.00.0.","Útiles y materiales de oficina y cómputo",0,1538159.95,297931.44,1240228.51]
[3.1,"5.1.3.99.01.00.0.99999","Útiles y materiales de oficina y cómputo",0,1538159.95,297931.44,1240228.51]
[3.1,"5.1.3.99.02.","Útiles y materiales méd, hospital y investigación",0,320932.96999999997,0,320932.96999999997]
[3.1,"5.1.3.99.02.00.","Útiles y materiales méd, hospital y investigación",0,320932.96999999997,0,320932.96999999997]
[3.1,"5.1.3.99.02.00.0.","Útiles y materiales méd, hospital y investigación",0,320932.96999999997,0,320932.96999999997]
[3.1,"5.1.3.99.02.00.0.99999","Útiles y materiales méd, hospital y investigación",0,320932.96999999997,0,320932.96999999997]
[3.1,"5.1.3.99.03.","Productos de papel, cartón e impresos",0,2076236.1,476667.61,1599568.49]
[3.1,"5.1.3.99.03.00.","Productos de papel, cartón e impresos",0,2076236.1,476667.61,1599568.49]
[3.1,"5.1.3.99.03.00.0.","Productos de papel, cartón e impresos",0,2076236.1,476667.61,1599568.49]
[3.1,"5.1.3.99.03.00.0.99999","Productos de papel, cartón e impresos",0,2076236.1,476667.61,1599568.49]
[3.1,"5.1.3.99.04.","Textiles y vestuario",0,14739510.630000001,1687442,13052068.630000001]
[3.1,"5.1.3.99.04.00.","Textiles y vestuario",0,14739510.630000001,1687442,13052068.630000001]
[3.1,"5.1.3.99.04.00.0.","Textiles y vestuario",0,14739510.630000001,1687442,13052068.630000001]
[3.1,"5.1.3.99.04.00.0.99999","Textiles y vestuario",0,14739510.630000001,1687442,13052068.630000001]
[3.1,"5.1.3.99.05.","Útiles y materiales de limpieza",0,4219119.71,1464470.37,2754649.34]
[3.1,"5.1.3.99.05.00.","Útiles y materiales de limpieza",0,4219119.71,1464470.37,2754649.34]
[3.1,"5.1.3.99.05.00.0.","Útiles y materiales de limpieza",0,4219119.71,1464470.37,2754649.34]
[3.1,"5.1.3.99.05.00.0.99999","Útiles y materiales de limpieza",0,4219119.71,1464470.37,2754649.34]
[3.1,"5.1.3.99.06.","Útiles y materiales de resguardo y seguridad",0,7992760.3700000001,4609053.04,3383707.33]
[3.1,"5.1.3.99.06.00.","Útiles y materiales de resguardo y seguridad",0,7992760.3700000001,4609053.04,3383707.33]
[3.1,"5.1.3.99.06.00.0.","Útiles y materiales de resguardo y seguridad",0,7992760.3700000001,4609053.04,3383707.33]
[3.1,"5.1.3.99.06.00.0.99999","Útiles y materiales de resguardo y seguridad",0,7992760.3700000001,4609053.04,3383707.33]
[3.1,"5.1.3.99.99.","Otros útiles, materiales y suministros diversos",0,1863016,257035,1605981]
[3.1,"5.1.3.99.99.00.","Otros útiles, materiales y suministros diversos",0,1863016,257035,1605981]
[3.1,"5.1.3.99.99.00.0.","Otros útiles, materiales y suministros diversos",0,1863016,257035,1605981]
[3.1,"5.1.3.99.99.00.0.99999","Otros útiles, materiales y suministros diversos",0,1863016,257035,1605981]
[3.1,"5.1.4.","Consumo de bienes distintos de inventarios",0,85119132.340000004,51123.06,85068009.280000001]
[3.1,"5.1.4.01.","Consumo de bienes no concesionados",0,85119132.340000004,51123.06,85068009.280000001]
[3.1,"5.1.4.01.01.","Depreciaciones de propiedades, planta y equipos explotados",0,85119132.340000004,51123.06,85068009.280000001]
[3.1,"5.1.4.01.01.02.","Depreciación de edificios",0,9043808.3499999996,0,9043808.3499999996]
[3.1,"5.1.4.01.01.02.0.","Depreciación de edificios",0,9043808.3499999996,0,9043808.3499999996]
[3.1,"5.1.4.01.01.02.0.99999","Depreciación de edificios",0,9043808.3499999996,0,9043808.3499999996]
[3.1,"5.1.4.01.01.03.","Depreciaciones de maquinaria y equipos para la producción",0,60320973.82,0,60320973.82]
[3.1,"5.1.4.01.01.03.0.","Depreciaciones de maquinaria y equipos para la producción",0,60320973.82,0,60320973.82]
[3.1,"5.1.4.01.01.03.0.99999","Depreciaciones de maquinaria y equipos para la producción",0,60320973.82,0,60320973.82]
[3.1,"5.1.4.01.01.04.","Depreciaciones de equipos de transporte, tracción y elevación",0,6305173.3700000001,0,6305173.3700000001]
[3.1,"5.1.4.01.01.04.0.","Depreciaciones de equipos de transporte, tracción y elevación",0,6305173.3700000001,0,6305173.3700000001]
[3.1,"5.1.4.01.01.04.0.99999","Depreciaciones de equipos de transporte, tracción y elevación",0,6305173.3700000001,0,6305173.3700000001]
[3.1,"5.1.4.01.01.05.","Depreciaciones de equipos de comunicación",0,1348565.62,0,1348565.62]
[3.1,"5.1.4.01.01.05.0.","Depreciaciones de equipos de comunicación",0,1348565.62,0,1348565.62]
[3.1,"5.1.4.01.01.05.0.99999","Depreciaciones de equipos de comunicación",0,1348565.62,0,1348565.62]
[3.1,"5.1.4.01.01.06.","Depreciaciones de equipos y mobiliario de oficina",0,2599944.06,0,2599944.06]
[3.1,"5.1.4.01.01.06.0.","Depreciaciones de equipos y mobiliario de oficina",0,2599944.06,0,2599944.06]
[3.1,"5.1.4.01.01.06.0.99999","Depreciaciones de equipos y mobiliario de oficina",0,2599944.06,0,2599944.06]
[3.1,"5.1.4.01.01.07.","Depreciaciones de equipos para computación",0,4587171.91,51123.06,4536048.8499999996]
[3.1,"5.1.4.01.01.07.0.","Depreciaciones de equipos para computación",0,4587171.91,51123.06,4536048.8499999996]
[3.1,"5.1.4.01.01.07.0.99999","Depreciaciones de equipos para computación",0,4587171.91,51123.06,4536048.8499999996]
[3.1,"5.1.4.01.01.09.","Depreciaciones de equipos y mobiliario educacional, deportivo y recreativo",0,631660.71,0,631660.71]
[3.1,"5.1.4.01.01.09.0.","Depreciaciones de equipos y mobiliario educacional, deportivo y recreativo",0,631660.71,0,631660.71]
[3.1,"5.1.4.01.01.09.0.99999","Depreciaciones de equipos y mobiliario educacional, deportivo y recreativo",0,631660.71,0,631660.71]
[3.1,"5.1.4.01.01.10.","Depreciaciones de equipos de seguridad, orden, vigilancia y control público",0,84476.69,0,84476.69]
[3.1,"5.1.4.01.01.10.0.","Depreciaciones de equipos de seguridad, orden, vigilancia y control público",0,84476.69,0,84476.69]
[3.1,"5.1.4.01.01.10.0.99999","Depreciaciones de equipos de seguridad, orden, vigilancia y control público",0,84476.69,0,84476.69]
[3.1,"5.1.4.01.01.99.","Depreciac maquinaria, equipo y mobiliar diverso",0,197357.81,0,197357.81]
[3.1,"5.1.4.01.01.99.0.","Depreciac maquinaria, equipo y mobiliar diverso",0,197357.81,0,197357.81]
[3.1,"5.1.4.01.01.99.0.99999","Depreciac maquinaria, equipo y mobiliar diverso",0,197357.81,0,197357.81]
[3.1,"5.2.","Gastos financieros",0,54399299.990000002,0,54399299.990000002]
[3.1,"5.2.1.","Intereses sobre endeudamiento público",0,54399299.990000002,0,54399299.990000002]
[3.1,"5.2.1.02.","Intereses sobre préstamos",0,54399299.990000002,0,54399299.990000002]
[3.1,"5.2.1.02.02.","Intereses sobre préstamos del sector público interno",0,54399299.990000002,0,54399299.990000002]
[3.1,"5.2.1.02.02.99.","Intereses sobre préstamos de Otras Instituciones de Gobiernos Locales",0,54399299.990000002,0,54399299.990000002]
[3.1,"5.2.1.02.02.99.0.","Intereses sobre préstamos de Otras Instituciones de Gobiernos Locales",0,54399299.990000002,0,54399299.990000002]
[3.1,"5.2.1.02.02.99.0.14226","Instito de Fomento y Asesoria Municipal IFAM",0,54399299.990000002,0,54399299.990000002]
[3.1,"5.4.","Transferencias",0,106771550.86,2588684.5699999998,104182866.29000001]
[3.1,"5.4.1.","Transferencias corrientes",0,106771550.86,2588684.5699999998,104182866.29000001]
[3.1,"5.4.1.01.","Transferencias corrientes al sector privado interno",0,63492607.539999999,2588684.5699999998,60903922.969999999]
[3.1,"5.4.1.01.01.","Transferencias corrientes a personas",0,58595412.409999996,2588684.5699999998,56006727.840000004]
[3.1,"5.4.1.01.01.01.","Prestaciones",0,8595412.4100000001,2588684.5699999998,6006727.8399999999]
[3.1,"5.4.1.01.01.01.1.","Pensiones y jubilaciones contributivas",0,5322142,2588684.5699999998,2733457.43]
[3.1,"5.4.1.01.01.01.1.99999","Pensiones y jubilaciones contributivas",0,5322142,2588684.5699999998,2733457.43]
[3.1,"5.4.1.01.01.01.9.","Otras prestaciones",0,3273270.41,0,3273270.41]
[3.1,"5.4.1.01.01.01.9.99999","Otras prestaciones",0,3273270.41,0,3273270.41]
[3.1,"5.4.1.01.01.99.","Otras transferencias corrientes a personas",0,50000000,0,50000000]
[3.1,"5.4.1.01.01.99.0.","Otras transferencias corrientes a personas",0,50000000,0,50000000]
[3.1,"5.4.1.01.01.99.0.99999","Otras transferencias corrientes a personas",0,50000000,0,50000000]
[3.1,"5.4.1.01.02.","Transferencias corrientes a entidades del sector privado interno",0,4897195.13,0,4897195.13]
[3.1,"5.4.1.01.02.01.","Transferencias corrientes a entidades privadas sin fines de lucro",0,4897195.13,0,4897195.13]
[3.1,"5.4.1.01.02.01.1.","Transferencias corrientes a asociaciones",0,4144905.13,0,4144905.13]
[3.1,"5.4.1.01.02.01.1.99999","Transferencias corrientes a asociaciones",0,4144905.13,0,4144905.13]
[3.1,"5.4.1.01.02.01.9.","Transferencias corrientes a otras entidades privadas sin fines de lucro",0,752290,0,752290]
[3.1,"5.4.1.01.02.01.9.99999","Transferencias corrientes a otras entidades privadas sin fines de lucro",0,752290,0,752290]
[3.1,"5.4.1.02.","Transferencias corrientes al sector público interno",0,43278943.32,0,43278943.32]
[3.1,"5.4.1.02.01.","Transferencias corrientes al Gobierno Central",0,3032078.91,0,3032078.91]
[3.1,"5.4.1.02.01.06.","Transferencias corrientes al Gobierno Central",0,2898728.91,0,2898728.91]
[3.1,"5.4.1.02.01.06.0.","Transferencias corrientes al Gobierno Central",0,2898728.91,0,2898728.91]
[3.1,"5.4.1.02.01.06.0.11206","Transferencias corrientes al Gobierno Central",0,1896682.76,0,1896682.76]
[3.1,"5.4.1.02.01.06.0.11219","Ministerio de Ambiente, Energía y Telecomunicaciones (MINAET)",0,1002046.15,0,1002046.15]
[3.1,"5.4.1.02.01.99.","Otras transferencias corrientes al Gobierno Central",0,133350,0,133350]
[3.1,"5.4.1.02.01.99.0.","Otras transferencias corrientes al Gobierno Central",0,133350,0,133350]
[3.1,"5.4.1.02.01.99.0.11210","Transferencias corrientes  a Instituciones del MEP",0,133350,0,133350]
[3.1,"5.4.1.02.02.","Transferencias corrientes a Órganos Desconcentrados",0,6262769.2999999998,0,6262769.2999999998]
[3.1,"5.4.1.02.02.06.","Transferencias corrientes a Órganos Desconcentrados",0,6262769.2999999998,0,6262769.2999999998]
[3.1,"5.4.1.02.02.06.0.","Transferencias corrientes a Órganos Desconcentrados",0,6262769.2999999998,0,6262769.2999999998]
[3.1,"5.4.1.02.02.06.0.12553","Comision Nacional para la Gestión de la Biodiversidad (CONAGEBIO)",0,159054.94,0,159054.94]
[3.1,"5.4.1.02.02.06.0.12581","Consejo Nacional de Personas con Discapacidad - CONAPDIS",0,2310348.86,0,2310348.86]
[3.1,"5.4.1.02.02.06.0.12784","Junta Administrativa del Registro Nacional",0,3793365.5,0,3793365.5]
[3.1,"5.4.1.02.03.","Transferencias corrientes a Instituciones Descentralizadas no Empresariales",0,18966827.510000002,0,18966827.510000002]
[3.1,"5.4.1.02.03.06.","Transferencias corrientes a Instituciones Descentralizadas no Empresariales",0,18966827.510000002,0,18966827.510000002]
[3.1,"5.4.1.02.03.06.0.","Transferencias corrientes a Instituciones Descentralizadas no Empresariales",0,18966827.510000002,0,18966827.510000002]
[3.1,"5.4.1.02.03.06.0.14253","Transferencias corrientes a Instituciones Descentralizadas no Empresariales",0,18966827.510000002,0,18966827.510000002]
[3.1,"5.4.1.02.99.","Transferencias corrientes a otras Instituciones de Gobiernos Locales",0,15017267.6,0,15017267.6]
[3.1,"5.4.1.02.99.06.","Transferencias corrientes a otras Instituciones de Gobiernos Locales",0,15017267.6,0,15017267.6]
[3.1,"5.4.1.02.99.06.0.","Transferencias corrientes a otras Instituciones de Gobiernos Locales",0,15017267.6,0,15017267.6]
[3.1,"5.4.1.02.99.06.0.15910","Comités Cantonales de Deportes y Recreación",0,13862093.17,0,13862093.17]
[3.1,"5.4.1.02.99.06.0.15980","Unión Nacional de Gobiernos Locales",0,1155174.43,0,1155174.43]
[3.1,"5.9.","Otros gastos",0,5.42,0,5.42]
[3.1,"5.9.9.","Otros gastos y resultados negativos",0,5.42,0,5.42]
[3.1,"5.9.9.99.","Gastos y resultados negativos varios",0,5.42,0,5.42]
[3.1,"5.9.9.99.99.","Otros resultados negativos",0,5.42,0,5.42]
[3.1,"5.9.9.99.99.00.","Otros resultados negativos",0,5.42,0,5.42]
[3.1,"5.9.9.99.99.00.0.","Otros resultados negativos",0,5.42,0,5.42]
[3.1,"5.9.9.99.99.00.0.99999","Otros resultados negativos",0,5.42,0,5.42]
[null,"GRAN TOTAL",null,0,18557294142.549999,18557294142.549999,0]

{"sheet":"Data","index":1,"n_rows":324,"n_cols":13,"rows_kept":324,"cut":false,"hidden":false,"merged":[]}
["FileName","IDEntidad","UnidadTiempoPeriodo","Periodo",null,"B1","28 de Febrero",2,null,"11000","PODER EJECUTIVO ( MINISTERIOS DE LA REPUBLICA )",null,{"$f":"VLOOKUP(B2,$J$1:$K$323,2,FALSE)","v":"Municipalidad de Buenos Aires"}]
[{"$f":"MID(MID(CELL(\"filename\"),FIND(\"[\",CELL(\"filename\"))+1, FIND(\"]\",CELL(\"filename\"))-FIND(\"[\",CELL(\"filename\"))-1), 1, FIND(\"_\",MID(CELL(\"filename\"),FIND(\"[\",CELL(\"filename\"))+1, FIND(\"]\",CELL(\"filename\"))-FIND(\"[\",CELL(\"filename\"))-1))-1)","v":"15603M052024"},{"$f":"IF(A2=\"\",\"\",MID(A2,1,5))","v":"15603"},{"$f":"IF(MID(A2,6,1)=\"M\",MID(A2,6,3),MID(A2,6,2))","v":"M05"},{"$f":"RIGHT(A2,4)","v":"2024"},null,"B2","30 de Abril",4,null,"11201","Presidencia de la República"]
[null,null,null,null,null,"B3","30 de Junio",6,null,"11202","Ministerio de la Presidencia (MP)"]
[null,null,null,null,null,"B4","31 de Agosto",8,null,"11203","Ministerio de Gobernación y Policía"]
[null,null,null,null,null,"B5","31 de Octubre",10,null,"11204","Ministerio de Relaciones Exteriores y Culto (RE)"]
[null,null,null,null,null,"B6","31 de Diciembre",12,null,"11205","Ministerio de Seguridad Pública (MSP)"]
[null,null,null,null,null,"T1","31 de Marzo",3,null,"11206","Ministerio de Hacienda (MHD)  "]
[null,null,null,null,null,"T2","30 de Junio",6,null,"11207","Ministerio de Agricultura y Ganadería (MAG)  "]
[null,null,null,null,null,"T3","30 de Setiembre",9,null,"11208","Ministerio de Economía, Industria y Comercio (MEIC)"]
[null,null,null,null,null,"T4","31 de Diciembre",12,null,"11209","Ministerio de Obras Públicas y Transportes (MOPT) "]
[null,null,null,null,null,"C1","30 de Abril",4,null,"11210","Ministerio de Educación Pública (MEP) "]
[null,null,null,null,null,"C2","31 de Agosto",8,null,"11211","Ministerio de Salud"]
[null,null,null,null,null,"C3","31 de Diciembre",12,null,"11212","Ministerio de Trabajo y Seguridad Social (MTSS)"]
[null,null,null,null,null,"S1","30 de Junio",6,null,"11213","Ministerio de Cultura, Juventud y Deportes (MCJD)"]
[null,null,null,null,null,"S2","31 de Diciembre",12,null,"11214","Ministerio de Justicia y Gracia "]
[null,null,null,null,null,"A1","31 de Diciembre",12,null,"11215","Ministerio de la Vivienda y Asentamientos Humanos (MIVAH)"]
[null,null,null,null,null,"M01","31 de Enero",1,null,"11216","Ministerio de Comercio Exterior (COMEX)"]
[null,null,null,null,null,"M02","28 de Febrero",2,null,"11217","Ministerio de Planificación Nacional y Política Económica   (MIDEPLAN)"]
[null,null,null,null,null,"M04","30 de Abril",4,null,"11218","Ministerio de Ciencia y Tecnología (MICIT)"]
[null,null,null,null,null,"M05","31 de Mayo",5,null,"11219","Ministerio de Ambiente, Energía  y Telecomunicaciones (MINAET) "]
[null,null,null,null,null,"M07","31 de Julio",7,null,"11230","Servicio de la Deuda Pública"]
[null,null,null,null,null,"M08","31 de Agosto",8,null,"11231","Regímenes de Pensiones con Cargo al Presupuesto de la  República"]
[null,null,null,null,null,"M10","31 de Octubre",10,null,"11232","Obras Específicas"]
[null,null,null,null,null,"M11","30 de Noviembre",11,null,"13000","OTROS PODERES DE LA REPUBLICA "]
[null,null,null,null,null,null,null,null,null,"13101","Asamblea Legislativa"]
[null,null,null,null,null,null,null,null,null,"13102","Contraloría General de la República (CGR)"]
[null,null,null,null,null,null,null,null,null,"13103","Defensoría de los Habitantes de la República"]
[null,null,null,null,null,null,null,null,null,"13301","Poder Judicial "]
[null,null,null,null,null,null,null,null,null,"13401","Tribunal Supremo de Elecciones (TSE)"]
[null,null,null,null,null,null,null,null,null,"12000","ÓRGANOS DESCONCENTRADOS"]
[null,null,null,null,null,null,null,null,null,"12510","Casa de Cultura de Puntarenas"]
[null,null,null,null,null,null,null,null,null,"12530","Centro Costarricense de Producción Cinematográfica "]
[null,null,null,null,null,null,null,null,null,"12531","Centro Cultural e Histórico José Figueres Ferrer"]
[null,null,null,null,null,null,null,null,null,"12534","Centro Nacional de la Música"]
[null,null,null,null,null,null,null,null,null,"12550","Comisión de Energía Atómica de Costa Rica (CEA)"]
[null,null,null,null,null,null,null,null,null,"12551","Comisión Nacional de Conmemoraciones Históricas (CNCH)"]
[null,null,null,null,null,null,null,null,null,"12552","Comisión Nacional para la Defensa del Idioma "]
[null,null,null,null,null,null,null,null,null,"12553","Comisión Nacional para la Gestión de la Biodiversidad  (CONAGEBIO)"]
[null,null,null,null,null,null,null,null,null,"12554","Comisión Nacional de Prevención de Riesgos y Atención de Emergencias  (CNE)"]
[null,null,null,null,null,null,null,null,null,"12555","Comisión Nacional de Vacunación y Epidemiología"]
[null,null,null,null,null,null,null,null,null,"12556","Comisión de Ordenamiento y Manejo de la Cuenca Alta del  Río Reventazón  (CONCURE)"]
[null,null,null,null,null,null,null,null,null,"12570","Consejo Nacional de Clubes 4-S"]
[null,null,null,null,null,null,null,null,null,"12575","Consejo Nacional de Investigacion en Salud (CONIS )"]
[null,null,null,null,null,null,null,null,null,"12580","Consejo Nacional de Concesiones (CNC)"]
[null,null,null,null,null,null,null,null,null,"12582","Consejo Nacional de la Persona Adulta Mayor (CONAPAM)"]
[null,null,null,null,null,null,null,null,null,"12583","Consejo Nacional de la Política Pública de la Persona Joven (CPJ)"]
[null,null,null,null,null,null,null,null,null,"12584","Consejo Nacional de Vialidad (CONAVI)"]
[null,null,null,null,null,null,null,null,null,"12586","Consejo de Salud Ocupacional (CSO)"]
[null,null,null,null,null,null,null,null,null,"12587","Consejo de Seguridad Vial (COSEVI)"]
[null,null,null,null,null,null,null,null,null,"12588","Consejo Superior de Educación (CSE)"]
[null,null,null,null,null,null,null,null,null,"12589","Consejo Técnico de Asistencia Médico Social (CTAMS)"]
[null,null,null,null,null,null,null,null,null,"12590","Consejo Técnico de Aviación Civil (CTAC) "]
[null,null,null,null,null,null,null,null,null,"12591","Consejo de Transporte Público (CTP)"]
[null,null,null,null,null,null,null,null,null,"12630","Dirección Ejecutora de Proyectos de  Mideplan (DEP)"]
[null,null,null,null,null,null,null,null,null,"12631","Dirección de Geología y Minas"]
[null,null,null,null,null,null,null,null,null,"12634","Dirección Nacional Centros Educacion y Nutrición  Centros Infantiles Atención Integral ( CEN CINAI )"]
[null,null,null,null,null,null,null,null,null,"12637","Dirección Nacional de Notariado"]
[null,null,null,null,null,null,null,null,null,"12651","Fideicomiso Proyecto de Crédito y Desarrollo Agrícola Pequeños Productores de la Zona Norte (PPZN)"]
[null,null,null,null,null,null,null,null,null,"12700","Fondo de Desarrollo Social y Asignaciones Familiares (FODESAF)"]
[null,null,null,null,null,null,null,null,null,"12701","Fondo Especial del Servicio Nacional de Guardacostas"]
[null,null,null,null,null,null,null,null,null,"12703","Fondo Nacional de Becas  (FONABE) "]
[null,null,null,null,null,null,null,null,null,"12704","Fondo Nacional de Financiamiento Forestal (FONAFIFO)"]
[null,null,null,null,null,null,null,null,null,"12706","Fondo de Preinversión de Mideplan  "]
[null,null,null,null,null,null,null,null,null,"12712","Fondo Nacional de Becas  de Solidaridad Social"]
[null,null,null,null,null,null,null,null,null,"12720","Fundación Nacional de Clubes 4 - S (FUNAC)"]
[null,null,null,null,null,null,null,null,null,"12750","Instituto sobre Alcoholismo y Farmacodependencia  (IAFA)"]
[null,null,null,null,null,null,null,null,null,"12751","Instituto Costarricense sobre Drogas  (ICD)"]
[null,null,null,null,null,null,null,null,null,"12752","Instituto Costarricense de Investigación y Enseñanza en Nutrición y Salud  (INCIENSA)"]
[null,null,null,null,null,null,null,null,null,"12753","Instituto Meteorológico Nacional (IMN)"]
[null,null,null,null,null,null,null,null,null,"12755","Instituto Nacional de Innovación y Transferencia en Tecnología agropecuaria (INTA)"]
[null,null,null,null,null,null,null,null,null,"12756","Instituto Desarrollo Profesional Uladislao Gámez Solano"]
[null,null,null,null,null,null,null,null,null,"12780","Junta Administrativa del Archivo Nacional (JAAN)"]
[null,null,null,null,null,null,null,null,null,"12781","Junta Administrativa  de la Dirección General de Migración y Extranjería"]
[null,null,null,null,null,null,null,null,null,"12782","Junta Administrativa de la Imprenta Nacional (JAIN)"]
[null,null,null,null,null,null,null,null,null,"12783","Junta Directiva  del Parque Recreativo  Nacional Playas de Manuel Antonio"]
[null,null,null,null,null,null,null,null,null,"12784","Junta Administrativa del Registro Nacional  "]
[null,null,null,null,null,null,null,null,null,"12795","Laboratorio Costarricense de Metrología (LACOMET)"]
[null,null,null,null,null,null,null,null,null,"12800","Museo de Arte Costarricense"]
[null,null,null,null,null,null,null,null,null,"12801","Museo de Arte y Diseño Contemporáneo (MADC)"]
[null,null,null,null,null,null,null,null,null,"12802","Museo Histórico Cultural Juan Santamaría"]
[null,null,null,null,null,null,null,null,null,"12804","Museo Nacional de Costa Rica (MNCR)"]
[null,null,null,null,null,null,null,null,null,"12805","Museo Dr. Rafael Ángel Calderón Guardia"]
[null,null,null,null,null,null,null,null,null,"12820","Oficina de Cooperación Internacional de la Salud (OCIS)"]
[null,null,null,null,null,null,null,null,null,"12850","Patronato de Construcciones, Instalaciones y Adquisiciones de Bienes  "]
[null,null,null,null,null,null,null,null,null,"12852","Patronato Nacional de Rehabilitación  (PANARE)"]
[null,null,null,null,null,null,null,null,null,"12853","Parque Marino del Pacífico"]
[null,null,null,null,null,null,null,null,null,"12901","Servicio Fitosanitario del Estado"]
[null,null,null,null,null,null,null,null,null,"12902","Servicio Nacional de Salud Animal (SENASA)"]
[null,null,null,null,null,null,null,null,null,"12908"," Sistema Nacional de Áreas de Conservación (SINAC) "]
[null,null,null,null,null,null,null,null,null,"12920","Teatro Nacional (TNCR)"]
[null,null,null,null,null,null,null,null,null,"12921","Teatro Popular Mélico Salazar  (TPMS)"]
[null,null,null,null,null,null,null,null,null,"12940","Tribunal Registral Administrativo  (TRA)"]
[null,null,null,null,null,null,null,null,null,"12942","Unidad Coordinadora del Programa de Mejoramiento de la  Calidad de la Educación General Básica (PROMECE)"]
[null,null,null,null,null,null,null,null,null,"12946","Unidad de Coordinación del Proyecto Limón Ciudad Puerto"]
[null,null,null,null,null,null,null,null,null,"12961","Unidad Ejecutora Programa Regularización del Catastro y Registro  "]
[null,null,null,null,null,null,null,null,null,"14000","INSTITUCIONES DESCENTRALIZADAS NO EMPRESARIALES"]
[null,null,null,null,null,null,null,null,null,"14110","Autoridad Reguladora de Servicios Públicos (ARESEP)"]
[null,null,null,null,null,null,null,null,null,"14115","Benemérito Cuerpo de Bomberos de Costa Rica "]
[null,null,null,null,null,null,null,null,null,"14120","Caja Costarricense de Seguro Social (CCSS)"]
[null,null,null,null,null,null,null,null,null,"14132","Colegio Universitario de Cartago (CUC) "]
[null,null,null,null,null,null,null,null,null,"14133","Colegio Universitario de Limón (CUNLIMON) "]
[null,null,null,null,null,null,null,null,null,"14150","Comisión Nacional de Asuntos Indígenas (CONAI)"]
[null,null,null,null,null,null,null,null,null,"14161","Promotora Costarricense Innovación e Investigación (PROMOTORA) "]
[null,null,null,null,null,null,null,null,null,"14162","Consejo Nacional de Rectores (CONARE) "]
[null,null,null,null,null,null,null,null,null,"14163","Consejo Nacional de Rehabilitación y Educación Especial  (CNREE) "]
[null,null,null,null,null,null,null,null,null,"14222","Instituto Costarricense del Deporte y la Recreación (ICODER)"]
[null,null,null,null,null,null,null,null,null,"14223","Instituto Costarricense de Pesca y Acuicultura  (INCOPESCA)  "]
[null,null,null,null,null,null,null,null,null,"14224","Instituto Costarricense de Turismo (ICT) "]
[null,null,null,null,null,null,null,null,null,"14225","Instituto de Desarrollo Rural (INDER)"]
[null,null,null,null,null,null,null,null,null,"14226","Instituto de Fomento y Asesoría Municipal (IFAM)"]
[null,null,null,null,null,null,null,null,null,"14227","Instituto Mixto de Ayuda Social (IMAS) "]
[null,null,null,null,null,null,null,null,null,"14228","Instituto Nacional de Aprendizaje (INA)"]
[null,null,null,null,null,null,null,null,null,"14229","Instituto Nacional de Estadística y Censos (INEC)"]
[null,null,null,null,null,null,null,null,null,"14230","Instituto Nacional de las Mujeres (INAMU)"]
[null,null,null,null,null,null,null,null,null,"14231","Instituto Tecnológico de Costa Rica (ITCR)"]
[null,null,null,null,null,null,null,null,null,"14250","Juntas Administrativas de colegios  y otras instituciones educativas "]
[null,null,null,null,null,null,null,null,null,"14251","Junta Administrativa Colegio San Luis Gonzaga  (JACSLG)"]
[null,null,null,null,null,null,null,null,null,"14252","Junta  de Desarrollo Regional de la Zona Sur de la Provincia de Puntarenas (JUDESUR) "]
[null,null,null,null,null,null,null,null,null,"14253","Juntas de Educacion"]
[null,null,null,null,null,null,null,null,null,"14267","Oficina Nacional  de Semillas (ONS) "]
[null,null,null,null,null,null,null,null,null,"14275","Patronato Nacional de Ciegos  (PANACI)"]
[null,null,null,null,null,null,null,null,null,"14290","Patronato Nacional de la Infancia (PANI) "]
[null,null,null,null,null,null,null,null,null,"14300","Programa Integral de Mercadeo Agropecuario (PIMA)"]
[null,null,null,null,null,null,null,null,null,"14320","Servicio Nacional de Aguas Subterráneas, Riego y Avenamiento  (SENARA)"]
[null,null,null,null,null,null,null,null,null,"14326","Superintendencia de Telecomunicaciones (SUTEL) "]
[null,null,null,null,null,null,null,null,null,"14340","Universidad de Costa Rica  (UCR) "]
[null,null,null,null,null,null,null,null,null,"14341","Universidad Estatal a Distancia  (UNED)"]
[null,null,null,null,null,null,null,null,null,"14342","Universidad Nacional  (UNA)"]
[null,null,null,null,null,null,null,null,null,"14353","Universidad Técnica Nacional "]
[null,null,null,null,null,null,null,null,null,"14990","Sistema Nacional de Educación Superior (SINAES)"]
[null,null,null,null,null,null,null,null,null,"15000","GOBIERNOS LOCALES"]
[null,null,null,null,null,null,null,null,null,"15101","Municipalidad de San José "]
[null,null,null,null,null,null,null,null,null,"15102","Municipalidad de Escazú"]
[null,null,null,null,null,null,null,null,null,"15103","Municipalidad de Desamparados"]
[null,null,null,null,null,null,null,null,null,"15104","Municipalidad de Puriscal"]
[null,null,null,null,null,null,null,null,null,"15105","Municipalidad de Tarrazú"]
[null,null,null,null,null,null,null,null,null,"15106","Municipalidad de Aserrí"]
[null,null,null,null,null,null,null,null,null,"15107","Municipalidad de Mora"]
[null,null,null,null,null,null,null,null,null,"15108","Municipalidad de Goicoechea"]
[null,null,null,null,null,null,null,null,null,"15109","Municipalidad de Santa Ana"]
[null,null,null,null,null,null,null,null,null,"15110","Municipalidad de Alajuelita"]
[null,null,null,null,null,null,null,null,null,"15111","Municipalidad de Vásquez de Coronado"]
[null,null,null,null,null,null,null,null,null,"15112","Municipalidad de Acosta"]
[null,null,null,null,null,null,null,null,null,"15113","Municipalidad de Tibás"]
[null,null,null,null,null,null,null,null,null,"15114","Municipalidad de Moravia"]
[null,null,null,null,null,null,null,null,null,"15115","Municipalidad de Montes de Oca"]
[null,null,null,null,null,null,null,null,null,"15116","Municipalidad de Turrubares"]
[null,null,null,null,null,null,null,null,null,"15117","Municipalidad de Dota"]
[null,null,null,null,null,null,null,null,null,"15118","Municipalidad de Curridabat"]
[null,null,null,null,null,null,null,null,null,"15119","Municipalidad de Pérez Zeledón"]
[null,null,null,null,null,null,null,null,null,"15120","Municipalidad de León Cortés"]
[null,null,null,null,null,null,null,null,null,"15201","Municipalidad de Alajuela"]
[null,null,null,null,null,null,null,null,null,"15202","Municipalidad de San Ramón"]
[null,null,null,null,null,null,null,null,null,"15203","Municipalidad de Grecia"]
[null,null,null,null,null,null,null,null,null,"15204","Municipalidad de San Mateo"]
[null,null,null,null,null,null,null,null,null,"15205","Municipalidad de Atenas"]
[null,null,null,null,null,null,null,null,null,"15206","Municipalidad de Naranjo"]
[null,null,null,null,null,null,null,null,null,"15207","Municipalidad de Palmares"]
[null,null,null,null,null,null,null,null,null,"15208","Municipalidad de Poás"]
[null,null,null,null,null,null,null,null,null,"15209","Municipalidad de Orotina"]
[null,null,null,null,null,null,null,null,null,"15210","Municipalidad de San Carlos"]
[null,null,null,null,null,null,null,null,null,"15211","Municipalidad de Alfaro Ruíz"]
[null,null,null,null,null,null,null,null,null,"15212","Municipalidad de Valverde Vega"]
[null,null,null,null,null,null,null,null,null,"15213","Municipalidad de Upala"]
[null,null,null,null,null,null,null,null,null,"15214","Municipalidad de Los Chiles"]
[null,null,null,null,null,null,null,null,null,"15215","Municipalidad de Guatuso"]
[null,null,null,null,null,null,null,null,null,"15216","Municipalidad de Rio Cuarto"]
[null,null,null,null,null,null,null,null,null,"15220","Concejo Municipal de Distrito de Peñas Blancas de San Ramón"]
[null,null,null,null,null,null,null,null,null,"15301","Municipalidad de Cartago"]
[null,null,null,null,null,null,null,null,null,"15302","Municipalidad de Paraíso"]
[null,null,null,null,null,null,null,null,null,"15303","Municipalidad de La Unión"]
[null,null,null,null,null,null,null,null,null,"15304","Municipalidad de Jiménez"]
[null,null,null,null,null,null,null,null,null,"15305","Municipalidad de Turrialba"]
[null,null,null,null,null,null,null,null,null,"15306","Municipalidad de Alvarado"]
[null,null,null,null,null,null,null,null,null,"15307","Municipalidad de Oreamuno"]
[null,null,null,null,null,null,null,null,null,"15308","Municipalidad de El Guarco"]
[null,null,null,null,null,null,null,null,null,"15320","Concejo Municipal de Distrito de Cervantes de Alvarado"]
[null,null,null,null,null,null,null,null,null,"15321","Concejo Municipal de Distrito de Tucurrique de Jiménez "]
[null,null,null,null,null,null,null,null,null,"15401","Municipalidades de Heredia"]
[null,null,null,null,null,null,null,null,null,"15402","Municipalidades de Barva"]
[null,null,null,null,null,null,null,null,null,"15403","Municipalidad de Santo Domingo"]
[null,null,null,null,null,null,null,null,null,"15404","Municipalidad de Santa Barbara"]
[null,null,null,null,null,null,null,null,null,"15405","Municipalidad de San Rafael"]
[null,null,null,null,null,null,null,null,null,"15406","Municipalidad de San Isidro"]
[null,null,null,null,null,null,null,null,null,"15407","Municipalidad de Belén"]
[null,null,null,null,null,null,null,null,null,"15408","Municipalidad de Flores"]
[null,null,null,null,null,null,null,null,null,"15409","Municipalidad de San Pablo"]
[null,null,null,null,null,null,null,null,null,"15410","Municipalidad de Sarapiquí"]
[null,null,null,null,null,null,null,null,null,"15501","Municipalidad de Liberia"]
[null,null,null,null,null,null,null,null,null,"15502","Municipalidad de Nicoya"]
[null,null,null,null,null,null,null,null,null,"15503","Municipalidad de Santa Cruz"]
[null,null,null,null,null,null,null,null,null,"15504","Municipalidad de Bagases"]
[null,null,null,null,null,null,null,null,null,"15505","Municipalidad de Carrillo"]
[null,null,null,null,null,null,null,null,null,"15506","Municipalidad de Cañas"]
[null,null,null,null,null,null,null,null,null,"15507","Municipalidad de Abangares"]
[null,null,null,null,null,null,null,null,null,"15508","Municipalidad de Tilarán"]
[null,null,null,null,null,null,null,null,null,"15509","Municipalidad de Nandayure"]
[null,null,null,null,null,null,null,null,null,"15510","Municipalidad de La Cruz"]
[null,null,null,null,null,null,null,null,null,"15511","Municipalidad de Hojancha"]
[null,null,null,null,null,null,null,null,null,"15520","Concejo Municipal de Distrito de Colorado de Abangares"]
[null,null,null,null,null,null,null,null,null,"15601","Municipalidad de Puntarenas"]
[null,null,null,null,null,null,null,null,null,"15602","Municipalidad de Esparza"]
[null,null,null,null,null,null,null,null,null,"15603","Municipalidad de Buenos Aires"]
[null,null,null,null,null,null,null,null,null,"15604","Municipalidad de Montes de Oro"]
[null,null,null,null,null,null,null,null,null,"15605","Municipalidad de Osa"]
[null,null,null,null,null,null,null,null,null,"15606","Municipalidad de Aguirre"]
[null,null,null,null,null,null,null,null,null,"15607","Municipalidad de Golfito"]
[null,null,null,null,null,null,null,null,null,"15608","Municipalidad de Coto Brus"]
[null,null,null,null,null,null,null,null,null,"15609","Municipalidad de Parrita"]
[null,null,null,null,null,null,null,null,null,"15610","Municipalidad de Corredores"]
[null,null,null,null,null,null,null,null,null,"15611","Municipalidad de Garabito"]
[null,null,null,null,null,null,null,null,null,"15620","Concejo Municipal de Distrito de Cóbano Puntarenas"]
[null,null,null,null,null,null,null,null,null,"15621","Concejo Municipal de Distrito de Monteverde de Puntarenas"]
[null,null,null,null,null,null,null,null,null,"15622","Concejo Municipal de Distrito de Lepanto de Puntarenas"]
[null,null,null,null,null,null,null,null,null,"15623","Concejo Municipal de Distrito de Paquera de Puntarenas"]
[null,null,null,null,null,null,null,null,null,"15701","Municipalidades de Limón"]
[null,null,null,null,null,null,null,null,null,"15702","Municipalidad de Pococí"]
[null,null,null,null,null,null,null,null,null,"15703","Municipalidad de Siquirres"]
[null,null,null,null,null,null,null,null,null,"15704","Municipalidad de Talamanca"]
[null,null,null,null,null,null,null,null,null,"15705","Municipalidad de Matina"]
[null,null,null,null,null,null,null,null,null,"15706","Municipalidad de Guácimo"]
[null,null,null,null,null,null,null,null,null,"15910","Comités Cantonales de Deportes y Recreación"]
[null,null,null,null,null,null,null,null,null,"15911","Convenio Cooperativo Intermunicipal"]
[null,null,null,null,null,null,null,null,null,"15920","Federación de Gobiernos Locales Costarricenses Fronterizos con Nicaragua"]
[null,null,null,null,null,null,null,null,null,"15921","Federación de Municipalidades de Cantones Productores de Banano (CAPROBA)"]
[null,null,null,null,null,null,null,null,null,"15922","Federación de Municipalidades de  la Provincia de Cartago   (FEMUCARTAGO)"]
[null,null,null,null,null,null,null,null,null,"15924","Federación de Municipalidades y Consejos Municipales de Distrito del Pacífico (FEMUPAC)"]
[null,null,null,null,null,null,null,null,null,"15925","Federación Metropolitana  de Municipalidades de San José   (FEMETRON)"]
[null,null,null,null,null,null,null,null,null,"15926","Federación de Consejos Municipales de Distrito "]
[null,null,null,null,null,null,null,null,null,"15927","Federación de Municipalidades de Heredia."]
[null,null,null,null,null,null,null,null,null,"15928","Federación de Municipalidades de Guanacaste"]
[null,null,null,null,null,null,null,null,null,"15929","Federación Occidental de Municipalidades de Alajuela (FEDOMA) "]
[null,null,null,null,null,null,null,null,null,"15930","Federación de Municipalidades de los Santos (FEMUSAN)"]
[null,null,null,null,null,null,null,null,null,"15933","Federación de Municipalidades de la Región Sur de la Provincia de  Puntarenas  (FEDEMSUR)"]
[null,null,null,null,null,null,null,null,null,"15940","Junta Administrativa Cementerios de Goicoechea"]
[null,null,null,null,null,null,null,null,null,"15941","Junta Administradora del Cementerio General y Las Rosas de Alajuela "]
[null,null,null,null,null,null,null,null,null,"15944","Junta Administrativa de Cementerios de Limón "]
[null,null,null,null,null,null,null,null,null,"15946","Junta de Protección Social de Cartago"]
[null,null,null,null,null,null,null,null,null,"15950","Liga de Municipalidades de Alajuela Occidental"]
[null,null,null,null,null,null,null,null,null,"15980","Unión Nacional de Gobiernos Locales"]
[null,null,null,null,null,null,null,null,null,"16000","EMPRESAS PÚBLICAS NO FINANCIERAS NACIONALES"]
[null,null,null,null,null,null,null,null,null,"16100","Compañía Nacional de Fuerza y Luz S.A. (CNFL) "]
[null,null,null,null,null,null,null,null,null,"16101","Consejo Nacional de Producción (CNP)  "]
[null,null,null,null,null,null,null,null,null,"16120","Correos de Costa Rica S.A. (CORREOS) "]
[null,null,null,null,null,null,null,null,null,"16145","Hospital del Trauma S.A."]
[null,null,null,null,null,null,null,null,null,"16150","Instituto Costarricense de Acueductos y Alcantarillados (ICAA)"]
[null,null,null,null,null,null,null,null,null,"16151","Instituto Costarricense de Electricidad (ICE)"]
[null,null,null,null,null,null,null,null,null,"16152","Instituto Costarricense de Ferrocarriles (INCOFER)"]
[null,null,null,null,null,null,null,null,null,"16153","Instituto Costarricense de Puertos del Pacífico (INCOP) "]
[null,null,null,null,null,null,null,null,null,"16170","Junta de Administración Portuaria y de Desarrollo de la Vertiente Atlántica  (JAPDEVA) "]
[null,null,null,null,null,null,null,null,null,"16171","Junta de Protección Social (JPS) "]
[null,null,null,null,null,null,null,null,null,"16180","Radiográfica Costarricense S.A. (RACSA)"]
[null,null,null,null,null,null,null,null,null,"16181","Refinadora Costarricense de Petróleo S.A. (RECOPE S.A)"]
[null,null,null,null,null,null,null,null,null,"16190","Sistema Nacional de Radio y Televisión Cultural  S.A (SINART  S.A)"]
[null,null,null,null,null,null,null,null,null,"17000","EMPRESAS PÚBLICAS NO FINANCIERAS MUNICIPALES"]
[null,null,null,null,null,null,null,null,null,"17100","Empresa de Servicios Públicos de Heredia S.A. (ESPH) "]
[null,null,null,null,null,null,null,null,null,"17150","Empresa Hidroeléctrica los Negros S.A. (EHLN S.A.)"]
[null,null,null,null,null,null,null,null,null,"17200","Junta Administrativa del Servicio Eléctrico de Cartago (JASEC) "]
[null,null,null,null,null,null,null,null,null,"20000","INSTITUCIONES PÚBLICAS FINANCIERAS"]
[null,null,null,null,null,null,null,null,null,"21100","Banco Crédito Agrícola de Cartago (BCAC)"]
[null,null,null,null,null,null,null,null,null,"21101","Banco de Costa Rica (BCR)"]
[null,null,null,null,null,null,null,null,null,"21102","Banco Internacional de Costa Rica  S.A (BICSA)"]
[null,null,null,null,null,null,null,null,null,"21103","Banco Nacional de Costa Rica (BNCR)"]
[null,null,null,null,null,null,null,null,null,"22120","Almacén Fiscal  Agrícola de Cartago S.A. "]
[null,null,null,null,null,null,null,null,null,"22121","Bancrédito Agencia de Seguros S.A. "]
[null,null,null,null,null,null,null,null,null,"22122","Banco Crédito Agrícola de Cartago-Puesto de Bolsa S.A."]
[null,null,null,null,null,null,null,null,null,"22123","Banco Crédito Agrícola de Cartago-Sociedad Administradora Fondos Inversión S.A."]
[null,null,null,null,null,null,null,null,null,"22124","BCR – Pensión Operadora de Planes de  Pensiones Complementarias S.A."]
[null,null,null,null,null,null,null,null,null,"22125","BCR-Sociedad Administradora de Fondos de Inversión S.A."]
[null,null,null,null,null,null,null,null,null,"22126","BCR Valores S.A."]
[null,null,null,null,null,null,null,null,null,"22128","BN -Sociedad Administradora de Fondos de Inversión S.A."]
[null,null,null,null,null,null,null,null,null,"22129","BN -Valores Puesto de Bolsa S.A."]
[null,null,null,null,null,null,null,null,null,"22130","BN -Vital Operadora de Planes de Pensiones Complementarias S.A."]
[null,null,null,null,null,null,null,null,null,"22131","BN - Procesadora de Medios de Pago S.A."]
[null,null,null,null,null,null,null,null,null,"22136","BCR Corredora de Seguros, S.A"]
[null,null,null,null,null,null,null,null,null,"22150","Comisión Nacional de Préstamos para la Educación (CONAPE)"]
[null,null,null,null,null,null,null,null,null,"22160","Depósito Agrícola de Cartago S.A. "]
[null,null,null,null,null,null,null,null,null,"22165","Fondo de Desarrollo de la Provincia de Limón  (FODELI)"]
[null,null,null,null,null,null,null,null,null,"22190","Instituto Nacional de Fomento Cooperativo (INFOCOOP)"]
[null,null,null,null,null,null,null,null,null,"22191","Instituto Nacional de Seguros (INS)"]
[null,null,null,null,null,null,null,null,null,"22192","INS-Pensiones Operadora de Pensiones Complementarias S.A"]
[null,null,null,null,null,null,null,null,null,"22193","INS Valores Puesto de Bolsa S.A."]
[null,null,null,null,null,null,null,null,null,"22194","Instituto Nacional de Vivienda y Urbanismo (INVU)"]
[null,null,null,null,null,null,null,null,null,"22195","INS Inversiones Sociedad Administradora de Fondos de Inversión S.A. (SAFI) "]
[null,null,null,null,null,null,null,null,null,"22198","INS Internacional S.A."]
[null,null,null,null,null,null,null,null,null,"22205","INS Intermediario de Seguros S.A."]
[null,null,null,null,null,null,null,null,null,"22208","INSurance Servicios S.A."]
[null,null,null,null,null,null,null,null,null,"22211","INS – VIDA S.A."]
[null,null,null,null,null,null,null,null,null,"22230","Operadora de Pensiones Complementarias y de Capitalización Laboral de la  C.C.S.S. S.A "]
[null,null,null,null,null,null,null,null,null,"22231","Operadora de Planes Pensiones Complementarias Banco  Popular Desarrollo Comunal S.A "]
[null,null,null,null,null,null,null,null,null,"22239","Popular Sociedad Agencia de Seguros S.A"]
[null,null,null,null,null,null,null,null,null,"22240","Popular Sociedad de Fondos de Inversión S.A"]
[null,null,null,null,null,null,null,null,null,"22241","Popular Valores Puesto de Bolsa S.A"]
[null,null,null,null,null,null,null,null,null,"23100","Banco Central de Costa Rica (BCCR)"]
[null,null,null,null,null,null,null,null,null,"23150","Consejo Nacional de Supervisión del Sistema Financiero (CONASSIF)"]
[null,null,null,null,null,null,null,null,null,"23155","Consejo Rector del Sistema de Banca para el Desarrollo "]
[null,null,null,null,null,null,null,null,null,"23200","Superintendencia General de Entidades Financieras (SUGEF)"]
[null,null,null,null,null,null,null,null,null,"23201","Superintendencia General de Valores (SUGEVAL)"]
[null,null,null,null,null,null,null,null,null,"23202","Superintendencia General de Pensiones (SUPEN)"]
[null,null,null,null,null,null,null,null,null,"23208","Superintendencia General de Seguros (SUGESE)"]
[null,null,null,null,null,null,null,null,null,"31000","ENTES PUBLICOS ESTATALES"]
[null,null,null,null,null,null,null,null,null,"31100","Academia Nacional de Ciencias   "]
[null,null,null,null,null,null,null,null,null,"31121","Casa Hogar de la Tía Tere "]
[null,null,null,null,null,null,null,null,null,"32130","Colegios Profesionales "]
[null,null,null,null,null,null,null,null,null,"31160","Consejo Nacional de cooperativas ( CONACOOP)"]
[null,null,null,null,null,null,null,null,null,"31180","Corporación  Arrocera Nacional  (CONARROZ)  "]
[null,null,null,null,null,null,null,null,null,"31182","Corporación Ganadera  "]
[null,null,null,null,null,null,null,null,null,"31185","Corporacion Hortícola Nacional ( CHN )  "]
[null,null,null,null,null,null,null,null,null,"31200","Ente Costarricense de Acreditación "]
[null,null,null,null,null,null,null,null,null,"31211","Fondo Nacional de Estabilización Cafetalera (FONECAFE)  "]
[null,null,null,null,null,null,null,null,null,"31215","Fondo de Apoyo para Educación Superior y Técnica del  Puntarenense  "]
[null,null,null,null,null,null,null,null,null,"31220","Instituto del Café de Costa Rica (ICAFE)   "]
[null,null,null,null,null,null,null,null,null,"31254","Junta de Pensiones y Jubilaciones del Magisterio Nacional  (JUPEMA)   "]
[null,null,null,null,null,null,null,null,null,"31260","Liga Agrícola Industrial de la Caña (LAICA)  "]
[null,null,null,null,null,null,null,null,null,"31270","Oficina Nacional Forestal  (ONAFO)  "]
[null,null,null,null,null,null,null,null,null,"31301","Promotora de Comercio Exterior (PROCOMER)  "]
[null,null,null,null,null,null,null,null,null,"31114","Corporación Bananera Nacional S.A  (CORBANA) "]
[null,null,null,null,null,null,null,null,null,"31130","Editorial Costa Rica (ECR)  "]
[null,null,null,null,null,null,null,null,null,"31104","Banco Popular y de Desarrollo Comunal (BPDC)  "]
[null,null,null,null,null,null,null,null,null,"31127","Banco Hipotecario de la Vivienda (BANHVI)  "]
[null,null,null,null,null,null,null,null,null,"12505","Agencia de proteccion de datos de los habitantes"]
[null,null,null,null,null,null,null,null,null,"12581","Consejo Nacional de Personas con Discapacidad ( CONAPDIS)"]
[null,null,null,null,null,null,null,null,null,"14296","Patronato Nacional de Rehabilitacion ( PANARE)"]
[null,null,null,null,null,null,null,null,null,"32130","Colegios Profesionales "]

{"sheet":"BC","index":2,"n_rows":882,"n_cols":8,"rows_kept":882,"cut":false,"hidden":false,"merged":[]}
["ENTIDAD","CODIGO SEGMENTO2","CUENTA (REPORTAR MÁXIMO A NIVEL 8)","NOMBRE CUENTA","SALDO INICIAL","DEBITOS PERIODO","CREDITOS PERIODO","SALDO FINAL"]
[{"$f":"IFERROR(IF(B2<>0,Data!$B$2,\"\"),\"\")","v":"15603"},{"$f":"BalanceComprobacion!A10","v":3.1},{"$f":"BalanceComprobacion!B10","v":"1."},{"$f":"BalanceComprobacion!C10","v":"ACTIVO"},{"$f":"BalanceComprobacion!D10","v":165832845328.79001},{"$f":"BalanceComprobacion!E10","v":8752435484.8199997},{"$f":"BalanceComprobacion!F10","v":6125581688.3800001},{"$f":"BalanceComprobacion!G10","v":168459699125.23001}]
[{"$f":"IFERROR(IF(B3<>0,Data!$B$2,\"\"),\"\")","v":"15603"},{"$f":"BalanceComprobacion!A49","v":3.1},{"$f":"BalanceComprobacion!B49","v":"1.1.3.04.01.04.0."},{"$f":"BalanceComprobacion!C49","v":"Servicios comunitarios a cobrar c/p"},{"$f":"BalanceComprobacion!D49","v":179741182.80000001},{"$f":"BalanceComprobacion!E49","v":436629150.75999999},{"$f":"BalanceComprobacion!F49","v":340881574.04000002},{"$f":"BalanceComprobacion!G49","v":275488759.51999998}]
[{"$f":"IFERROR(IF(B4<>0,Data!$B$2,\"\"),\"\")","v":"15603"},{"$f":"BalanceComprobacion!A50","v":3.1},{"$f":"BalanceComprobacion!B50","v":"1.1.3.04.01.04.0.99999"},{"$f":"BalanceComprobacion!C50","v":"Servicios comunitarios a cobrar c/p"},{"$f":"BalanceComprobacion!D50","v":179741182.80000001},{"$f":"BalanceComprobacion!E50","v":436629150.75999999},{"$f":"BalanceComprobacion!F50","v":340881574.04000002},{"$f":"BalanceComprobacion!G50","v":275488759.51999998}]
[{"$f":"IFERROR(IF(B5<>0,Data!$B$2,\"\"),\"\")","v":"15603"},{"$f":"BalanceComprobacion!A51","v":3.1},{"$f":"BalanceComprobacion!B51","v":"1.1.3.04.02."},{"$f":"BalanceComprobacion!C51","v":"Derechos administrativos a cobrar c/p"},{"$f":"BalanceComprobacion!D51","v":442455},{"$f":"BalanceComprobacion!E51","v":619478.32999999996},{"$f":"BalanceComprobacion!F51","v":590495},{"$f":"BalanceComprobacion!G51","v":471438.33}]
[{"$f":"IFERROR(IF(B6<>0,Data!$B$2,\"\"),\"\")","v":"15603"},{"$f":"BalanceComprobacion!A52","v":3.1},{"$f":"BalanceComprobacion!B52","v":"1.1.3.04.02.01."},{"$f":"BalanceComprobacion!C52","v":"Derechos administrativos a los servicios de transporte a cobrar c/p"},{"$f":"BalanceComprobacion!D52","v":50000},{"$f":"BalanceComprobacion!E52","v":390000},{"$f":"BalanceComprobacion!F52","v":400000},{"$f":"BalanceComprobacion!G52","v":40000}]
[{"$f":"IFERROR(IF(B7<>0,Data!$B$2,\"\"),\"\")","v":"15603"},{"$f":"BalanceComprobacion!A53","v":3.1},{"$f":"BalanceComprobacion!B53","v":"1.1.3.04.02.01.0."},{"$f":"BalanceComprobacion!C53","v":"Derechos administrativos a los servicios de transporte a cobrar c/p"},{"$f":"BalanceComprobacion!D53","v":50000},{"$f":"BalanceComprobacion!E53","v":390000},{"$f":"BalanceComprobacion!F53","v":400000},{"$f":"BalanceComprobacion!G53","v":40000}]
[{"$f":"IFERROR(IF(B8<>0,Data!$B$2,\"\"),\"\")","v":"15603"},{"$f":"BalanceComprobacion!A54","v":3.1},{"$f":"BalanceComprobacion!B54","v":"1.1.3.04.02.01.0.99999"},{"$f":"BalanceComprobacion!C54","v":"Derechos administrativos a los servicios de transporte a cobrar c/p  Derecho de piso  uso terminal"},{"$f":"BalanceComprobacion!D54","v":50000},{"$f":"BalanceComprobacion!E54","v":390000},{"$f":"BalanceComprobacion!F54","v":400000},{"$f":"BalanceComprobacion!G54","v":40000}]
[{"$f":"IFERROR(IF(B9<>0,Data!$B$2,\"\"),\"\")","v":"15603"},{"$f":"BalanceComprobacion!A55","v":3.1},{"$f":"BalanceComprobacion!B55","v":"1.1.3.04.02.99."},{"$f":"BalanceComprobacion!C55","v":"Otros derechos administrativos a cobrar c/p"},{"$f":"BalanceComprobacion!D55","v":392455},{"$f":"BalanceComprobacion!E55","v":229478.33},{"$f":"BalanceComprobacion!F55","v":190495},{"$f":"BalanceComprobacion!G55","v":431438.33}]
[{"$f":"IFERROR(IF(B10<>0,Data!$B$2,\"\"),\"\")","v":"15603"},{"$f":"BalanceComprobacion!A56","v":3.1},{"$f":"BalanceComprobacion!B56","v":"1.1.3.04.02.99.0."},{"$f":"BalanceComprobacion!C56","v":"Otros derechos administrativos a cobrar c/p"},{"$f":"BalanceComprobacion!D56","v":392455},{"$f":"BalanceComprobacion!E56","v":229478.33},{"$f":"BalanceComprobacion!F56","v":190495},{"$f":"BalanceComprobacion!G56","v":431438.33}]
[{"$f":"IFERROR(IF(B11<>0,Data!$B$2,\"\"),\"\")","v":"15603"},{"$f":"BalanceComprobacion!A57","v":3.1},{"$f":"BalanceComprobacion!B57","v":"1.1.3.04.02.99.0.99999"},{"$f":"BalanceComprobacion!C57","v":"Otros derechos administrativos a cobrar c/p Derecho cementerio"},{"$f":"BalanceComprobacion!D57","v":392455},{"$f":"BalanceComprobacion!E57","v":229478.33},{"$f":"BalanceComprobacion!F57","v":190495},{"$f":"BalanceComprobacion!G57","v":431438.33}]
[{"$f":"IFERROR(IF(B12<>0,Data!$B$2,\"\"),\"\")","v":"15603"},{"$f":"BalanceComprobacion!A58","v":3.1},{"$f":"BalanceComprobacion!B58","v":"1.1.3.06."},{"$f":"BalanceComprobacion!C58","v":"Transferencias a cobrar a c/p"},{"$f":"BalanceComprobacion!D58","v":0},{"$f":"BalanceComprobacion!E58","v":3784139549.0700002},{"$f":"BalanceComprobacion!F58","v":1261372841.0899999},{"$f":"BalanceComprobacion!G58","v":2522766707.98}]
[{"$f":"IFERROR(IF(B13<>0,Data!$B$2,\"\"),\"\")","v":"15603"},{"$f":"BalanceComprobacion!A59","v":3.1},{"$f":"BalanceComprobacion!B59","v":"1.1.3.06.02."},{"$f":"BalanceComprobacion!C59","v":"Transferencias del sector público interno a cobrar c/p"},{"$f":"BalanceComprobacion!D59","v":0},{"$f":"BalanceComprobacion!E59","v":3784139549.0700002},{"$f":"BalanceComprobacion!F59","v":1261372841.0899999},{"$f":"BalanceComprobacion!G59","v":2522766707.98}]
[{"$f":"IFERROR(IF(B14<>0,Data!$B$2,\"\"),\"\")","v":"15603"},{"$f":"BalanceComprobacion!A60","v":3.1},{"$f":"BalanceComprobacion!B60","v":"1.1.3.06.02.01."},{"$f":"BalanceComprobacion!C60","v":"Transferencias del Gobierno Central a cobrar c/p"},{"$f":"BalanceComprobacion!D60","v":0},{"$f":"BalanceComprobacion!E60","v":3772816719},{"$f":"BalanceComprobacion!F60","v":1257605572.96},{"$f":"BalanceComprobacion!G60","v":2515211146.04}]
[{"$f":"IFERROR(IF(B15<>0,Data!$B$2,\"\"),\"\")","v":"15603"},{"$f":"BalanceComprobacion!A61","v":3.1},{"$f":"BalanceComprobacion!B61","v":"1.1.3.06.02.01.0."},{"$f":"BalanceComprobacion!C61","v":"Transferencias del Gobierno Central a cobrar c/p"},{"$f":"BalanceComprobacion!D61","v":0},{"$f":"BalanceComprobacion!E61","v":3772816719},{"$f":"BalanceComprobacion!F61","v":1257605572.96},{"$f":"BalanceComprobacion!G61","v":2515211146.04}]
[{"$f":"IFERROR(IF(B16<>0,Data!$B$2,\"\"),\"\")","v":"15603"},{"$f":"BalanceComprobacion!A62","v":3.1},{"$f":"BalanceComprobacion!B62","v":"1.1.3.06.02.01.0.11206"},{"$f":"BalanceComprobacion!C62","v":"Ministerio de Hacienda"},{"$f":"BalanceComprobacion!D62","v":0},{"$f":"BalanceComprobacion!E62","v":3772816719},{"$f":"BalanceComprobacion!F62","v":1257605572.96},{"$f":"BalanceComprobacion!G62","v":2515211146.04}]
[{"$f":"IFERROR(IF(B17<>0,Data!$B$2,\"\"),\"\")","v":"15603"},{"$f":"BalanceComprobacion!A63","v":3.1},{"$f":"BalanceComprobacion!B63","v":"1.1.3.06.02.03."},{"$f":"BalanceComprobacion!C63","v":"Transferencias de Instituciones Descentralizadas no Empresariales a cobrar c/p"},{"$f":"BalanceComprobacion!D63","v":0},{"$f":"BalanceComprobacion!E63","v":11322830.07},{"$f":"BalanceComprobacion!F63","v":3767268.13},{"$f":"BalanceComprobacion!G63","v":7555561.9400000004}]
[{"$f":"IFERROR(IF(B18<>0,Data!$B$2,\"\"),\"\")","v":"15603"},{"$f":"BalanceComprobacion!A64","v":3.1},{"$f":"BalanceComprobacion!B64","v":"1.1.3.06.02.03.0."},{"$f":"BalanceComprobacion!C64","v":"Transferencias de Instituciones Descentralizadas no Empresariales a cobrar c/p"},{"$f":"BalanceComprobacion!D64","v":0},{"$f":"BalanceComprobacion!E64","v":11322830.07},{"$f":"BalanceComprobacion!F64","v":3767268.13},{"$f":"BalanceComprobacion!G64","v":7555561.9400000004}]
[{"$f":"IFERROR(IF(B19<>0,Data!$B$2,\"\"),\"\")","v":"15603"},{"$f":"BalanceComprobacion!A65","v":3.1},{"$f":"BalanceComprobacion!B65","v":"1.1.3.06.02.03.0.14226"},{"$f":"BalanceComprobacion!C65","v":"Transferencias de Instituciones Descentralizadas no Empresariales a cobrar c/p (Aporte IFAM Licores Nacionales y Ext)"},{"$f":"BalanceComprobacion!D65","v":0},{"$f":"BalanceComprobacion!E65","v":11322830.07},{"$f":"BalanceComprobacion!F65","v":3767268.13},{"$f":"BalanceComprobacion!G65","v":7555561.9400000004}]
[{"$f":"IFERROR(IF(B20<>0,Data!$B$2,\"\"),\"\")","v":"15603"},{"$f":"BalanceComprobacion!A66","v":3.1},{"$f":"BalanceComprobacion!B66","v":"1.1.3.98."},{"$f":"BalanceComprobacion!C66","v":"Otras cuentas a cobrar a corto plazo"},{"$f":"BalanceComprobacion!D66","v":2767182.6},{"$f":"BalanceComprobacion!E66","v":4441310.0999999996},{"$f":"BalanceComprobacion!F66","v":2519491.1},{"$f":"BalanceComprobacion!G66","v":4689001.5999999996}]
[{"$f":"IFERROR(IF(B21<>0,Data!$B$2,\"\"),\"\")","v":"15603"},{"$f":"BalanceComprobacion!A67","v":3.1},{"$f":"BalanceComprobacion!B67","v":"1.1.3.98.01."},{"$f":"BalanceComprobacion!C67","v":"Multas, sanciones, remates y confiscaciones de origen no tributario a cobrar c/p"},{"$f":"BalanceComprobacion!D67","v":2267182.6},{"$f":"BalanceComprobacion!E67","v":4441310.0999999996},{"$f":"BalanceComprobacion!F67","v":2519491.1},{"$f":"BalanceComprobacion!G67","v":4189001.6}]
[{"$f":"IFERROR(IF(B22<>0,Data!$B$2,\"\"),\"\")","v":"15603"},{"$f":"BalanceComprobacion!A68","v":3.1},{"$f":"BalanceComprobacion!B68","v":"1.1.3.98.01.01."},{"$f":"BalanceComprobacion!C68","v":"Multas y sanciones administrativas a cobrar c/p"},{"$f":"BalanceComprobacion!D68","v":2267182.6},{"$f":"BalanceComprobacion!E68","v":4441310.0999999996},{"$f":"BalanceComprobacion!F68","v":2519491.1},{"$f":"BalanceComprobacion!G68","v":4189001.6}]
[{"$f":"IFERROR(IF(B23<>0,Data!$B$2,\"\"),\"\")","v":"15603"},{"$f":"BalanceComprobacion!A69","v":3.1},{"$f":"BalanceComprobacion!B69","v":"1.1.3.98.01.01.0."},{"$f":"BalanceComprobacion!C69","v":"Multas y sanciones administrativas a cobrar c/p"},{"$f":"BalanceComprobacion!D69","v":2267182.6},{"$f":"BalanceComprobacion!E69","v":4441310.0999999996},{"$f":"BalanceComprobacion!F69","v":2519491.1},{"$f":"BalanceComprobacion!G69","v":4189001.6}]
[{"$f":"IFERROR(IF(B24<>0,Data!$B$2,\"\"),\"\")","v":"15603"},{"$f":"BalanceComprobacion!A70","v":3.1},{"$f":"BalanceComprobacion!B70","v":"1.1.3.98.01.01.0.99999"},{"$f":"BalanceComprobacion!C70","v":"Multas y sanciones administrativas a cobrar c/p"},{"$f":"BalanceComprobacion!D70","v":2267182.6},{"$f":"BalanceComprobacion!E70","v":4441310.0999999996},{"$f":"BalanceComprobacion!F70","v":2519491.1},{"$f":"BalanceComprobacion!G70","v":4189001.6}]
[{"$f":"IFERROR(IF(B25<>0,Data!$B$2,\"\"),\"\")","v":"15603"},{"$f":"BalanceComprobacion!A71","v":3.1},{"$f":"BalanceComprobacion!B71","v":"1.1.3.98.03."},{"$f":"BalanceComprobacion!C71","v":"Depósitos en garantía c/p"},{"$f":"BalanceComprobacion!D71","v":500000},{"$f":"BalanceComprobacion!E71","v":0},{"$f":"BalanceComprobacion!F71","v":0},{"$f":"BalanceComprobacion!G71","v":500000}]
[{"$f":"IFERROR(IF(B26<>0,Data!$B$2,\"\"),\"\")","v":"15603"},{"$f":"BalanceComprobacion!A72","v":3.1},{"$f":"BalanceComprobacion!B72","v":"1.1.3.98.03.02."},{"$f":"BalanceComprobacion!C72","v":"Depósitos en garantía en el sector público interno c/p"},{"$f":"BalanceComprobacion!D72","v":500000},{"$f":"BalanceComprobacion!E72","v":0},{"$f":"BalanceComprobacion!F72","v":0},{"$f":"BalanceComprobacion!G72","v":500000}]
[{"$f":"IFERROR(IF(B27<>0,Data!$B$2,\"\"),\"\")","v":"15603"},{"$f":"BalanceComprobacion!A73","v":3.1},{"$f":"BalanceComprobacion!B73","v":"1.1.3.98.03.02.0."},{"$f":"BalanceComprobacion!C73","v":"Depósitos en garantía en el sector público interno c/p"},{"$f":"BalanceComprobacion!D73","v":500000},{"$f":"BalanceComprobacion!E73","v":0},{"$f":"BalanceComprobacion!F73","v":0},{"$f":"BalanceComprobacion!G73","v":500000}]
[{"$f":"IFERROR(IF(B28<>0,Data!$B$2,\"\"),\"\")","v":"15603"},{"$f":"BalanceComprobacion!A74","v":3.1},{"$f":"BalanceComprobacion!B74","v":"1.1.3.98.03.02.0.99999"},{"$f":"BalanceComprobacion!C74","v":"Depósitos en garantía en el sector público interno c/p"},{"$f":"BalanceComprobacion!D74","v":500000},{"$f":"BalanceComprobacion!E74","v":0},{"$f":"BalanceComprobacion!F74","v":0},{"$f":"BalanceComprobacion!G74","v":500000}]
[{"$f":"IFERROR(IF(B29<>0,Data!$B$2,\"\"),\"\")","v":"15603"},{"$f":"BalanceComprobacion!A75","v":3.1},{"$f":"BalanceComprobacion!B75","v":"1.1.3.99."},{"$f":"BalanceComprobacion!C75","v":"Previsiones para deterioro de cuentas a cobrar a corto plazo *"},{"$f":"BalanceComprobacion!D75","v":-175377897.37},{"$f":"BalanceComprobacion!E75","v":0},{"$f":"BalanceComprobacion!F75","v":0},{"$f":"BalanceComprobacion!G75","v":-175377897.37}]
[{"$f":"IFERROR(IF(B30<>0,Data!$B$2,\"\"),\"\")","v":"15603"},{"$f":"BalanceComprobacion!A76","v":3.1},{"$f":"BalanceComprobacion!B76","v":"1.1.3.99.01."},{"$f":"BalanceComprobacion!C76","v":"Previsiones para impuestos a cobrar c/p *"},{"$f":"BalanceComprobacion!D76","v":-116983004.63},{"$f":"BalanceComprobacion!E76","v":0},{"$f":"BalanceComprobacion!F76","v":0},{"$f":"BalanceComprobacion!G76","v":-116983004.63}]
[{"$f":"IFERROR(IF(B31<>0,Data!$B$2,\"\"),\"\")","v":"15603"},{"$f":"BalanceComprobacion!A77","v":3.1},{"$f":"BalanceComprobacion!B77","v":"1.1.3.99.01.02."},{"$f":"BalanceComprobacion!C77","v":"Previsiones para impuestos sobre la propiedad a cobrar c/p *"},{"$f":"BalanceComprobacion!D77","v":-106283608.29000001},{"$f":"BalanceComprobacion!E77","v":0},{"$f":"BalanceComprobacion!F77","v":0},{"$f":"BalanceComprobacion!G77","v":-106283608.29000001}]
[{"$f":"IFERROR(IF(B32<>0,Data!$B$2,\"\"),\"\")","v":"15603"},{"$f":"BalanceComprobacion!A78","v":3.1},{"$f":"BalanceComprobacion!B78","v":"1.1.3.99.01.02.0."},{"$f":"BalanceComprobacion!C78","v":"Previsiones para impuestos sobre la propiedad a cobrar c/p *"},{"$f":"BalanceComprobacion!D78","v":-106283608.29000001},{"$f":"BalanceComprobacion!E78","v":0},{"$f":"BalanceComprobacion!F78","v":0},{"$f":"BalanceComprobacion!G78","v":-106283608.29000001}]
[{"$f":"IFERROR(IF(B33<>0,Data!$B$2,\"\"),\"\")","v":"15603"},{"$f":"BalanceComprobacion!A79","v":3.1},{"$f":"BalanceComprobacion!B79","v":"1.1.3.99.01.02.0.99999"},{"$f":"BalanceComprobacion!C79","v":"Previsiones para impuestos sobre la propiedad a cobrar c/p *"},{"$f":"BalanceComprobacion!D79","v":-106283608.29000001},{"$f":"BalanceComprobacion!E79","v":0},{"$f":"BalanceComprobacion!F79","v":0},{"$f":"BalanceComprobacion!G79","v":-106283608.29000001}]
[{"$f":"IFERROR(IF(B34<>0,Data!$B$2,\"\"),\"\")","v":"15603"},{"$f":"BalanceComprobacion!A80","v":3.1},{"$f":"BalanceComprobacion!B80","v":"1.1.3.99.01.03."},{"$f":"BalanceComprobacion!C80","v":"Previsiones para impuestos sobre bienes y servicios a cobrar c/p *"},{"$f":"BalanceComprobacion!D80","v":-9270015.0099999998},{"$f":"BalanceComprobacion!E80","v":0},{"$f":"BalanceComprobacion!F80","v":0},{"$f":"BalanceComprobacion!G80","v":-9270015.0099999998}]
[{"$f":"IFERROR(IF(B35<>0,Data!$B$2,\"\"),\"\")","v":"15603"},{"$f":"BalanceComprobacion!A81","v":3.1},{"$f":"BalanceComprobacion!B81","v":"1.1.3.99.01.03.0."},{"$f":"BalanceComprobacion!C81","v":"Previsiones para impuestos sobre bienes y servicios a cobrar c/p *"},{"$f":"BalanceComprobacion!D81","v":-9270015.0099999998},{"$f":"BalanceComprobacion!E81","v":0},{"$f":"BalanceComprobacion!F81","v":0},{"$f":"BalanceComprobacion!G81","v":-9270015.0099999998}]
[{"$f":"IFERROR(IF(B36<>0,Data!$B$2,\"\"),\"\")","v":"15603"},{"$f":"BalanceComprobacion!A82","v":3.1},{"$f":"BalanceComprobacion!B82","v":"1.1.3.99.01.03.0.99999"},{"$f":"BalanceComprobacion!C82","v":"Previsiones para impuestos sobre bienes y servicios a cobrar c/p *"},{"$f":"BalanceComprobacion!D82","v":-9270015.0099999998},{"$f":"BalanceComprobacion!E82","v":0},{"$f":"BalanceComprobacion!F82","v":0},{"$f":"BalanceComprobacion!G82","v":-9270015.0099999998}]
[{"$f":"IFERROR(IF(B37<>0,Data!$B$2,\"\"),\"\")","v":"15603"},{"$f":"BalanceComprobacion!A83","v":3.1},{"$f":"BalanceComprobacion!B83","v":"1.1.3.99.01.99."},{"$f":"BalanceComprobacion!C83","v":"Previsiones para otros impuestos a cobrar c/p *"},{"$f":"BalanceComprobacion!D83","v":-1429381.33},{"$f":"BalanceComprobacion!E83","v":0},{"$f":"BalanceComprobacion!F83","v":0},{"$f":"BalanceComprobacion!G83","v":-1429381.33}]
[{"$f":"IFERROR(IF(B38<>0,Data!$B$2,\"\"),\"\")","v":"15603"},{"$f":"BalanceComprobacion!A84","v":3.1},{"$f":"BalanceComprobacion!B84","v":"1.1.3.99.01.99.0."},{"$f":"BalanceComprobacion!C84","v":"Previsiones para otros impuestos a cobrar c/p *"},{"$f":"BalanceComprobacion!D84","v":-1429381.33},{"$f":"BalanceComprobacion!E84","v":0},{"$f":"BalanceComprobacion!F84","v":0},{"$f":"BalanceComprobacion!G84","v":-1429381.33}]
[{"$f":"IFERROR(IF(B39<>0,Data!$B$2,\"\"),\"\")","v":"15603"},{"$f":"BalanceComprobacion!A85","v":3.1},{"$f":"BalanceComprobacion!B85","v":"1.1.3.99.01.99.0.99999"},{"$f":"BalanceComprobacion!C85","v":"Previsiones para otros impuestos a cobrar c/p *"},{"$f":"BalanceComprobacion!D85","v":-1429381.33},{"$f":"BalanceComprobacion!E85","v":0},{"$f":"BalanceComprobacion!F85","v":0},{"$f":"BalanceComprobacion!G85","v":-1429381.33}]
[{"$f":"IFERROR(IF(B40<>0,Data!$B$2,\"\"),\"\")","v":"15603"},{"$f":"BalanceComprobacion!A86","v":3.1},{"$f":"BalanceComprobacion!B86","v":"1.1.3.99.04."},{"$f":"BalanceComprobacion!C86","v":"Previsiones para servicios a cobrar c/p *"},{"$f":"BalanceComprobacion!D86","v":-51378929.549999997},{"$f":"BalanceComprobacion!E86","v":0},{"$f":"BalanceComprobacion!F86","v":0},{"$f":"BalanceComprobacion!G86","v":-51378929.549999997}]
[{"$f":"IFERROR(IF(B41<>0,Data!$B$2,\"\"),\"\")","v":"15603"},{"$f":"BalanceComprobacion!A87","v":3.1},{"$f":"BalanceComprobacion!B87","v":"1.1.3.99.04.01."},{"$f":"BalanceComprobacion!C87","v":"Previsiones para ventas de servicios a cobrar c/p *"},{"$f":"BalanceComprobacion!D87","v":-50738208.689999998},{"$f":"BalanceComprobacion!E87","v":0},{"$f":"BalanceComprobacion!F87","v":0},{"$f":"BalanceComprobacion!G87","v":-50738208.689999998}]
[{"$f":"IFERROR(IF(B42<>0,Data!$B$2,\"\"),\"\")","v":"15603"},{"$f":"BalanceComprobacion!A88","v":3.1},{"$f":"BalanceComprobacion!B88","v":"1.1.3.99.04.01.0."},{"$f":"BalanceComprobacion!C88","v":"Previsiones para ventas de servicios a cobrar c/p *"},{"$f":"BalanceComprobacion!D88","v":-50738208.689999998},{"$f":"BalanceComprobacion!E88","v":0},{"$f":"BalanceComprobacion!F88","v":0},{"$f":"BalanceComprobacion!G88","v":-50738208.689999998}]
[{"$f":"IFERROR(IF(B43<>0,Data!$B$2,\"\"),\"\")","v":"15603"},{"$f":"BalanceComprobacion!A89","v":3.1},{"$f":"BalanceComprobacion!B89","v":"1.1.3.99.04.01.0.99999"},{"$f":"BalanceComprobacion!C89","v":"Previsiones para ventas de servicios a cobrar c/p *"},{"$f":"BalanceComprobacion!D89","v":-50738208.689999998},{"$f":"BalanceComprobacion!E89","v":0},{"$f":"BalanceComprobacion!F89","v":0},{"$f":"BalanceComprobacion!G89","v":-50738208.689999998}]
[{"$f":"IFERROR(IF(B44<>0,Data!$B$2,\"\"),\"\")","v":"15603"},{"$f":"BalanceComprobacion!A90","v":3.1},{"$f":"BalanceComprobacion!B90","v":"1.1.3.99.04.02."},{"$f":"BalanceComprobacion!C90","v":"Previsiones para derechos administrativos a cobrar c/p *"},{"$f":"BalanceComprobacion!D90","v":-640720.86},{"$f":"BalanceComprobacion!E90","v":0},{"$f":"BalanceComprobacion!F90","v":0},{"$f":"BalanceComprobacion!G90","v":-640720.86}]
[{"$f":"IFERROR(IF(B45<>0,Data!$B$2,\"\"),\"\")","v":"15603"},{"$f":"BalanceComprobacion!A91","v":3.1},{"$f":"BalanceComprobacion!B91","v":"1.1.3.99.04.02.0."},{"$f":"BalanceComprobacion!C91","v":"Previsiones para derechos administrativos a cobrar c/p *"},{"$f":"BalanceComprobacion!D91","v":-640720.86},{"$f":"BalanceComprobacion!E91","v":0},{"$f":"BalanceComprobacion!F91","v":0},{"$f":"BalanceComprobacion!G91","v":-640720.86}]
[{"$f":"IFERROR(IF(B46<>0,Data!$B$2,\"\"),\"\")","v":"15603"},{"$f":"BalanceComprobacion!A92","v":3.1},{"$f":"BalanceComprobacion!B92","v":"1.1.3.99.04.02.0.99999"},{"$f":"BalanceComprobacion!C92","v":"Previsiones para derechos administrativos a cobrar c/p *"},{"$f":"BalanceComprobacion!D92","v":-640720.86},{"$f":"BalanceComprobacion!E92","v":0},{"$f":"BalanceComprobacion!F92","v":0},{"$f":"BalanceComprobacion!G92","v":-640720.86}]
[{"$f":"IFERROR(IF(B47<>0,Data!$B$2,\"\"),\"\")","v":"15603"},{"$f":"BalanceComprobacion!A93","v":3.1},{"$f":"BalanceComprobacion!B93","v":"1.1.3.99.05."},{"$f":"BalanceComprobacion!C93","v":"Previsiones para ingresos de la propiedad a cobrar c/p *"},{"$f":"BalanceComprobacion!D93","v":-7015963.1900000004},{"$f":"BalanceComprobacion!E93","v":0},{"$f":"BalanceComprobacion!F93","v":0},{"$f":"BalanceComprobacion!G93","v":-7015963.1900000004}]
[{"$f":"IFERROR(IF(B48<>0,Data!$B$2,\"\"),\"\")","v":"15603"},{"$f":"BalanceComprobacion!A94","v":3.1},{"$f":"BalanceComprobacion!B94","v":"1.1.3.99.05.01."},{"$f":"BalanceComprobacion!C94","v":"Previsiones para alquileres y derechos sobre bienes a cobrar c/p *"},{"$f":"BalanceComprobacion!D94","v":-7015963.1900000004},{"$f":"BalanceComprobacion!E94","v":0},{"$f":"BalanceComprobacion!F94","v":0},{"$f":"BalanceComprobacion!G94","v":-7015963.1900000004}]
[{"$f":"IFERROR(IF(B49<>0,Data!$B$2,\"\"),\"\")","v":"15603"},{"$f":"BalanceComprobacion!A95","v":3.1},{"$f":"BalanceComprobacion!B95","v":"1.1.3.99.05.01.0."},{"$f":"BalanceComprobacion!C95","v":"Previsiones para alquileres y derechos sobre bienes a cobrar c/p *"},{"$f":"BalanceComprobacion!D95","v":-7015963.1900000004},{"$f":"BalanceComprobacion!E95","v":0},{"$f":"BalanceComprobacion!F95","v":0},{"$f":"BalanceComprobacion!G95","v":-7015963.1900000004}]
[{"$f":"IFERROR(IF(B50<>0,Data!$B$2,\"\"),\"\")","v":"15603"},{"$f":"BalanceComprobacion!A96","v":3.1},{"$f":"BalanceComprobacion!B96","v":"1.1.3.99.05.01.0.99999"},{"$f":"BalanceComprobacion!C96","v":"Previsiones para alquileres y derechos sobre bienes a cobrar c/p *"},{"$f":"BalanceComprobacion!D96","v":-7015963.1900000004},{"$f":"BalanceComprobacion!E96","v":0},{"$f":"BalanceComprobacion!F96","v":0},{"$f":"BalanceComprobacion!G96","v":-7015963.1900000004}]
[{"$f":"IFERROR(IF(B51<>0,Data!$B$2,\"\"),\"\")","v":"15603"},{"$f":"BalanceComprobacion!A97","v":3.1},{"$f":"BalanceComprobacion!B97","v":"1.1.4."},{"$f":"BalanceComprobacion!C97","v":"Inventarios"},{"$f":"BalanceComprobacion!D97","v":192987092.22},{"$f":"BalanceComprobacion!E97","v":28680156.84},{"$f":"BalanceComprobacion!F97","v":23914522.199999999},{"$f":"BalanceComprobacion!G97","v":197752726.86000001}]
[{"$f":"IFERROR(IF(B52<>0,Data!$B$2,\"\"),\"\")","v":"15603"},{"$f":"BalanceComprobacion!A98","v":3.1},{"$f":"BalanceComprobacion!B98","v":"1.1.4.01."},{"$f":"BalanceComprobacion!C98","v":"Materiales y suministros para consumo y prestación de servicios"},{"$f":"BalanceComprobacion!D98","v":192987092.22},{"$f":"BalanceComprobacion!E98","v":28680156.84},{"$f":"BalanceComprobacion!F98","v":23914522.199999999},{"$f":"BalanceComprobacion!G98","v":197752726.86000001}]
[{"$f":"IFERROR(IF(B53<>0,Data!$B$2,\"\"),\"\")","v":"15603"},{"$f":"BalanceComprobacion!A99","v":3.1},{"$f":"BalanceComprobacion!B99","v":"1.1.4.01.01."},{"$f":"BalanceComprobacion!C99","v":"Productos químicos y conexos"},{"$f":"BalanceComprobacion!D99","v":21280495.09},{"$f":"BalanceComprobacion!E99","v":800642.7},{"$f":"BalanceComprobacion!F99","v":5597712.6699999999},{"$f":"BalanceComprobacion!G99","v":16483425.119999999}]
[{"$f":"IFERROR(IF(B54<>0,Data!$B$2,\"\"),\"\")","v":"15603"},{"$f":"BalanceComprobacion!A100","v":3.1},{"$f":"BalanceComprobacion!B100","v":"1.1.4.01.01.01."},{"$f":"BalanceComprobacion!C100","v":"Combustibles y lubricantes"},{"$f":"BalanceComprobacion!D100","v":17684339.460000001},{"$f":"BalanceComprobacion!E100","v":0},{"$f":"BalanceComprobacion!F100","v":4867463.0199999996},{"$f":"BalanceComprobacion!G100","v":12816876.439999999}]
[{"$f":"IFERROR(IF(B55<>0,Data!$B$2,\"\"),\"\")","v":"15603"},{"$f":"BalanceComprobacion!A101","v":3.1},{"$f":"BalanceComprobacion!B101","v":"1.1.4.01.01.01.0."},{"$f":"BalanceComprobacion!C101","v":"Combustibles y lubricantes"},{"$f":"BalanceComprobacion!D101","v":17684339.460000001},{"$f":"BalanceComprobacion!E101","v":0},{"$f":"BalanceComprobacion!F101","v":4867463.0199999996},{"$f":"BalanceComprobacion!G101","v":12816876.439999999}]
[{"$f":"IFERROR(IF(B56<>0,Data!$B$2,\"\"),\"\")","v":"15603"},{"$f":"BalanceComprobacion!A102","v":3.1},{"$f":"BalanceComprobacion!B102","v":"1.1.4.01.01.01.0.99999"},{"$f":"BalanceComprobacion!C102","v":"Combustibles y lubricantes"},{"$f":"BalanceComprobacion!D102","v":17684339.460000001},{"$f":"BalanceComprobacion!E102","v":0},{"$f":"BalanceComprobacion!F102","v":4867463.0199999996},{"$f":"BalanceComprobacion!G102","v":12816876.439999999}]
[{"$f":"IFERROR(IF(B57<>0,Data!$B$2,\"\"),\"\")","v":"15603"},{"$f":"BalanceComprobacion!A103","v":3.1},{"$f":"BalanceComprobacion!B103","v":"1.1.4.01.01.02."},{"$f":"BalanceComprobacion!C103","v":"Productos farmacéuticos y medicinales"},{"$f":"BalanceComprobacion!D103","v":6400},{"$f":"BalanceComprobacion!E103","v":0},{"$f":"BalanceComprobacion!F103","v":6400},{"$f":"BalanceComprobacion!G103","v":0}]
[{"$f":"IFERROR(IF(B58<>0,Data!$B$2,\"\"),\"\")","v":"15603"},{"$f":"BalanceComprobacion!A104","v":3.1},{"$f":"BalanceComprobacion!B104","v":"1.1.4.01.01.02.0."},{"$f":"BalanceComprobacion!C104","v":"Productos farmacéuticos y medicinales"},{"$f":"BalanceComprobacion!D104","v":6400},{"$f":"BalanceComprobacion!E104","v":0},{"$f":"BalanceComprobacion!F104","v":6400},{"$f":"BalanceComprobacion!G104","v":0}]
[{"$f":"IFERROR(IF(B59<>0,Data!$B$2,\"\"),\"\")","v":"15603"},{"$f":"BalanceComprobacion!A105","v":3.1},{"$f":"BalanceComprobacion!B105","v":"1.1.4.01.01.02.0.99999"},{"$f":"BalanceComprobacion!C105","v":"Productos farmacéuticos y medicinales"},{"$f":"BalanceComprobacion!D105","v":6400},{"$f":"BalanceComprobacion!E105","v":0},{"$f":"BalanceComprobacion!F105","v":6400},{"$f":"BalanceComprobacion!G105","v":0}]
[{"$f":"IFERROR(IF(B60<>0,Data!$B$2,\"\"),\"\")","v":"15603"},{"$f":"BalanceComprobacion!A106","v":3.1},{"$f":"BalanceComprobacion!B106","v":"1.1.4.01.01.04."},{"$f":"BalanceComprobacion!C106","v":"Tintas, pinturas y diluyentes"},{"$f":"BalanceComprobacion!D106","v":2775593.63},{"$f":"BalanceComprobacion!E106","v":767042.7},{"$f":"BalanceComprobacion!F106","v":453009.75},{"$f":"BalanceComprobacion!G106","v":3089626.58}]
[{"$f":"IFERROR(IF(B61<>0,Data!$B$2,\"\"),\"\")","v":"15603"},{"$f":"BalanceComprobacion!A107","v":3.1},{"$f":"BalanceComprobacion!B107","v":"1.1.4.01.01.04.0."},{"$f":"BalanceComprobacion!C107","v":"Tintas, pinturas y diluyentes"},{"$f":"BalanceComprobacion!D107","v":2775593.63},{"$f":"BalanceComprobacion!E107","v":767042.7},{"$f":"BalanceComprobacion!F107","v":453009.75},{"$f":"BalanceComprobacion!G107","v":3089626.58}]
[{"$f":"IFERROR(IF(B62<>0,Data!$B$2,\"\"),\"\")","v":"15603"},{"$f":"BalanceComprobacion!A108","v":3.1},{"$f":"BalanceComprobacion!B108","v":"1.1.4.01.01.04.0.99999"},{"$f":"BalanceComprobacion!C108","v":"Tintas, pinturas y diluyentes"},{"$f":"BalanceComprobacion!D108","v":2775593.63},{"$f":"BalanceComprobacion!E108","v":767042.7},{"$f":"BalanceComprobacion!F108","v":453009.75},{"$f":"BalanceComprobacion!G108","v":3089626.58}]
[{"$f":"IFERROR(IF(B63<>0,Data!$B$2,\"\"),\"\")","v":"15603"},{"$f":"BalanceComprobacion!A109","v":3.1},{"$f":"BalanceComprobacion!B109","v":"1.1.4.01.01.99."},{"$f":"BalanceComprobacion!C109","v":"Otros productos químicos y conexos"},{"$f":"BalanceComprobacion!D109","v":814162},{"$f":"BalanceComprobacion!E109","v":33600},{"$f":"BalanceComprobacion!F109","v":270839.90000000002},{"$f":"BalanceComprobacion!G109","v":576922.1}]
[{"$f":"IFERROR(IF(B64<>0,Data!$B$2,\"\"),\"\")","v":"15603"},{"$f":"BalanceComprobacion!A110","v":3.1},{"$f":"BalanceComprobacion!B110","v":"1.1.4.01.01.99.0."},{"$f":"BalanceComprobacion!C110","v":"Otros productos químicos y conexos"},{"$f":"BalanceComprobacion!D110","v":814162},{"$f":"BalanceComprobacion!E110","v":33600},{"$f":"BalanceComprobacion!F110","v":270839.90000000002},{"$f":"BalanceComprobacion!G110","v":576922.1}]
[{"$f":"IFERROR(IF(B65<>0,Data!$B$2,\"\"),\"\")","v":"15603"},{"$f":"BalanceComprobacion!A111","v":3.1},{"$f":"BalanceComprobacion!B111","v":"1.1.4.01.01.99.0.99999"},{"$f":"BalanceComprobacion!C111","v":"Otros productos químicos y conexos"},{"$f":"BalanceComprobacion!D111","v":814162},{"$f":"BalanceComprobacion!E111","v":33600},{"$f":"BalanceComprobacion!F111","v":270839.90000000002},{"$f":"BalanceComprobacion!G111","v":576922.1}]
[{"$f":"IFERROR(IF(B66<>0,Data!$B$2,\"\"),\"\")","v":"15603"},{"$f":"BalanceComprobacion!A112","v":3.1},{"$f":"BalanceComprobacion!B112","v":"1.1.4.01.03."},{"$f":"BalanceComprobacion!C112","v":"Materiales y productos de uso en la construcción y mantenimiento"},{"$f":"BalanceComprobacion!D112","v":30127789.25},{"$f":"BalanceComprobacion!E112","v":3332210.2},{"$f":"BalanceComprobacion!F112","v":2813833.79},{"$f":"BalanceComprobacion!G112","v":30646165.66}]
[{"$f":"IFERROR(IF(B67<>0,Data!$B$2,\"\"),\"\")","v":"15603"},{"$f":"BalanceComprobacion!A113","v":3.1},{"$f":"BalanceComprobacion!B113","v":"1.1.4.01.03.01."},{"$f":"BalanceComprobacion!C113","v":"Materiales y productos metálicos"},{"$f":"BalanceComprobacion!D113","v":25238704.199999999},{"$f":"BalanceComprobacion!E113","v":263620},{"$f":"BalanceComprobacion!F113","v":572076.38},{"$f":"BalanceComprobacion!G113","v":24930247.82}]
[{"$f":"IFERROR(IF(B68<>0,Data!$B$2,\"\"),\"\")","v":"15603"},{"$f":"BalanceComprobacion!A114","v":3.1},{"$f":"BalanceComprobacion!B114","v":"1.1.4.01.03.01.0."},{"$f":"BalanceComprobacion!C114","v":"Materiales y productos metálicos"},{"$f":"BalanceComprobacion!D114","v":25238704.199999999},{"$f":"BalanceComprobacion!E114","v":263620},{"$f":"BalanceComprobacion!F114","v":572076.38},{"$f":"BalanceComprobacion!G114","v":24930247.82}]
[{"$f":"IFERROR(IF(B69<>0,Data!$B$2,\"\"),\"\")","v":"15603"},{"$f":"BalanceComprobacion!A115","v":3.1},{"$f":"BalanceComprobacion!B115","v":"1.1.4.01.03.01.0.99999"},{"$f":"BalanceComprobacion!C115","v":"Materiales y productos metálicos"},{"$f":"BalanceComprobacion!D115","v":25238704.199999999},{"$f":"BalanceComprobacion!E115","v":263620},{"$f":"BalanceComprobacion!F115","v":572076.38},{"$f":"BalanceComprobacion!G115","v":24930247.82}]
[{"$f":"IFERROR(IF(B70<>0,Data!$B$2,\"\"),\"\")","v":"15603"},{"$f":"BalanceComprobacion!A116","v":3.1},{"$f":"BalanceComprobacion!B116","v":"1.1.4.01.03.02."},{"$f":"BalanceComprobacion!C116","v":"Materiales y productos minerales y asfálticos"},{"$f":"BalanceComprobacion!D116","v":3708677},{"$f":"BalanceComprobacion!E116","v":3004645.2},{"$f":"BalanceComprobacion!F116","v":1918220},{"$f":"BalanceComprobacion!G116","v":4795102.2}]
[{"$f":"IFERROR(IF(B71<>0,Data!$B$2,\"\"),\"\")","v":"15603"},{"$f":"BalanceComprobacion!A117","v":3.1},{"$f":"BalanceComprobacion!B117","v":"1.1.4.01.03.02.0."},{"$f":"BalanceComprobacion!C117","v":"Materiales y productos minerales y asfálticos"},{"$f":"BalanceComprobacion!D117","v":3708677},{"$f":"BalanceComprobacion!E117","v":3004645.2},{"$f":"BalanceComprobacion!F117","v":1918220},{"$f":"BalanceComprobacion!G117","v":4795102.2}]
[{"$f":"IFERROR(IF(B72<>0,Data!$B$2,\"\"),\"\")","v":"15603"},{"$f":"BalanceComprobacion!A118","v":3.1},{"$f":"BalanceComprobacion!B118","v":"1.1.4.01.03.02.0.99999"},{"$f":"BalanceComprobacion!C118","v":"Materiales y productos minerales y asfálticos"},{"$f":"BalanceComprobacion!D118","v":3708677},{"$f":"BalanceComprobacion!E118","v":3004645.2},{"$f":"BalanceComprobacion!F118","v":1918220},{"$f":"BalanceComprobacion!G118","v":4795102.2}]
[{"$f":"IFERROR(IF(B73<>0,Data!$B$2,\"\"),\"\")","v":"15603"},{"$f":"BalanceComprobacion!A119","v":3.1},{"$f":"BalanceComprobacion!B119","v":"1.1.4.01.03.03."},{"$f":"BalanceComprobacion!C119","v":"Madera y sus derivados"},{"$f":"BalanceComprobacion!D119","v":896515},{"$f":"BalanceComprobacion!E119","v":63945},{"$f":"BalanceComprobacion!F119","v":309285},{"$f":"BalanceComprobacion!G119","v":651175}]
[{"$f":"IFERROR(IF(B74<>0,Data!$B$2,\"\"),\"\")","v":"15603"},{"$f":"BalanceComprobacion!A120","v":3.1},{"$f":"BalanceComprobacion!B120","v":"1.1.4.01.03.03.0."},{"$f":"BalanceComprobacion!C120","v":"Madera y sus derivados"},{"$f":"BalanceComprobacion!D120","v":896515},{"$f":"BalanceComprobacion!E120","v":63945},{"$f":"BalanceComprobacion!F120","v":309285},{"$f":"BalanceComprobacion!G120","v":651175}]
[{"$f":"IFERROR(IF(B75<>0,Data!$B$2,\"\"),\"\")","v":"15603"},{"$f":"BalanceComprobacion!A121","v":3.1},{"$f":"BalanceComprobacion!B121","v":"1.1.4.01.03.03.0.99999"},{"$f":"BalanceComprobacion!C121","v":"Madera y sus derivados"},{"$f":"BalanceComprobacion!D121","v":896515},{"$f":"BalanceComprobacion!E121","v":63945},{"$f":"BalanceComprobacion!F121","v":309285},{"$f":"BalanceComprobacion!G121","v":651175}]
[{"$f":"IFERROR(IF(B76<>0,Data!$B$2,\"\"),\"\")","v":"15603"},{"$f":"BalanceComprobacion!A122","v":3.1},{"$f":"BalanceComprobacion!B122","v":"1.1.4.01.03.04."},{"$f":"BalanceComprobacion!C122","v":"Materiales y productos eléctricos, telefónicos y de cómputo"},{"$f":"BalanceComprobacion!D122","v":135171.56},{"$f":"BalanceComprobacion!E122","v":0},{"$f":"BalanceComprobacion!F122","v":14252.41},{"$f":"BalanceComprobacion!G122","v":120919.15}]
[{"$f":"IFERROR(IF(B77<>0,Data!$B$2,\"\"),\"\")","v":"15603"},{"$f":"BalanceComprobacion!A123","v":3.1},{"$f":"BalanceComprobacion!B123","v":"1.1.4.01.03.04.0."},{"$f":"BalanceComprobacion!C123","v":"Materiales y productos eléctricos, telefónicos y de cómputo"},{"$f":"BalanceComprobacion!D123","v":135171.56},{"$f":"BalanceComprobacion!E123","v":0},{"$f":"BalanceComprobacion!F123","v":14252.41},{"$f":"BalanceComprobacion!G123","v":120919.15}]
[{"$f":"IFERROR(IF(B78<>0,Data!$B$2,\"\"),\"\")","v":"15603"},{"$f":"BalanceComprobacion!A124","v":3.1},{"$f":"BalanceComprobacion!B124","v":"1.1.4.01.03.04.0.99999"},{"$f":"BalanceComprobacion!C124","v":"Materiales y productos eléctricos, telefónicos y de cómputo"},{"$f":"BalanceComprobacion!D124","v":135171.56},{"$f":"BalanceComprobacion!E124","v":0},{"$f":"BalanceComprobacion!F124","v":14252.41},{"$f":"BalanceComprobacion!G124","v":120919.15}]
[{"$f":"IFERROR(IF(B79<>0,Data!$B$2,\"\"),\"\")","v":"15603"},{"$f":"BalanceComprobacion!A125","v":3.1},{"$f":"BalanceComprobacion!B125","v":"1.1.4.01.03.06."},{"$f":"BalanceComprobacion!C125","v":"Materiales y productos de plástico"},{"$f":"BalanceComprobacion!D125","v":148721.49},{"$f":"BalanceComprobacion!E125","v":0},{"$f":"BalanceComprobacion!F125","v":0},{"$f":"BalanceComprobacion!G125","v":148721.49}]
[{"$f":"IFERROR(IF(B80<>0,Data!$B$2,\"\"),\"\")","v":"15603"},{"$f":"BalanceComprobacion!A126","v":3.1},{"$f":"BalanceComprobacion!B126","v":"1.1.4.01.03.06.0."},{"$f":"BalanceComprobacion!C126","v":"Materiales y productos de plástico"},{"$f":"BalanceComprobacion!D126","v":148721.49},{"$f":"BalanceComprobacion!E126","v":0},{"$f":"BalanceComprobacion!F126","v":0},{"$f":"BalanceComprobacion!G126","v":148721.49}]
[{"$f":"IFERROR(IF(B81<>0,Data!$B$2,\"\"),\"\")","v":"15603"},{"$f":"BalanceComprobacion!A127","v":3.1},{"$f":"BalanceComprobacion!B127","v":"1.1.4.01.03.06.0.99999"},{"$f":"BalanceComprobacion!C127","v":"Materiales y productos de plástico"},{"$f":"BalanceComprobacion!D127","v":148721.49},{"$f":"BalanceComprobacion!E127","v":0},{"$f":"BalanceComprobacion!F127","v":0},{"$f":"BalanceComprobacion!G127","v":148721.49}]
[{"$f":"IFERROR(IF(B82<>0,Data!$B$2,\"\"),\"\")","v":"15603"},{"$f":"BalanceComprobacion!A128","v":3.1},{"$f":"BalanceComprobacion!B128","v":"1.1.4.01.04."},{"$f":"BalanceComprobacion!C128","v":"Herramientas, repuestos y accesorios"},{"$f":"BalanceComprobacion!D128","v":131278007.78},{"$f":"BalanceComprobacion!E128","v":11554099.48},{"$f":"BalanceComprobacion!F128","v":6049097.5599999996},{"$f":"BalanceComprobacion!G128","v":136783009.69999999}]
[{"$f":"IFERROR(IF(B83<>0,Data!$B$2,\"\"),\"\")","v":"15603"},{"$f":"BalanceComprobacion!A129","v":3.1},{"$f":"BalanceComprobacion!B129","v":"1.1.4.01.04.01."},{"$f":"BalanceComprobacion!C129","v":"Herramientas e instrumentos"},{"$f":"BalanceComprobacion!D129","v":1233641.5},{"$f":"BalanceComprobacion!E129","v":412156.69},{"$f":"BalanceComprobacion!F129","v":387506.69},{"$f":"BalanceComprobacion!G129","v":1258291.5}]
[{"$f":"IFERROR(IF(B84<>0,Data!$B$2,\"\"),\"\")","v":"15603"},{"$f":"BalanceComprobacion!A130","v":3.1},{"$f":"BalanceComprobacion!B130","v":"1.1.4.01.04.01.0."},{"$f":"BalanceComprobacion!C130","v":"Herramientas e instrumentos"},{"$f":"BalanceComprobacion!D130","v":1233641.5},{"$f":"BalanceComprobacion!E130","v":412156.69},{"$f":"BalanceComprobacion!F130","v":387506.69},{"$f":"BalanceComprobacion!G130","v":1258291.5}]
[{"$f":"IFERROR(IF(B85<>0,Data!$B$2,\"\"),\"\")","v":"15603"},{"$f":"BalanceComprobacion!A131","v":3.1},{"$f":"BalanceComprobacion!B131","v":"1.1.4.01.04.01.0.99999"},{"$f":"BalanceComprobacion!C131","v":"Herramientas e instrumentos"},{"$f":"BalanceComprobacion!D131","v":1233641.5},{"$f":"BalanceComprobacion!E131","v":412156.69},{"$f":"BalanceComprobacion!F131","v":387506.69},{"$f":"BalanceComprobacion!G131","v":1258291.5}]
[{"$f":"IFERROR(IF(B86<>0,Data!$B$2,\"\"),\"\")","v":"15603"},{"$f":"BalanceComprobacion!A132","v":3.1},{"$f":"BalanceComprobacion!B132","v":"1.1.4.01.04.02."},{"$f":"BalanceComprobacion!C132","v":"Repuestos y accesorios Nuevos"},{"$f":"BalanceComprobacion!D132","v":130044366.28},{"$f":"BalanceComprobacion!E132","v":11141942.789999999},{"$f":"BalanceComprobacion!F132","v":5661590.8700000001},{"$f":"BalanceComprobacion!G132","v":135524718.19999999}]
[{"$f":"IFERROR(IF(B87<>0,Data!$B$2,\"\"),\"\")","v":"15603"},{"$f":"BalanceComprobacion!A133","v":3.1},{"$f":"BalanceComprobacion!B133","v":"1.1.4.01.04.02.0."},{"$f":"BalanceComprobacion!C133","v":"Repuestos y accesorios Nuevos"},{"$f":"BalanceComprobacion!D133","v":130044366.28},{"$f":"BalanceComprobacion!E133","v":11141942.789999999},{"$f":"BalanceComprobacion!F133","v":5661590.8700000001},{"$f":"BalanceComprobacion!G133","v":135524718.19999999}]
[{"$f":"IFERROR(IF(B88<>0,Data!$B$2,\"\"),\"\")","v":"15603"},{"$f":"BalanceComprobacion!A134","v":3.1},{"$f":"BalanceComprobacion!B134","v":"1.1.4.01.04.02.0.99999"},{"$f":"BalanceComprobacion!C134","v":"Repuestos y accesorios Nuevos"},{"$f":"BalanceComprobacion!D134","v":130044366.28},{"$f":"BalanceComprobacion!E134","v":11141942.789999999},{"$f":"BalanceComprobacion!F134","v":5661590.8700000001},{"$f":"BalanceComprobacion!G134","v":135524718.19999999}]
[{"$f":"IFERROR(IF(B89<>0,Data!$B$2,\"\"),\"\")","v":"15603"},{"$f":"BalanceComprobacion!A135","v":3.1},{"$f":"BalanceComprobacion!B135","v":"1.1.4.01.99."},{"$f":"BalanceComprobacion!C135","v":"Útiles, materiales y suministros diversos"},{"$f":"BalanceComprobacion!D135","v":10300800.1},{"$f":"BalanceComprobacion!E135","v":12993204.460000001},{"$f":"BalanceComprobacion!F135","v":9453878.1799999997},{"$f":"BalanceComprobacion!G135","v":13840126.380000001}]
[{"$f":"IFERROR(IF(B90<>0,Data!$B$2,\"\"),\"\")","v":"15603"},{"$f":"BalanceComprobacion!A136","v":3.1},{"$f":"BalanceComprobacion!B136","v":"1.1.4.01.99.01."},{"$f":"BalanceComprobacion!C136","v":"Útiles y materiales de oficina y cómputo"},{"$f":"BalanceComprobacion!D136","v":1943168.61},{"$f":"BalanceComprobacion!E136","v":293056.44},{"$f":"BalanceComprobacion!F136","v":509877.48},{"$f":"BalanceComprobacion!G136","v":1726347.57}]
[{"$f":"IFERROR(IF(B91<>0,Data!$B$2,\"\"),\"\")","v":"15603"},{"$f":"BalanceComprobacion!A137","v":3.1},{"$f":"BalanceComprobacion!B137","v":"1.1.4.01.99.01.0."},{"$f":"BalanceComprobacion!C137","v":"Útiles y materiales de oficina y cómputo"},{"$f":"BalanceComprobacion!D137","v":1943168.61},{"$f":"BalanceComprobacion!E137","v":293056.44},{"$f":"BalanceComprobacion!F137","v":509877.48},{"$f":"BalanceComprobacion!G137","v":1726347.57}]
[{"$f":"IFERROR(IF(B92<>0,Data!$B$2,\"\"),\"\")","v":"15603"},{"$f":"BalanceComprobacion!A138","v":3.1},{"$f":"BalanceComprobacion!B138","v":"1.1.4.01.99.01.0.99999"},{"$f":"BalanceComprobacion!C138","v":"Útiles y materiales de oficina y cómputo"},{"$f":"BalanceComprobacion!D138","v":1943168.61},{"$f":"BalanceComprobacion!E138","v":293056.44},{"$f":"BalanceComprobacion!F138","v":509877.48},{"$f":"BalanceComprobacion!G138","v":1726347.57}]
[{"$f":"IFERROR(IF(B93<>0,Data!$B$2,\"\"),\"\")","v":"15603"},{"$f":"BalanceComprobacion!A139","v":3.1},{"$f":"BalanceComprobacion!B139","v":"1.1.4.01.99.02."},{"$f":"BalanceComprobacion!C139","v":"Útiles y materiales médico, hospitalario y de investigación"},{"$f":"BalanceComprobacion!D139","v":0},{"$f":"BalanceComprobacion!E139","v":675000},{"$f":"BalanceComprobacion!F139","v":0},{"$f":"BalanceComprobacion!G139","v":675000}]
[{"$f":"IFERROR(IF(B94<>0,Data!$B$2,\"\"),\"\")","v":"15603"},{"$f":"BalanceComprobacion!A140","v":3.1},{"$f":"BalanceComprobacion!B140","v":"1.1.4.01.99.02.0."},{"$f":"BalanceComprobacion!C140","v":"Útiles y materiales médico, hospitalario y de investigación"},{"$f":"BalanceComprobacion!D140","v":0},{"$f":"BalanceComprobacion!E140","v":675000},{"$f":"BalanceComprobacion!F140","v":0},{"$f":"BalanceComprobacion!G140","v":675000}]
[{"$f":"IFERROR(IF(B95<>0,Data!$B$2,\"\"),\"\")","v":"15603"},{"$f":"BalanceComprobacion!A141","v":3.1},{"$f":"BalanceComprobacion!B141","v":"1.1.4.01.99.02.0.99999"},{"$f":"BalanceComprobacion!C141","v":"Útiles y materiales médico, hospitalario y de investigación"},{"$f":"BalanceComprobacion!D141","v":0},{"$f":"BalanceComprobacion!E141","v":675000},{"$f":"BalanceComprobacion!F141","v":0},{"$f":"BalanceComprobacion!G141","v":675000}]
[{"$f":"IFERROR(IF(B96<>0,Data!$B$2,\"\"),\"\")","v":"15603"},{"$f":"BalanceComprobacion!A142","v":3.1},{"$f":"BalanceComprobacion!B142","v":"1.1.4.01.99.03."},{"$f":"BalanceComprobacion!C142","v":"Productos de papel, cartón e impresos"},{"$f":"BalanceComprobacion!D142","v":2730589.18},{"$f":"BalanceComprobacion!E142","v":476667.61},{"$f":"BalanceComprobacion!F142","v":616819.09},{"$f":"BalanceComprobacion!G142","v":2590437.7000000002}]
[{"$f":"IFERROR(IF(B97<>0,Data!$B$2,\"\"),\"\")","v":"15603"},{"$f":"BalanceComprobacion!A143","v":3.1},{"$f":"BalanceComprobacion!B143","v":"1.1.4.01.99.03.0."},{"$f":"BalanceComprobacion!C143","v":"Productos de papel, cartón e impresos"},{"$f":"BalanceComprobacion!D143","v":2730589.18},{"$f":"BalanceComprobacion!E143","v":476667.61},{"$f":"BalanceComprobacion!F143","v":616819.09},{"$f":"BalanceComprobacion!G143","v":2590437.7000000002}]
[{"$f":"IFERROR(IF(B98<>0,Data!$B$2,\"\"),\"\")","v":"15603"},{"$f":"BalanceComprobacion!A144","v":3.1},{"$f":"BalanceComprobacion!B144","v":"1.1.4.01.99.03.0.99999"},{"$f":"BalanceComprobacion!C144","v":"Productos de papel, cartón e impresos"},{"$f":"BalanceComprobacion!D144","v":2730589.18},{"$f":"BalanceComprobacion!E144","v":476667.61},{"$f":"BalanceComprobacion!F144","v":616819.09},{"$f":"BalanceComprobacion!G144","v":2590437.7000000002}]
[{"$f":"IFERROR(IF(B99<>0,Data!$B$2,\"\"),\"\")","v":"15603"},{"$f":"BalanceComprobacion!A145","v":3.1},{"$f":"BalanceComprobacion!B145","v":"1.1.4.01.99.04."},{"$f":"BalanceComprobacion!C145","v":"Textiles y vestuario"},{"$f":"BalanceComprobacion!D145","v":306936.34999999998},{"$f":"BalanceComprobacion!E145","v":5217922},{"$f":"BalanceComprobacion!F145","v":5121779},{"$f":"BalanceComprobacion!G145","v":403079.35}]
[{"$f":"IFERROR(IF(B100<>0,Data!$B$2,\"\"),\"\")","v":"15603"},{"$f":"BalanceComprobacion!A146","v":3.1},{"$f":"BalanceComprobacion!B146","v":"1.1.4.01.99.04.0."},{"$f":"BalanceComprobacion!C146","v":"Textiles y vestuario"},{"$f":"BalanceComprobacion!D146","v":306936.34999999998},{"$f":"BalanceComprobacion!E146","v":5217922},{"$f":"BalanceComprobacion!F146","v":5121779},{"$f":"BalanceComprobacion!G146","v":403079.35}]
[{"$f":"IFERROR(IF(B101<>0,Data!$B$2,\"\"),\"\")","v":"15603"},{"$f":"BalanceComprobacion!A147","v":3.1},{"$f":"BalanceComprobacion!B147","v":"1.1.4.01.99.04.0.99999"},{"$f":"BalanceComprobacion!C147","v":"Textiles y vestuario"},{"$f":"BalanceComprobacion!D147","v":306936.34999999998},{"$f":"BalanceComprobacion!E147","v":5217922},{"$f":"BalanceComprobacion!F147","v":5121779},{"$f":"BalanceComprobacion!G147","v":403079.35}]
[{"$f":"IFERROR(IF(B102<>0,Data!$B$2,\"\"),\"\")","v":"15603"},{"$f":"BalanceComprobacion!A148","v":3.1},{"$f":"BalanceComprobacion!B148","v":"1.1.4.01.99.05."},{"$f":"BalanceComprobacion!C148","v":"Útiles y materiales de limpieza"},{"$f":"BalanceComprobacion!D148","v":2737377.74},{"$f":"BalanceComprobacion!E148","v":1464470.37},{"$f":"BalanceComprobacion!F148","v":1039755.56},{"$f":"BalanceComprobacion!G148","v":3162092.55}]
[{"$f":"IFERROR(IF(B103<>0,Data!$B$2,\"\"),\"\")","v":"15603"},{"$f":"BalanceComprobacion!A149","v":3.1},{"$f":"BalanceComprobacion!B149","v":"1.1.4.01.99.05.0."},{"$f":"BalanceComprobacion!C149","v":"Útiles y materiales de limpieza"},{"$f":"BalanceComprobacion!D149","v":2737377.74},{"$f":"BalanceComprobacion!E149","v":1464470.37},{"$f":"BalanceComprobacion!F149","v":1039755.56},{"$f":"BalanceComprobacion!G149","v":3162092.55}]
[{"$f":"IFERROR(IF(B104<>0,Data!$B$2,\"\"),\"\")","v":"15603"},{"$f":"BalanceComprobacion!A150","v":3.1},{"$f":"BalanceComprobacion!B150","v":"1.1.4.01.99.05.0.99999"},{"$f":"BalanceComprobacion!C150","v":"Útiles y materiales de limpieza"},{"$f":"BalanceComprobacion!D150","v":2737377.74},{"$f":"BalanceComprobacion!E150","v":1464470.37},{"$f":"BalanceComprobacion!F150","v":1039755.56},{"$f":"BalanceComprobacion!G150","v":3162092.55}]
[{"$f":"IFERROR(IF(B105<>0,Data!$B$2,\"\"),\"\")","v":"15603"},{"$f":"BalanceComprobacion!A151","v":3.1},{"$f":"BalanceComprobacion!B151","v":"1.1.4.01.99.06."},{"$f":"BalanceComprobacion!C151","v":"Útiles y materiales de resguardo y seguridad"},{"$f":"BalanceComprobacion!D151","v":2042904.22},{"$f":"BalanceComprobacion!E151","v":4609053.04},{"$f":"BalanceComprobacion!F151","v":2081277.05},{"$f":"BalanceComprobacion!G151","v":4570680.21}]
[{"$f":"IFERROR(IF(B106<>0,Data!$B$2,\"\"),\"\")","v":"15603"},{"$f":"BalanceComprobacion!A152","v":3.1},{"$f":"BalanceComprobacion!B152","v":"1.1.4.01.99.06.0."},{"$f":"BalanceComprobacion!C152","v":"Útiles y materiales de resguardo y seguridad"},{"$f":"BalanceComprobacion!D152","v":2042904.22},{"$f":"BalanceComprobacion!E152","v":4609053.04},{"$f":"BalanceComprobacion!F152","v":2081277.05},{"$f":"BalanceComprobacion!G152","v":4570680.21}]
[{"$f":"IFERROR(IF(B107<>0,Data!$B$2,\"\"),\"\")","v":"15603"},{"$f":"BalanceComprobacion!A153","v":3.1},{"$f":"BalanceComprobacion!B153","v":"1.1.4.01.99.06.0.99999"},{"$f":"BalanceComprobacion!C153","v":"Útiles y materiales de resguardo y seguridad"},{"$f":"BalanceComprobacion!D153","v":2042904.22},{"$f":"BalanceComprobacion!E153","v":4609053.04},{"$f":"BalanceComprobacion!F153","v":2081277.05},{"$f":"BalanceComprobacion!G153","v":4570680.21}]
[{"$f":"IFERROR(IF(B108<>0,Data!$B$2,\"\"),\"\")","v":"15603"},{"$f":"BalanceComprobacion!A154","v":3.1},{"$f":"BalanceComprobacion!B154","v":"1.1.4.01.99.99."},{"$f":"BalanceComprobacion!C154","v":"Otros útiles, materiales y suministros diversos"},{"$f":"BalanceComprobacion!D154","v":539824},{"$f":"BalanceComprobacion!E154","v":257035},{"$f":"BalanceComprobacion!F154","v":84370},{"$f":"BalanceComprobacion!G154","v":712489}]
[{"$f":"IFERROR(IF(B109<>0,Data!$B$2,\"\"),\"\")","v":"15603"},{"$f":"BalanceComprobacion!A155","v":3.1},{"$f":"BalanceComprobacion!B155","v":"1.1.4.01.99.99.0."},{"$f":"BalanceComprobacion!C155","v":"Otros útiles, materiales y suministros diversos"},{"$f":"BalanceComprobacion!D155","v":539824},{"$f":"BalanceComprobacion!E155","v":257035},{"$f":"BalanceComprobacion!F155","v":84370},{"$f":"BalanceComprobacion!G155","v":712489}]
[{"$f":"IFERROR(IF(B110<>0,Data!$B$2,\"\"),\"\")","v":"15603"},{"$f":"BalanceComprobacion!A156","v":3.1},{"$f":"BalanceComprobacion!B156","v":"1.1.4.01.99.99.0.99999"},{"$f":"BalanceComprobacion!C156","v":"Otros útiles, materiales y suministros diversos"},{"$f":"BalanceComprobacion!D156","v":539824},{"$f":"BalanceComprobacion!E156","v":257035},{"$f":"BalanceComprobacion!F156","v":84370},{"$f":"BalanceComprobacion!G156","v":712489}]
[{"$f":"IFERROR(IF(B111<>0,Data!$B$2,\"\"),\"\")","v":"15603"},{"$f":"BalanceComprobacion!A157","v":3.1},{"$f":"BalanceComprobacion!B157","v":"1.1.9."},{"$f":"BalanceComprobacion!C157","v":"Otros activos a corto plazo"},{"$f":"BalanceComprobacion!D157","v":26295622.239999998},{"$f":"BalanceComprobacion!E157","v":22478258},{"$f":"BalanceComprobacion!F157","v":28208536.43},{"$f":"BalanceComprobacion!G157","v":20565343.809999999}]
[{"$f":"IFERROR(IF(B112<>0,Data!$B$2,\"\"),\"\")","v":"15603"},{"$f":"BalanceComprobacion!A158","v":3.1},{"$f":"BalanceComprobacion!B158","v":"1.1.9.01."},{"$f":"BalanceComprobacion!C158","v":"Gastos a devengar a corto plazo"},{"$f":"BalanceComprobacion!D158","v":26295622.239999998},{"$f":"BalanceComprobacion!E158","v":22478258},{"$f":"BalanceComprobacion!F158","v":28208536.43},{"$f":"BalanceComprobacion!G158","v":20565343.809999999}]
[{"$f":"IFERROR(IF(B113<>0,Data!$B$2,\"\"),\"\")","v":"15603"},{"$f":"BalanceComprobacion!A159","v":3.1},{"$f":"BalanceComprobacion!B159","v":"1.1.9.01.01."},{"$f":"BalanceComprobacion!C159","v":"Servicios a devengar c/p"},{"$f":"BalanceComprobacion!D159","v":26295622.239999998},{"$f":"BalanceComprobacion!E159","v":22478258},{"$f":"BalanceComprobacion!F159","v":28208536.43},{"$f":"BalanceComprobacion!G159","v":20565343.809999999}]
[{"$f":"IFERROR(IF(B114<>0,Data!$B$2,\"\"),\"\")","v":"15603"},{"$f":"BalanceComprobacion!A160","v":3.1},{"$f":"BalanceComprobacion!B160","v":"1.1.9.01.01.01."},{"$f":"BalanceComprobacion!C160","v":"Primas y gastos de seguros a devengar c/p"},{"$f":"BalanceComprobacion!D160","v":26295622.239999998},{"$f":"BalanceComprobacion!E160","v":22478258},{"$f":"BalanceComprobacion!F160","v":28208536.43},{"$f":"BalanceComprobacion!G160","v":20565343.809999999}]
[{"$f":"IFERROR(IF(B115<>0,Data!$B$2,\"\"),\"\")","v":"15603"},{"$f":"BalanceComprobacion!A161","v":3.1},{"$f":"BalanceComprobacion!B161","v":"1.1.9.01.01.01.0."},{"$f":"BalanceComprobacion!C161","v":"Primas y gastos de seguros a devengar c/p"},{"$f":"BalanceComprobacion!D161","v":26295622.239999998},{"$f":"BalanceComprobacion!E161","v":22478258},{"$f":"BalanceComprobacion!F161","v":28208536.43},{"$f":"BalanceComprobacion!G161","v":20565343.809999999}]
[{"$f":"IFERROR(IF(B116<>0,Data!$B$2,\"\"),\"\")","v":"15603"},{"$f":"BalanceComprobacion!A162","v":3.1},{"$f":"BalanceComprobacion!B162","v":"1.1.9.01.01.01.0.99999"},{"$f":"BalanceComprobacion!C162","v":"Primas y gastos de seguros a devengar c/p"},{"$f":"BalanceComprobacion!D162","v":26295622.239999998},{"$f":"BalanceComprobacion!E162","v":22478258},{"$f":"BalanceComprobacion!F162","v":28208536.43},{"$f":"BalanceComprobacion!G162","v":20565343.809999999}]
[{"$f":"IFERROR(IF(B117<>0,Data!$B$2,\"\"),\"\")","v":"15603"},{"$f":"BalanceComprobacion!A163","v":3.1},{"$f":"BalanceComprobacion!B163","v":"1.2."},{"$f":"BalanceComprobacion!C163","v":"Activo No Corriente"},{"$f":"BalanceComprobacion!D163","v":163010808266.62},{"$f":"BalanceComprobacion!E163","v":214245240.80000001},{"$f":"BalanceComprobacion!F163","v":212137762.00999999},{"$f":"BalanceComprobacion!G163","v":163012915745.41}]
[{"$f":"IFERROR(IF(B118<>0,Data!$B$2,\"\"),\"\")","v":"15603"},{"$f":"BalanceComprobacion!A164","v":3.1},{"$f":"BalanceComprobacion!B164","v":"1.2.5."},{"$f":"BalanceComprobacion!C164","v":"Bienes no concesionados"},{"$f":"BalanceComprobacion!D164","v":163010808266.62},{"$f":"BalanceComprobacion!E164","v":214245240.80000001},{"$f":"BalanceComprobacion!F164","v":212137762.00999999},{"$f":"BalanceComprobacion!G164","v":163012915745.41}]
[{"$f":"IFERROR(IF(B119<>0,Data!$B$2,\"\"),\"\")","v":"15603"},{"$f":"BalanceComprobacion!A165","v":3.1},{"$f":"BalanceComprobacion!B165","v":"1.2.5.01."},{"$f":"BalanceComprobacion!C165","v":"Propiedades, planta y equipos explotados"},{"$f":"BalanceComprobacion!D165","v":2155163988.3499999},{"$f":"BalanceComprobacion!E165","v":212718185.94999999},{"$f":"BalanceComprobacion!F165","v":201520243.44999999},{"$f":"BalanceComprobacion!G165","v":2166361930.8499999}]
[{"$f":"IFERROR(IF(B120<>0,Data!$B$2,\"\"),\"\")","v":"15603"},{"$f":"BalanceComprobacion!A166","v":3.1},{"$f":"BalanceComprobacion!B166","v":"1.2.5.01.02."},{"$f":"BalanceComprobacion!C166","v":"Edificios"},{"$f":"BalanceComprobacion!D166","v":1250873080.6600001},{"$f":"BalanceComprobacion!E166","v":45381425.829999998},{"$f":"BalanceComprobacion!F166","v":40795041.619999997},{"$f":"BalanceComprobacion!G166","v":1255459464.8699999}]
[{"$f":"IFERROR(IF(B121<>0,Data!$B$2,\"\"),\"\")","v":"15603"},{"$f":"BalanceComprobacion!A167","v":3.1},{"$f":"BalanceComprobacion!B167","v":"1.2.5.01.02.01."},{"$f":"BalanceComprobacion!C167","v":"Edificios de oficinas  atención al públ"},{"$f":"BalanceComprobacion!D167","v":439702157.05000001},{"$f":"BalanceComprobacion!E167","v":1436968.18},{"$f":"BalanceComprobacion!F167","v":4296068.13},{"$f":"BalanceComprobacion!G167","v":436843057.10000002}]
[{"$f":"IFERROR(IF(B122<>0,Data!$B$2,\"\"),\"\")","v":"15603"},{"$f":"BalanceComprobacion!A168","v":3.1},{"$f":"BalanceComprobacion!B168","v":"1.2.5.01.02.01.1."},{"$f":"BalanceComprobacion!C168","v":"Edificios de oficinas y atención público Valores Origen"},{"$f":"BalanceComprobacion!D168","v":258127776.78999999},{"$f":"BalanceComprobacion!E168","v":0},{"$f":"BalanceComprobacion!F168","v":0},{"$f":"BalanceComprobacion!G168","v":258127776.78999999}]
[{"$f":"IFERROR(IF(B123<>0,Data!$B$2,\"\"),\"\")","v":"15603"},{"$f":"BalanceComprobacion!A169","v":3.1},{"$f":"BalanceComprobacion!B169","v":"1.2.5.01.02.01.1.99999"},{"$f":"BalanceComprobacion!C169","v":"Edificios de oficinas y atención público Valores Origen"},{"$f":"BalanceComprobacion!D169","v":258127776.78999999},{"$f":"BalanceComprobacion!E169","v":0},{"$f":"BalanceComprobacion!F169","v":0},{"$f":"BalanceComprobacion!G169","v":258127776.78999999}]
[{"$f":"IFERROR(IF(B124<>0,Data!$B$2,\"\"),\"\")","v":"15603"},{"$f":"BalanceComprobacion!A170","v":3.1},{"$f":"BalanceComprobacion!B170","v":"1.2.5.01.02.01.3."},{"$f":"BalanceComprobacion!C170","v":"Edificios oficinas y atención público Depreciación Acumulada"},{"$f":"BalanceComprobacion!D170","v":-9149119.7400000002},{"$f":"BalanceComprobacion!E170","v":1436968.18},{"$f":"BalanceComprobacion!F170","v":4296068.13},{"$f":"BalanceComprobacion!G170","v":-12008219.689999999}]
[{"$f":"IFERROR(IF(B125<>0,Data!$B$2,\"\"),\"\")","v":"15603"},{"$f":"BalanceComprobacion!A171","v":3.1},{"$f":"BalanceComprobacion!B171","v":"1.2.5.01.02.01.3.99999"},{"$f":"BalanceComprobacion!C171","v":"Edificios oficinas y atención público Depreciación Acumulada"},{"$f":"BalanceComprobacion!D171","v":-9149119.7400000002},{"$f":"BalanceComprobacion!E171","v":1436968.18},{"$f":"BalanceComprobacion!F171","v":4296068.13},{"$f":"BalanceComprobacion!G171","v":-12008219.689999999}]
[{"$f":"IFERROR(IF(B126<>0,Data!$B$2,\"\"),\"\")","v":"15603"},{"$f":"BalanceComprobacion!A172","v":3.1},{"$f":"BalanceComprobacion!B172","v":"1.2.5.01.02.01.6."},{"$f":"BalanceComprobacion!C172","v":"Edificios oficinas y atención público Porción Terreno Valores Origen"},{"$f":"BalanceComprobacion!D172","v":190723500},{"$f":"BalanceComprobacion!E172","v":0},{"$f":"BalanceComprobacion!F172","v":0},{"$f":"BalanceComprobacion!G172","v":190723500}]
[{"$f":"IFERROR(IF(B127<>0,Data!$B$2,\"\"),\"\")","v":"15603"},{"$f":"BalanceComprobacion!A173","v":3.1},{"$f":"BalanceComprobacion!B173","v":"1.2.5.01.02.01.6.99999"},{"$f":"BalanceComprobacion!C173","v":"Edificios oficinas y atención público Porción Terreno Valores Origen"},{"$f":"BalanceComprobacion!D173","v":190723500},{"$f":"BalanceComprobacion!E173","v":0},{"$f":"BalanceComprobacion!F173","v":0},{"$f":"BalanceComprobacion!G173","v":190723500}]
[{"$f":"IFERROR(IF(B128<>0,Data!$B$2,\"\"),\"\")","v":"15603"},{"$f":"BalanceComprobacion!A174","v":3.1},{"$f":"BalanceComprobacion!B174","v":"1.2.5.01.02.04."},{"$f":"BalanceComprobacion!C174","v":"Bodegas"},{"$f":"BalanceComprobacion!D174","v":0},{"$f":"BalanceComprobacion!E174","v":15931666.67},{"$f":"BalanceComprobacion!F174","v":8558333.3399999999},{"$f":"BalanceComprobacion!G174","v":7373333.3300000001}]
[{"$f":"IFERROR(IF(B129<>0,Data!$B$2,\"\"),\"\")","v":"15603"},{"$f":"BalanceComprobacion!A175","v":3.1},{"$f":"BalanceComprobacion!B175","v":"1.2.5.01.02.04.1."},{"$f":"BalanceComprobacion!C175","v":"Bodegas Valores de origen"},{"$f":"BalanceComprobacion!D175","v":0},{"$f":"BalanceComprobacion!E175","v":15800000},{"$f":"BalanceComprobacion!F175","v":0},{"$f":"BalanceComprobacion!G175","v":15800000}]
[{"$f":"IFERROR(IF(B130<>0,Data!$B$2,\"\"),\"\")","v":"15603"},{"$f":"BalanceComprobacion!A176","v":3.1},{"$f":"BalanceComprobacion!B176","v":"1.2.5.01.02.04.1.99999"},{"$f":"BalanceComprobacion!C176","v":"Bodegas Valores de origen"},{"$f":"BalanceComprobacion!D176","v":0},{"$f":"BalanceComprobacion!E176","v":15800000},{"$f":"BalanceComprobacion!F176","v":0},{"$f":"BalanceComprobacion!G176","v":15800000}]
[{"$f":"IFERROR(IF(B131<>0,Data!$B$2,\"\"),\"\")","v":"15603"},{"$f":"BalanceComprobacion!A177","v":3.1},{"$f":"BalanceComprobacion!B177","v":"1.2.5.01.02.04.3."},{"$f":"BalanceComprobacion!C177","v":"Bodegas Depreciaciones acumuladas *"},{"$f":"BalanceComprobacion!D177","v":0},{"$f":"BalanceComprobacion!E177","v":131666.67000000001},{"$f":"BalanceComprobacion!F177","v":8558333.3399999999},{"$f":"BalanceComprobacion!G177","v":-8426666.6699999999}]
[{"$f":"IFERROR(IF(B132<>0,Data!$B$2,\"\"),\"\")","v":"15603"},{"$f":"BalanceComprobacion!A178","v":3.1},{"$f":"BalanceComprobacion!B178","v":"1.2.5.01.02.04.3.99999"},{"$f":"BalanceComprobacion!C178","v":"Bodegas Depreciaciones acumuladas *"},{"$f":"BalanceComprobacion!D178","v":0},{"$f":"BalanceComprobacion!E178","v":131666.67000000001},{"$f":"BalanceComprobacion!F178","v":8558333.3399999999},{"$f":"BalanceComprobacion!G178","v":-8426666.6699999999}]
[{"$f":"IFERROR(IF(B133<>0,Data!$B$2,\"\"),\"\")","v":"15603"},{"$f":"BalanceComprobacion!A179","v":3.1},{"$f":"BalanceComprobacion!B179","v":"1.2.5.01.02.05."},{"$f":"BalanceComprobacion!C179","v":"Locales"},{"$f":"BalanceComprobacion!D179","v":297585392.31},{"$f":"BalanceComprobacion!E179","v":7750489.0099999998},{"$f":"BalanceComprobacion!F179","v":4388164.4000000004},{"$f":"BalanceComprobacion!G179","v":300947716.92000002}]
[{"$f":"IFERROR(IF(B134<>0,Data!$B$2,\"\"),\"\")","v":"15603"},{"$f":"BalanceComprobacion!A180","v":3.1},{"$f":"BalanceComprobacion!B180","v":"1.2.5.01.02.05.1."},{"$f":"BalanceComprobacion!C180","v":"Locales Valores de origen"},{"$f":"BalanceComprobacion!D180","v":198576095.40000001},{"$f":"BalanceComprobacion!E180","v":0},{"$f":"BalanceComprobacion!F180","v":0},{"$f":"BalanceComprobacion!G180","v":198576095.40000001}]
[{"$f":"IFERROR(IF(B135<>0,Data!$B$2,\"\"),\"\")","v":"15603"},{"$f":"BalanceComprobacion!A181","v":3.1},{"$f":"BalanceComprobacion!B181","v":"1.2.5.01.02.05.1.99999"},{"$f":"BalanceComprobacion!C181","v":"Locales Valores de origen"},{"$f":"BalanceComprobacion!D181","v":198576095.40000001},{"$f":"BalanceComprobacion!E181","v":0},{"$f":"BalanceComprobacion!F181","v":0},{"$f":"BalanceComprobacion!G181","v":198576095.40000001}]
[{"$f":"IFERROR(IF(B136<>0,Data!$B$2,\"\"),\"\")","v":"15603"},{"$f":"BalanceComprobacion!A182","v":3.1},{"$f":"BalanceComprobacion!B182","v":"1.2.5.01.02.05.3."},{"$f":"BalanceComprobacion!C182","v":"Locales Depreciaciones acumuladas *"},{"$f":"BalanceComprobacion!D182","v":-6823353.0899999999},{"$f":"BalanceComprobacion!E182","v":2180339.0099999998},{"$f":"BalanceComprobacion!F182","v":4388164.4000000004},{"$f":"BalanceComprobacion!G182","v":-9031178.4800000004}]
[{"$f":"IFERROR(IF(B137<>0,Data!$B$2,\"\"),\"\")","v":"15603"},{"$f":"BalanceComprobacion!A183","v":3.1},{"$f":"BalanceComprobacion!B183","v":"1.2.5.01.02.05.3.99999"},{"$f":"BalanceComprobacion!C183","v":"Locales Depreciaciones acumuladas *"},{"$f":"BalanceComprobacion!D183","v":-6823353.0899999999},{"$f":"BalanceComprobacion!E183","v":2180339.0099999998},{"$f":"BalanceComprobacion!F183","v":4388164.4000000004},{"$f":"BalanceComprobacion!G183","v":-9031178.4800000004}]
[{"$f":"IFERROR(IF(B138<>0,Data!$B$2,\"\"),\"\")","v":"15603"},{"$f":"BalanceComprobacion!A184","v":3.1},{"$f":"BalanceComprobacion!B184","v":"1.2.5.01.02.05.5."},{"$f":"BalanceComprobacion!C184","v":"Locales Mejoras"},{"$f":"BalanceComprobacion!D184","v":0},{"$f":"BalanceComprobacion!E184","v":5570150},{"$f":"BalanceComprobacion!F184","v":0},{"$f":"BalanceComprobacion!G184","v":5570150}]
[{"$f":"IFERROR(IF(B139<>0,Data!$B$2,\"\"),\"\")","v":"15603"},{"$f":"BalanceComprobacion!A185","v":3.1},{"$f":"BalanceComprobacion!B185","v":"1.2.5.01.02.05.5.99999"},{"$f":"BalanceComprobacion!C185","v":"Locales Mejoras"},{"$f":"BalanceComprobacion!D185","v":0},{"$f":"BalanceComprobacion!E185","v":5570150},{"$f":"BalanceComprobacion!F185","v":0},{"$f":"BalanceComprobacion!G185","v":5570150}]
[{"$f":"IFERROR(IF(B140<>0,Data!$B$2,\"\"),\"\")","v":"15603"},{"$f":"BalanceComprobacion!A186","v":3.1},{"$f":"BalanceComprobacion!B186","v":"1.2.5.01.02.05.6."},{"$f":"BalanceComprobacion!C186","v":"Locales Porción terreno: valores de origen"},{"$f":"BalanceComprobacion!D186","v":105832650},{"$f":"BalanceComprobacion!E186","v":0},{"$f":"BalanceComprobacion!F186","v":0},{"$f":"BalanceComprobacion!G186","v":105832650}]
[{"$f":"IFERROR(IF(B141<>0,Data!$B$2,\"\"),\"\")","v":"15603"},{"$f":"BalanceComprobacion!A187","v":3.1},{"$f":"BalanceComprobacion!B187","v":"1.2.5.01.02.05.6.99999"},{"$f":"BalanceComprobacion!C187","v":"Locales Porción terreno: valores de origen"},{"$f":"BalanceComprobacion!D187","v":105832650},{"$f":"BalanceComprobacion!E187","v":0},{"$f":"BalanceComprobacion!F187","v":0},{"$f":"BalanceComprobacion!G187","v":105832650}]
[{"$f":"IFERROR(IF(B142<>0,Data!$B$2,\"\"),\"\")","v":"15603"},{"$f":"BalanceComprobacion!A188","v":3.1},{"$f":"BalanceComprobacion!B188","v":"1.2.5.01.02.99."},{"$f":"BalanceComprobacion!C188","v":"Otros edificios"},{"$f":"BalanceComprobacion!D188","v":513585531.30000001},{"$f":"BalanceComprobacion!E188","v":20262301.969999999},{"$f":"BalanceComprobacion!F188","v":23552475.75},{"$f":"BalanceComprobacion!G188","v":510295357.51999998}]
[{"$f":"IFERROR(IF(B143<>0,Data!$B$2,\"\"),\"\")","v":"15603"},{"$f":"BalanceComprobacion!A189","v":3.1},{"$f":"BalanceComprobacion!B189","v":"1.2.5.01.02.99.1."},{"$f":"BalanceComprobacion!C189","v":"Otros edificios Valores de origen"},{"$f":"BalanceComprobacion!D189","v":362322050.91000003},{"$f":"BalanceComprobacion!E189","v":20205550},{"$f":"BalanceComprobacion!F189","v":20205550},{"$f":"BalanceComprobacion!G189","v":362322050.91000003}]
[{"$f":"IFERROR(IF(B144<>0,Data!$B$2,\"\"),\"\")","v":"15603"},{"$f":"BalanceComprobacion!A190","v":3.1},{"$f":"BalanceComprobacion!B190","v":"1.2.5.01.02.99.1.99999"},{"$f":"BalanceComprobacion!C190","v":"Otros edificios Valores de origen"},{"$f":"BalanceComprobacion!D190","v":362322050.91000003},{"$f":"BalanceComprobacion!E190","v":20205550},{"$f":"BalanceComprobacion!F190","v":20205550},{"$f":"BalanceComprobacion!G190","v":362322050.91000003}]
[{"$f":"IFERROR(IF(B145<>0,Data!$B$2,\"\"),\"\")","v":"15603"},{"$f":"BalanceComprobacion!A191","v":3.1},{"$f":"BalanceComprobacion!B191","v":"1.2.5.01.02.99.3."},{"$f":"BalanceComprobacion!C191","v":"Otros edificios Depreciaciones acumuladas *"},{"$f":"BalanceComprobacion!D191","v":-10193719.609999999},{"$f":"BalanceComprobacion!E191","v":56751.97},{"$f":"BalanceComprobacion!F191","v":3346925.75},{"$f":"BalanceComprobacion!G191","v":-13483893.390000001}]
[{"$f":"IFERROR(IF(B146<>0,Data!$B$2,\"\"),\"\")","v":"15603"},{"$f":"BalanceComprobacion!A192","v":3.1},{"$f":"BalanceComprobacion!B192","v":"1.2.5.01.02.99.3.99999"},{"$f":"BalanceComprobacion!C192","v":"Otros edificios Depreciaciones acumuladas *"},{"$f":"BalanceComprobacion!D192","v":-10193719.609999999},{"$f":"BalanceComprobacion!E192","v":56751.97},{"$f":"BalanceComprobacion!F192","v":3346925.75},{"$f":"BalanceComprobacion!G192","v":-13483893.390000001}]
[{"$f":"IFERROR(IF(B147<>0,Data!$B$2,\"\"),\"\")","v":"15603"},{"$f":"BalanceComprobacion!A193","v":3.1},{"$f":"BalanceComprobacion!B193","v":"1.2.5.01.02.99.6."},{"$f":"BalanceComprobacion!C193","v":"Otros edificios Porción terreno: valores de origen"},{"$f":"BalanceComprobacion!D193","v":161457200},{"$f":"BalanceComprobacion!E193","v":0},{"$f":"BalanceComprobacion!F193","v":0},{"$f":"BalanceComprobacion!G193","v":161457200}]
[{"$f":"IFERROR(IF(B148<>0,Data!$B$2,\"\"),\"\")","v":"15603"},{"$f":"BalanceComprobacion!A194","v":3.1},{"$f":"BalanceComprobacion!B194","v":"1.2.5.01.02.99.6.99999"},{"$f":"BalanceComprobacion!C194","v":"Otros edificios Porción terreno: valores de origen"},{"$f":"BalanceComprobacion!D194","v":161457200},{"$f":"BalanceComprobacion!E194","v":0},{"$f":"BalanceComprobacion!F194","v":0},{"$f":"BalanceComprobacion!G194","v":161457200}]
[{"$f":"IFERROR(IF(B149<>0,Data!$B$2,\"\"),\"\")","v":"15603"},{"$f":"BalanceComprobacion!A195","v":3.1},{"$f":"BalanceComprobacion!B195","v":"1.2.5.01.03."},{"$f":"BalanceComprobacion!C195","v":"Maquinaria  equipos para la producción"},{"$f":"BalanceComprobacion!D195","v":786374545.99000001},{"$f":"BalanceComprobacion!E195","v":88070316.980000004},{"$f":"BalanceComprobacion!F195","v":116719355.09},{"$f":"BalanceComprobacion!G195","v":757725507.88}]
[{"$f":"IFERROR(IF(B150<>0,Data!$B$2,\"\"),\"\")","v":"15603"},{"$f":"BalanceComprobacion!A196","v":3.1},{"$f":"BalanceComprobacion!B196","v":"1.2.5.01.03.01."},{"$f":"BalanceComprobacion!C196","v":"Maquinaria para la construcción"},{"$f":"BalanceComprobacion!D196","v":754306983.34000003},{"$f":"BalanceComprobacion!E196","v":81323390.090000004},{"$f":"BalanceComprobacion!F196","v":112078486.51000001},{"$f":"BalanceComprobacion!G196","v":723551886.91999996}]
[{"$f":"IFERROR(IF(B151<>0,Data!$B$2,\"\"),\"\")","v":"15603"},{"$f":"BalanceComprobacion!A197","v":3.1},{"$f":"BalanceComprobacion!B197","v":"1.2.5.01.03.01.1."},{"$f":"BalanceComprobacion!C197","v":"Maquinaria para la construcción Valores de origen"},{"$f":"BalanceComprobacion!D197","v":1997638163.9000001},{"$f":"BalanceComprobacion!E197","v":80651295.959999993},{"$f":"BalanceComprobacion!F197","v":0},{"$f":"BalanceComprobacion!G197","v":2078289459.8599999}]
[{"$f":"IFERROR(IF(B152<>0,Data!$B$2,\"\"),\"\")","v":"15603"},{"$f":"BalanceComprobacion!A198","v":3.1},{"$f":"BalanceComprobacion!B198","v":"1.2.5.01.03.01.1.99999"},{"$f":"BalanceComprobacion!C198","v":"Maquinaria para la construcción Valores de origen"},{"$f":"BalanceComprobacion!D198","v":1997638163.9000001},{"$f":"BalanceComprobacion!E198","v":80651295.959999993},{"$f":"BalanceComprobacion!F198","v":0},{"$f":"BalanceComprobacion!G198","v":2078289459.8599999}]
[{"$f":"IFERROR(IF(B153<>0,Data!$B$2,\"\"),\"\")","v":"15603"},{"$f":"BalanceComprobacion!A199","v":3.1},{"$f":"BalanceComprobacion!B199","v":"1.2.5.01.03.01.3."},{"$f":"BalanceComprobacion!C199","v":"Maq para la construcción Depreciaciones acumuladas"},{"$f":"BalanceComprobacion!D199","v":-1243331180.5599999},{"$f":"BalanceComprobacion!E199","v":672094.13},{"$f":"BalanceComprobacion!F199","v":112078486.51000001},{"$f":"BalanceComprobacion!G199","v":-1354737572.9400001}]
[{"$f":"IFERROR(IF(B154<>0,Data!$B$2,\"\"),\"\")","v":"15603"},{"$f":"BalanceComprobacion!A200","v":3.1},{"$f":"BalanceComprobacion!B200","v":"1.2.5.01.03.01.3.99999"},{"$f":"BalanceComprobacion!C200","v":"Maq para la construcción Depreciaciones acumuladas"},{"$f":"BalanceComprobacion!D200","v":-1243331180.5599999},{"$f":"BalanceComprobacion!E200","v":672094.13},{"$f":"BalanceComprobacion!F200","v":112078486.51000001},{"$f":"BalanceComprobacion!G200","v":-1354737572.9400001}]
[{"$f":"IFERROR(IF(B155<>0,Data!$B$2,\"\"),\"\")","v":"15603"},{"$f":"BalanceComprobacion!A201","v":3.1},{"$f":"BalanceComprobacion!B201","v":"1.2.5.01.03.03."},{"$f":"BalanceComprobacion!C201","v":"Planta eléctrica"},{"$f":"BalanceComprobacion!D201","v":3500057.28},{"$f":"BalanceComprobacion!E201","v":0},{"$f":"BalanceComprobacion!F201","v":144157.9},{"$f":"BalanceComprobacion!G201","v":3355899.38}]
[{"$f":"IFERROR(IF(B156<>0,Data!$B$2,\"\"),\"\")","v":"15603"},{"$f":"BalanceComprobacion!A202","v":3.1},{"$f":"BalanceComprobacion!B202","v":"1.2.5.01.03.03.1."},{"$f":"BalanceComprobacion!C202","v":"Planta eléctrica Valores de origen"},{"$f":"BalanceComprobacion!D202","v":5189684.8},{"$f":"BalanceComprobacion!E202","v":0},{"$f":"BalanceComprobacion!F202","v":0},{"$f":"BalanceComprobacion!G202","v":5189684.8}]
[{"$f":"IFERROR(IF(B157<>0,Data!$B$2,\"\"),\"\")","v":"15603"},{"$f":"BalanceComprobacion!A203","v":3.1},{"$f":"BalanceComprobacion!B203","v":"1.2.5.01.03.03.1.99999"},{"$f":"BalanceComprobacion!C203","v":"Planta eléctrica Valores de origen"},{"$f":"BalanceComprobacion!D203","v":5189684.8},{"$f":"BalanceComprobacion!E203","v":0},{"$f":"BalanceComprobacion!F203","v":0},{"$f":"BalanceComprobacion!G203","v":5189684.8}]
[{"$f":"IFERROR(IF(B158<>0,Data!$B$2,\"\"),\"\")","v":"15603"},{"$f":"BalanceComprobacion!A204","v":3.1},{"$f":"BalanceComprobacion!B204","v":"1.2.5.01.03.03.3."},{"$f":"BalanceComprobacion!C204","v":"Planta eléctrica Depreciaciones acumuladas *"},{"$f":"BalanceComprobacion!D204","v":-1689627.52},{"$f":"BalanceComprobacion!E204","v":0},{"$f":"BalanceComprobacion!F204","v":144157.9},{"$f":"BalanceComprobacion!G204","v":-1833785.42}]
[{"$f":"IFERROR(IF(B159<>0,Data!$B$2,\"\"),\"\")","v":"15603"},{"$f":"BalanceComprobacion!A205","v":3.1},{"$f":"BalanceComprobacion!B205","v":"1.2.5.01.03.03.3.99999"},{"$f":"BalanceComprobacion!C205","v":"Planta eléctrica Depreciaciones acumuladas *"},{"$f":"BalanceComprobacion!D205","v":-1689627.52},{"$f":"BalanceComprobacion!E205","v":0},{"$f":"BalanceComprobacion!F205","v":144157.9},{"$f":"BalanceComprobacion!G205","v":-1833785.42}]
[{"$f":"IFERROR(IF(B160<>0,Data!$B$2,\"\"),\"\")","v":"15603"},{"$f":"BalanceComprobacion!A206","v":3.1},{"$f":"BalanceComprobacion!B206","v":"1.2.5.01.03.06."},{"$f":"BalanceComprobacion!C206","v":"Equipos hidráulicos"},{"$f":"BalanceComprobacion!D206","v":181634.5},{"$f":"BalanceComprobacion!E206","v":0},{"$f":"BalanceComprobacion!F206","v":8817.2000000000007},{"$f":"BalanceComprobacion!G206","v":172817.3}]
[{"$f":"IFERROR(IF(B161<>0,Data!$B$2,\"\"),\"\")","v":"15603"},{"$f":"BalanceComprobacion!A207","v":3.1},{"$f":"BalanceComprobacion!B207","v":"1.2.5.01.03.06.1."},{"$f":"BalanceComprobacion!C207","v":"Equipos hidráulicos Valores de origen"},{"$f":"BalanceComprobacion!D207","v":280058},{"$f":"BalanceComprobacion!E207","v":0},{"$f":"BalanceComprobacion!F207","v":0},{"$f":"BalanceComprobacion!G207","v":280058}]
[{"$f":"IFERROR(IF(B162<>0,Data!$B$2,\"\"),\"\")","v":"15603"},{"$f":"BalanceComprobacion!A208","v":3.1},{"$f":"BalanceComprobacion!B208","v":"1.2.5.01.03.06.1.99999"},{"$f":"BalanceComprobacion!C208","v":"Equipos hidráulicos Valores de origen"},{"$f":"BalanceComprobacion!D208","v":280058},{"$f":"BalanceComprobacion!E208","v":0},{"$f":"BalanceComprobacion!F208","v":0},{"$f":"BalanceComprobacion!G208","v":280058}]
[{"$f":"IFERROR(IF(B163<>0,Data!$B$2,\"\"),\"\")","v":"15603"},{"$f":"BalanceComprobacion!A209","v":3.1},{"$f":"BalanceComprobacion!B209","v":"1.2.5.01.03.06.3."},{"$f":"BalanceComprobacion!C209","v":"Equipos hidráulicos Depreciaciones acumuladas *"},{"$f":"BalanceComprobacion!D209","v":-98423.5},{"$f":"BalanceComprobacion!E209","v":0},{"$f":"BalanceComprobacion!F209","v":8817.2000000000007},{"$f":"BalanceComprobacion!G209","v":-107240.7}]
[{"$f":"IFERROR(IF(B164<>0,Data!$B$2,\"\"),\"\")","v":"15603"},{"$f":"BalanceComprobacion!A210","v":3.1},{"$f":"BalanceComprobacion!B210","v":"1.2.5.01.03.06.3.99999"},{"$f":"BalanceComprobacion!C210","v":"Equipos hidráulicos Depreciaciones acumuladas *"},{"$f":"BalanceComprobacion!D210","v":-98423.5},{"$f":"BalanceComprobacion!E210","v":0},{"$f":"BalanceComprobacion!F210","v":8817.2000000000007},{"$f":"BalanceComprobacion!G210","v":-107240.7}]
[{"$f":"IFERROR(IF(B165<>0,Data!$B$2,\"\"),\"\")","v":"15603"},{"$f":"BalanceComprobacion!A211","v":3.1},{"$f":"BalanceComprobacion!B211","v":"1.2.5.01.03.08."},{"$f":"BalanceComprobacion!C211","v":"Equipos de medición"},{"$f":"BalanceComprobacion!D211","v":948171.86},{"$f":"BalanceComprobacion!E211","v":0},{"$f":"BalanceComprobacion!F211","v":265348.90999999997},{"$f":"BalanceComprobacion!G211","v":682822.95}]
[{"$f":"IFERROR(IF(B166<>0,Data!$B$2,\"\"),\"\")","v":"15603"},{"$f":"BalanceComprobacion!A212","v":3.1},{"$f":"BalanceComprobacion!B212","v":"1.2.5.01.03.08.1."},{"$f":"BalanceComprobacion!C212","v":"Equipos de medición Valores de origen"},{"$f":"BalanceComprobacion!D212","v":6734898.7300000004},{"$f":"BalanceComprobacion!E212","v":0},{"$f":"BalanceComprobacion!F212","v":0},{"$f":"BalanceComprobacion!G212","v":6734898.7300000004}]
[{"$f":"IFERROR(IF(B167<>0,Data!$B$2,\"\"),\"\")","v":"15603"},{"$f":"BalanceComprobacion!A213","v":3.1},{"$f":"BalanceComprobacion!B213","v":"1.2.5.01.03.08.1.99999"},{"$f":"BalanceComprobacion!C213","v":"Equipos de medición Valores de origen"},{"$f":"BalanceComprobacion!D213","v":6734898.7300000004},{"$f":"BalanceComprobacion!E213","v":0},{"$f":"BalanceComprobacion!F213","v":0},{"$f":"BalanceComprobacion!G213","v":6734898.7300000004}]
[{"$f":"IFERROR(IF(B168<>0,Data!$B$2,\"\"),\"\")","v":"15603"},{"$f":"BalanceComprobacion!A214","v":3.1},{"$f":"BalanceComprobacion!B214","v":"1.2.5.01.03.08.3."},{"$f":"BalanceComprobacion!C214","v":"Equipos de medición Depreciaciones acumuladas *"},{"$f":"BalanceComprobacion!D214","v":-5786726.8700000001},{"$f":"BalanceComprobacion!E214","v":0},{"$f":"BalanceComprobacion!F214","v":265348.90999999997},{"$f":"BalanceComprobacion!G214","v":-6052075.7800000003}]
[{"$f":"IFERROR(IF(B169<>0,Data!$B$2,\"\"),\"\")","v":"15603"},{"$f":"BalanceComprobacion!A215","v":3.1},{"$f":"BalanceComprobacion!B215","v":"1.2.5.01.03.08.3.99999"},{"$f":"BalanceComprobacion!C215","v":"Equipos de medición Depreciaciones acumuladas *"},{"$f":"BalanceComprobacion!D215","v":-5786726.8700000001},{"$f":"BalanceComprobacion!E215","v":0},{"$f":"BalanceComprobacion!F215","v":265348.90999999997},{"$f":"BalanceComprobacion!G215","v":-6052075.7800000003}]
[{"$f":"IFERROR(IF(B170<>0,Data!$B$2,\"\"),\"\")","v":"15603"},{"$f":"BalanceComprobacion!A216","v":3.1},{"$f":"BalanceComprobacion!B216","v":"1.2.5.01.03.09."},{"$f":"BalanceComprobacion!C216","v":"Bombas"},{"$f":"BalanceComprobacion!D216","v":5578043.8700000001},{"$f":"BalanceComprobacion!E216","v":0},{"$f":"BalanceComprobacion!F216","v":309670.34000000003},{"$f":"BalanceComprobacion!G216","v":5268373.53}]
[{"$f":"IFERROR(IF(B171<>0,Data!$B$2,\"\"),\"\")","v":"15603"},{"$f":"BalanceComprobacion!A217","v":3.1},{"$f":"BalanceComprobacion!B217","v":"1.2.5.01.03.09.1."},{"$f":"BalanceComprobacion!C217","v":"Bombas Valores de origen"},{"$f":"BalanceComprobacion!D217","v":7392803},{"$f":"BalanceComprobacion!E217","v":0},{"$f":"BalanceComprobacion!F217","v":0},{"$f":"BalanceComprobacion!G217","v":7392803}]
[{"$f":"IFERROR(IF(B172<>0,Data!$B$2,\"\"),\"\")","v":"15603"},{"$f":"BalanceComprobacion!A218","v":3.1},{"$f":"BalanceComprobacion!B218","v":"1.2.5.01.03.09.1.99999"},{"$f":"BalanceComprobacion!C218","v":"Bombas Valores de origen"},{"$f":"BalanceComprobacion!D218","v":7392803},{"$f":"BalanceComprobacion!E218","v":0},{"$f":"BalanceComprobacion!F218","v":0},{"$f":"BalanceComprobacion!G218","v":7392803}]
[{"$f":"IFERROR(IF(B173<>0,Data!$B$2,\"\"),\"\")","v":"15603"},{"$f":"BalanceComprobacion!A219","v":3.1},{"$f":"BalanceComprobacion!B219","v":"1.2.5.01.03.09.3."},{"$f":"BalanceComprobacion!C219","v":"Bombas Depreciaciones acumuladas *"},{"$f":"BalanceComprobacion!D219","v":-1814759.13},{"$f":"BalanceComprobacion!E219","v":0},{"$f":"BalanceComprobacion!F219","v":309670.34000000003},{"$f":"BalanceComprobacion!G219","v":-2124429.4700000002}]
[{"$f":"IFERROR(IF(B174<>0,Data!$B$2,\"\"),\"\")","v":"15603"},{"$f":"BalanceComprobacion!A220","v":3.1},{"$f":"BalanceComprobacion!B220","v":"1.2.5.01.03.09.3.99999"},{"$f":"BalanceComprobacion!C220","v":"Bombas Depreciaciones acumuladas *"},{"$f":"BalanceComprobacion!D220","v":-1814759.13},{"$f":"BalanceComprobacion!E220","v":0},{"$f":"BalanceComprobacion!F220","v":309670.34000000003},{"$f":"BalanceComprobacion!G220","v":-2124429.4700000002}]
[{"$f":"IFERROR(IF(B175<>0,Data!$B$2,\"\"),\"\")","v":"15603"},{"$f":"BalanceComprobacion!A221","v":3.1},{"$f":"BalanceComprobacion!B221","v":"1.2.5.01.03.99."},{"$f":"BalanceComprobacion!C221","v":"Otra maquinarias y equipos para la producción"},{"$f":"BalanceComprobacion!D221","v":21859655.140000001},{"$f":"BalanceComprobacion!E221","v":6746926.8899999997},{"$f":"BalanceComprobacion!F221","v":3912874.23},{"$f":"BalanceComprobacion!G221","v":24693707.800000001}]
[{"$f":"IFERROR(IF(B176<>0,Data!$B$2,\"\"),\"\")","v":"15603"},{"$f":"BalanceComprobacion!A222","v":3.1},{"$f":"BalanceComprobacion!B222","v":"1.2.5.01.03.99.1."},{"$f":"BalanceComprobacion!C222","v":"Otra maquinarias y equipos para la producción Valor Origen"},{"$f":"BalanceComprobacion!D222","v":34343856.07},{"$f":"BalanceComprobacion!E222","v":6686805.8499999996},{"$f":"BalanceComprobacion!F222","v":0},{"$f":"BalanceComprobacion!G222","v":41030661.920000002}]
[{"$f":"IFERROR(IF(B177<>0,Data!$B$2,\"\"),\"\")","v":"15603"},{"$f":"BalanceComprobacion!A223","v":3.1},{"$f":"BalanceComprobacion!B223","v":"1.2.5.01.03.99.1.99999"},{"$f":"BalanceComprobacion!C223","v":"Otra maquinarias y equipos para la producción Valor Origen"},{"$f":"BalanceComprobacion!D223","v":34343856.07},{"$f":"BalanceComprobacion!E223","v":6686805.8499999996},{"$f":"BalanceComprobacion!F223","v":0},{"$f":"BalanceComprobacion!G223","v":41030661.920000002}]
[{"$f":"IFERROR(IF(B178<>0,Data!$B$2,\"\"),\"\")","v":"15603"},{"$f":"BalanceComprobacion!A224","v":3.1},{"$f":"BalanceComprobacion!B224","v":"1.2.5.01.03.99.3."},{"$f":"BalanceComprobacion!C224","v":"Otra maquinarias y equipos para la producción Depreciación Acumulada"},{"$f":"BalanceComprobacion!D224","v":-12484200.93},{"$f":"BalanceComprobacion!E224","v":60121.04},{"$f":"BalanceComprobacion!F224","v":3912874.23},{"$f":"BalanceComprobacion!G224","v":-16336954.119999999}]
[{"$f":"IFERROR(IF(B179<>0,Data!$B$2,\"\"),\"\")","v":"15603"},{"$f":"BalanceComprobacion!A225","v":3.1},{"$f":"BalanceComprobacion!B225","v":"1.2.5.01.03.99.3.99999"},{"$f":"BalanceComprobacion!C225","v":"Otra maquinarias y equipos para la producción Depreciación Acumulada"},{"$f":"BalanceComprobacion!D225","v":-12484200.93},{"$f":"BalanceComprobacion!E225","v":60121.04},{"$f":"BalanceComprobacion!F225","v":3912874.23},{"$f":"BalanceComprobacion!G225","v":-16336954.119999999}]
[{"$f":"IFERROR(IF(B180<>0,Data!$B$2,\"\"),\"\")","v":"15603"},{"$f":"BalanceComprobacion!A226","v":3.1},{"$f":"BalanceComprobacion!B226","v":"1.2.5.01.04."},{"$f":"BalanceComprobacion!C226","v":"Equipos de transporte, tracción  elevación"},{"$f":"BalanceComprobacion!D226","v":35355981.640000001},{"$f":"BalanceComprobacion!E226","v":49444630},{"$f":"BalanceComprobacion!F226","v":30884017.780000001},{"$f":"BalanceComprobacion!G226","v":53916593.859999999}]
[{"$f":"IFERROR(IF(B181<>0,Data!$B$2,\"\"),\"\")","v":"15603"},{"$f":"BalanceComprobacion!A227","v":3.1},{"$f":"BalanceComprobacion!B227","v":"1.2.5.01.04.01."},{"$f":"BalanceComprobacion!C227","v":"Motocicletas"},{"$f":"BalanceComprobacion!D227","v":1403960.4},{"$f":"BalanceComprobacion!E227","v":0},{"$f":"BalanceComprobacion!F227","v":203970.4},{"$f":"BalanceComprobacion!G227","v":1199990}]
[{"$f":"IFERROR(IF(B182<>0,Data!$B$2,\"\"),\"\")","v":"15603"},{"$f":"BalanceComprobacion!A228","v":3.1},{"$f":"BalanceComprobacion!B228","v":"1.2.5.01.04.01.1."},{"$f":"BalanceComprobacion!C228","v":"Motocicletas Valores de origen"},{"$f":"BalanceComprobacion!D228","v":10870894},{"$f":"BalanceComprobacion!E228","v":0},{"$f":"BalanceComprobacion!F228","v":0},{"$f":"BalanceComprobacion!G228","v":10870894}]
[{"$f":"IFERROR(IF(B183<>0,Data!$B$2,\"\"),\"\")","v":"15603"},{"$f":"BalanceComprobacion!A229","v":3.1},{"$f":"BalanceComprobacion!B229","v":"1.2.5.01.04.01.1.99999"},{"$f":"BalanceComprobacion!C229","v":"Motocicletas Valores de origen"},{"$f":"BalanceComprobacion!D229","v":10870894},{"$f":"BalanceComprobacion!E229","v":0},{"$f":"BalanceComprobacion!F229","v":0},{"$f":"BalanceComprobacion!G229","v":10870894}]
[{"$f":"IFERROR(IF(B184<>0,Data!$B$2,\"\"),\"\")","v":"15603"},{"$f":"BalanceComprobacion!A230","v":3.1},{"$f":"BalanceComprobacion!B230","v":"1.2.5.01.04.01.3."},{"$f":"BalanceComprobacion!C230","v":"Motocicletas Depreciaciones acumuladas *"},{"$f":"BalanceComprobacion!D230","v":-9466933.5999999996},{"$f":"BalanceComprobacion!E230","v":0},{"$f":"BalanceComprobacion!F230","v":203970.4},{"$f":"BalanceComprobacion!G230","v":-9670904}]
[{"$f":"IFERROR(IF(B185<>0,Data!$B$2,\"\"),\"\")","v":"15603"},{"$f":"BalanceComprobacion!A231","v":3.1},{"$f":"BalanceComprobacion!B231","v":"1.2.5.01.04.01.3.99999"},{"$f":"BalanceComprobacion!C231","v":"Motocicletas Depreciaciones acumuladas *"},{"$f":"BalanceComprobacion!D231","v":-9466933.5999999996},{"$f":"BalanceComprobacion!E231","v":0},{"$f":"BalanceComprobacion!F231","v":203970.4},{"$f":"BalanceComprobacion!G231","v":-9670904}]
[{"$f":"IFERROR(IF(B186<>0,Data!$B$2,\"\"),\"\")","v":"15603"},{"$f":"BalanceComprobacion!A232","v":3.1},{"$f":"BalanceComprobacion!B232","v":"1.2.5.01.04.02."},{"$f":"BalanceComprobacion!C232","v":"Vehículos"},{"$f":"BalanceComprobacion!D232","v":33329396.640000001},{"$f":"BalanceComprobacion!E232","v":49444630},{"$f":"BalanceComprobacion!F232","v":30651486.629999999},{"$f":"BalanceComprobacion!G232","v":52122540.009999998}]
[{"$f":"IFERROR(IF(B187<>0,Data!$B$2,\"\"),\"\")","v":"15603"},{"$f":"BalanceComprobacion!A233","v":3.1},{"$f":"BalanceComprobacion!B233","v":"1.2.5.01.04.02.1."},{"$f":"BalanceComprobacion!C233","v":"Vehículos Valores de origen"},{"$f":"BalanceComprobacion!D233","v":159744469.75},{"$f":"BalanceComprobacion!E233","v":49444630},{"$f":"BalanceComprobacion!F233","v":0},{"$f":"BalanceComprobacion!G233","v":209189099.75}]
[{"$f":"IFERROR(IF(B188<>0,Data!$B$2,\"\"),\"\")","v":"15603"},{"$f":"BalanceComprobacion!A234","v":3.1},{"$f":"BalanceComprobacion!B234","v":"1.2.5.01.04.02.1.99999"},{"$f":"BalanceComprobacion!C234","v":"Vehículos Valores de origen"},{"$f":"BalanceComprobacion!D234","v":159744469.75},{"$f":"BalanceComprobacion!E234","v":49444630},{"$f":"BalanceComprobacion!F234","v":0},{"$f":"BalanceComprobacion!G234","v":209189099.75}]
[{"$f":"IFERROR(IF(B189<>0,Data!$B$2,\"\"),\"\")","v":"15603"},{"$f":"BalanceComprobacion!A235","v":3.1},{"$f":"BalanceComprobacion!B235","v":"1.2.5.01.04.02.3."},{"$f":"BalanceComprobacion!C235","v":"Vehículos Depreciaciones acumuladas *"},{"$f":"BalanceComprobacion!D235","v":-126415073.11},{"$f":"BalanceComprobacion!E235","v":0},{"$f":"BalanceComprobacion!F235","v":30651486.629999999},{"$f":"BalanceComprobacion!G235","v":-157066559.74000001}]
[{"$f":"IFERROR(IF(B190<>0,Data!$B$2,\"\"),\"\")","v":"15603"},{"$f":"BalanceComprobacion!A236","v":3.1},{"$f":"BalanceComprobacion!B236","v":"1.2.5.01.04.02.3.99999"},{"$f":"BalanceComprobacion!C236","v":"Vehículos Depreciaciones acumuladas *"},{"$f":"BalanceComprobacion!D236","v":-126415073.11},{"$f":"BalanceComprobacion!E236","v":0},{"$f":"BalanceComprobacion!F236","v":30651486.629999999},{"$f":"BalanceComprobacion!G236","v":-157066559.74000001}]
[{"$f":"IFERROR(IF(B191<>0,Data!$B$2,\"\"),\"\")","v":"15603"},{"$f":"BalanceComprobacion!A237","v":3.1},{"$f":"BalanceComprobacion!B237","v":"1.2.5.01.04.99."},{"$f":"BalanceComprobacion!C237","v":"Otros equipos de transporte"},{"$f":"BalanceComprobacion!D237","v":622624.6},{"$f":"BalanceComprobacion!E237","v":0},{"$f":"BalanceComprobacion!F237","v":28560.75},{"$f":"BalanceComprobacion!G237","v":594063.85}]
[{"$f":"IFERROR(IF(B192<>0,Data!$B$2,\"\"),\"\")","v":"15603"},{"$f":"BalanceComprobacion!A238","v":3.1},{"$f":"BalanceComprobacion!B238","v":"1.2.5.01.04.99.1."},{"$f":"BalanceComprobacion!C238","v":"Otros equipos de transporte Valores de origen"},{"$f":"BalanceComprobacion!D238","v":685458.25},{"$f":"BalanceComprobacion!E238","v":0},{"$f":"BalanceComprobacion!F238","v":0},{"$f":"BalanceComprobacion!G238","v":685458.25}]
[{"$f":"IFERROR(IF(B193<>0,Data!$B$2,\"\"),\"\")","v":"15603"},{"$f":"BalanceComprobacion!A239","v":3.1},{"$f":"BalanceComprobacion!B239","v":"1.2.5.01.04.99.1.99999"},{"$f":"BalanceComprobacion!C239","v":"Otros equipos de transporte Valores de origen"},{"$f":"BalanceComprobacion!D239","v":685458.25},{"$f":"BalanceComprobacion!E239","v":0},{"$f":"BalanceComprobacion!F239","v":0},{"$f":"BalanceComprobacion!G239","v":685458.25}]
[{"$f":"IFERROR(IF(B194<>0,Data!$B$2,\"\"),\"\")","v":"15603"},{"$f":"BalanceComprobacion!A240","v":3.1},{"$f":"BalanceComprobacion!B240","v":"1.2.5.01.04.99.3."},{"$f":"BalanceComprobacion!C240","v":"Otros equipos transporte Depreciaciones acumuladas *"},{"$f":"BalanceComprobacion!D240","v":-62833.65},{"$f":"BalanceComprobacion!E240","v":0},{"$f":"BalanceComprobacion!F240","v":28560.75},{"$f":"BalanceComprobacion!G240","v":-91394.4}]
[{"$f":"IFERROR(IF(B195<>0,Data!$B$2,\"\"),\"\")","v":"15603"},{"$f":"BalanceComprobacion!A241","v":3.1},{"$f":"BalanceComprobacion!B241","v":"1.2.5.01.04.99.3.99999"},{"$f":"BalanceComprobacion!C241","v":"Otros equipos transporte Depreciaciones acumuladas *"},{"$f":"BalanceComprobacion!D241","v":-62833.65},{"$f":"BalanceComprobacion!E241","v":0},{"$f":"BalanceComprobacion!F241","v":28560.75},{"$f":"BalanceComprobacion!G241","v":-91394.4}]
[{"$f":"IFERROR(IF(B196<>0,Data!$B$2,\"\"),\"\")","v":"15603"},{"$f":"BalanceComprobacion!A242","v":3.1},{"$f":"BalanceComprobacion!B242","v":"1.2.5.01.05."},{"$f":"BalanceComprobacion!C242","v":"Equipos de comunicación"},{"$f":"BalanceComprobacion!D242","v":18834276.370000001},{"$f":"BalanceComprobacion!E242","v":2140124},{"$f":"BalanceComprobacion!F242","v":1427732.27},{"$f":"BalanceComprobacion!G242","v":19546668.100000001}]
[{"$f":"IFERROR(IF(B197<>0,Data!$B$2,\"\"),\"\")","v":"15603"},{"$f":"BalanceComprobacion!A243","v":3.1},{"$f":"BalanceComprobacion!B243","v":"1.2.5.01.05.01."},{"$f":"BalanceComprobacion!C243","v":"Antenas  radares"},{"$f":"BalanceComprobacion!D243","v":617686.27},{"$f":"BalanceComprobacion!E243","v":1586480},{"$f":"BalanceComprobacion!F243","v":23346.28},{"$f":"BalanceComprobacion!G243","v":2180819.9900000002}]
[{"$f":"IFERROR(IF(B198<>0,Data!$B$2,\"\"),\"\")","v":"15603"},{"$f":"BalanceComprobacion!A244","v":3.1},{"$f":"BalanceComprobacion!B244","v":"1.2.5.01.05.01.1."},{"$f":"BalanceComprobacion!C244","v":"Antenas y radares Valores de origen"},{"$f":"BalanceComprobacion!D244","v":803325.36},{"$f":"BalanceComprobacion!E244","v":1586480},{"$f":"BalanceComprobacion!F244","v":0},{"$f":"BalanceComprobacion!G244","v":2389805.36}]
[{"$f":"IFERROR(IF(B199<>0,Data!$B$2,\"\"),\"\")","v":"15603"},{"$f":"BalanceComprobacion!A245","v":3.1},{"$f":"BalanceComprobacion!B245","v":"1.2.5.01.05.01.1.99999"},{"$f":"BalanceComprobacion!C245","v":"Antenas y radares Valores de origen"},{"$f":"BalanceComprobacion!D245","v":803325.36},{"$f":"BalanceComprobacion!E245","v":1586480},{"$f":"BalanceComprobacion!F245","v":0},{"$f":"BalanceComprobacion!G245","v":2389805.36}]
[{"$f":"IFERROR(IF(B200<>0,Data!$B$2,\"\"),\"\")","v":"15603"},{"$f":"BalanceComprobacion!A246","v":3.1},{"$f":"BalanceComprobacion!B246","v":"1.2.5.01.05.01.3."},{"$f":"BalanceComprobacion!C246","v":"Antenas y radares Depreciaciones acumuladas *"},{"$f":"BalanceComprobacion!D246","v":-185639.09},{"$f":"BalanceComprobacion!E246","v":0},{"$f":"BalanceComprobacion!F246","v":23346.28},{"$f":"BalanceComprobacion!G246","v":-208985.37}]
[{"$f":"IFERROR(IF(B201<>0,Data!$B$2,\"\"),\"\")","v":"15603"},{"$f":"BalanceComprobacion!A247","v":3.1},{"$f":"BalanceComprobacion!B247","v":"1.2.5.01.05.01.3.99999"},{"$f":"BalanceComprobacion!C247","v":"Antenas y radares Depreciaciones acumuladas *"},{"$f":"BalanceComprobacion!D247","v":-185639.09},{"$f":"BalanceComprobacion!E247","v":0},{"$f":"BalanceComprobacion!F247","v":23346.28},{"$f":"BalanceComprobacion!G247","v":-208985.37}]
[{"$f":"IFERROR(IF(B202<>0,Data!$B$2,\"\"),\"\")","v":"15603"},{"$f":"BalanceComprobacion!A248","v":3.1},{"$f":"BalanceComprobacion!B248","v":"1.2.5.01.05.02."},{"$f":"BalanceComprobacion!C248","v":"Equipos de telefonía"},{"$f":"BalanceComprobacion!D248","v":715883.61},{"$f":"BalanceComprobacion!E248","v":0},{"$f":"BalanceComprobacion!F248","v":76157.850000000006},{"$f":"BalanceComprobacion!G248","v":639725.76}]
[{"$f":"IFERROR(IF(B203<>0,Data!$B$2,\"\"),\"\")","v":"15603"},{"$f":"BalanceComprobacion!A249","v":3.1},{"$f":"BalanceComprobacion!B249","v":"1.2.5.01.05.02.1."},{"$f":"BalanceComprobacion!C249","v":"Equipos de telefonía Valores de origen"},{"$f":"BalanceComprobacion!D249","v":3458113.3},{"$f":"BalanceComprobacion!E249","v":0},{"$f":"BalanceComprobacion!F249","v":0},{"$f":"BalanceComprobacion!G249","v":3458113.3}]
[{"$f":"IFERROR(IF(B204<>0,Data!$B$2,\"\"),\"\")","v":"15603"},{"$f":"BalanceComprobacion!A250","v":3.1},{"$f":"BalanceComprobacion!B250","v":"1.2.5.01.05.02.1.99999"},{"$f":"BalanceComprobacion!C250","v":"Equipos de telefonía Valores de origen"},{"$f":"BalanceComprobacion!D250","v":3458113.3},{"$f":"BalanceComprobacion!E250","v":0},{"$f":"BalanceComprobacion!F250","v":0},{"$f":"BalanceComprobacion!G250","v":3458113.3}]
[{"$f":"IFERROR(IF(B205<>0,Data!$B$2,\"\"),\"\")","v":"15603"},{"$f":"BalanceComprobacion!A251","v":3.1},{"$f":"BalanceComprobacion!B251","v":"1.2.5.01.05.02.3."},{"$f":"BalanceComprobacion!C251","v":"Equipos de telefonía Depreciaciones acumuladas *"},{"$f":"BalanceComprobacion!D251","v":-2742229.69},{"$f":"BalanceComprobacion!E251","v":0},{"$f":"BalanceComprobacion!F251","v":76157.850000000006},{"$f":"BalanceComprobacion!G251","v":-2818387.54}]
[{"$f":"IFERROR(IF(B206<>0,Data!$B$2,\"\"),\"\")","v":"15603"},{"$f":"BalanceComprobacion!A252","v":3.1},{"$f":"BalanceComprobacion!B252","v":"1.2.5.01.05.02.3.99999"},{"$f":"BalanceComprobacion!C252","v":"Equipos de telefonía Depreciaciones acumuladas *"},{"$f":"BalanceComprobacion!D252","v":-2742229.69},{"$f":"BalanceComprobacion!E252","v":0},{"$f":"BalanceComprobacion!F252","v":76157.850000000006},{"$f":"BalanceComprobacion!G252","v":-2818387.54}]
[{"$f":"IFERROR(IF(B207<>0,Data!$B$2,\"\"),\"\")","v":"15603"},{"$f":"BalanceComprobacion!A253","v":3.1},{"$f":"BalanceComprobacion!B253","v":"1.2.5.01.05.04."},{"$f":"BalanceComprobacion!C253","v":"Equipos de audio  video"},{"$f":"BalanceComprobacion!D253","v":12505413.4},{"$f":"BalanceComprobacion!E253","v":553644},{"$f":"BalanceComprobacion!F253","v":1107197.49},{"$f":"BalanceComprobacion!G253","v":11951859.91}]
[{"$f":"IFERROR(IF(B208<>0,Data!$B$2,\"\"),\"\")","v":"15603"},{"$f":"BalanceComprobacion!A254","v":3.1},{"$f":"BalanceComprobacion!B254","v":"1.2.5.01.05.04.1."},{"$f":"BalanceComprobacion!C254","v":"Equipos de audio y video Valores de origen"},{"$f":"BalanceComprobacion!D254","v":22576099.77},{"$f":"BalanceComprobacion!E254","v":553644},{"$f":"BalanceComprobacion!F254","v":0},{"$f":"BalanceComprobacion!G254","v":23129743.77}]
[{"$f":"IFERROR(IF(B209<>0,Data!$B$2,\"\"),\"\")","v":"15603"},{"$f":"BalanceComprobacion!A255","v":3.1},{"$f":"BalanceComprobacion!B255","v":"1.2.5.01.05.04.1.99999"},{"$f":"BalanceComprobacion!C255","v":"Equipos de audio y video Valores de origen"},{"$f":"BalanceComprobacion!D255","v":22576099.77},{"$f":"BalanceComprobacion!E255","v":553644},{"$f":"BalanceComprobacion!F255","v":0},{"$f":"BalanceComprobacion!G255","v":23129743.77}]
[{"$f":"IFERROR(IF(B210<>0,Data!$B$2,\"\"),\"\")","v":"15603"},{"$f":"BalanceComprobacion!A256","v":3.1},{"$f":"BalanceComprobacion!B256","v":"1.2.5.01.05.04.3."},{"$f":"BalanceComprobacion!C256","v":"Equipos de audio y video Depreciaciones acumuladas"},{"$f":"BalanceComprobacion!D256","v":-10070686.369999999},{"$f":"BalanceComprobacion!E256","v":0},{"$f":"BalanceComprobacion!F256","v":1107197.49},{"$f":"BalanceComprobacion!G256","v":-11177883.859999999}]
[{"$f":"IFERROR(IF(B211<>0,Data!$B$2,\"\"),\"\")","v":"15603"},{"$f":"BalanceComprobacion!A257","v":3.1},{"$f":"BalanceComprobacion!B257","v":"1.2.5.01.05.04.3.99999"},{"$f":"BalanceComprobacion!C257","v":"Equipos de audio y video Depreciaciones acumuladas"},{"$f":"BalanceComprobacion!D257","v":-10070686.369999999},{"$f":"BalanceComprobacion!E257","v":0},{"$f":"BalanceComprobacion!F257","v":1107197.49},{"$f":"BalanceComprobacion!G257","v":-11177883.859999999}]
[{"$f":"IFERROR(IF(B212<>0,Data!$B$2,\"\"),\"\")","v":"15603"},{"$f":"BalanceComprobacion!A258","v":3.1},{"$f":"BalanceComprobacion!B258","v":"1.2.5.01.05.99."},{"$f":"BalanceComprobacion!C258","v":"Otros equipos de comunicación"},{"$f":"BalanceComprobacion!D258","v":4995293.09},{"$f":"BalanceComprobacion!E258","v":0},{"$f":"BalanceComprobacion!F258","v":221030.65},{"$f":"BalanceComprobacion!G258","v":4774262.4400000004}]
[{"$f":"IFERROR(IF(B213<>0,Data!$B$2,\"\"),\"\")","v":"15603"},{"$f":"BalanceComprobacion!A259","v":3.1},{"$f":"BalanceComprobacion!B259","v":"1.2.5.01.05.99.1."},{"$f":"BalanceComprobacion!C259","v":"Otros equipos de comunicación Valores de origen"},{"$f":"BalanceComprobacion!D259","v":5304736},{"$f":"BalanceComprobacion!E259","v":0},{"$f":"BalanceComprobacion!F259","v":0},{"$f":"BalanceComprobacion!G259","v":5304736}]
[{"$f":"IFERROR(IF(B214<>0,Data!$B$2,\"\"),\"\")","v":"15603"},{"$f":"BalanceComprobacion!A260","v":3.1},{"$f":"BalanceComprobacion!B260","v":"1.2.5.01.05.99.1.99999"},{"$f":"BalanceComprobacion!C260","v":"Otros equipos de comunicación Valores de origen"},{"$f":"BalanceComprobacion!D260","v":5304736},{"$f":"BalanceComprobacion!E260","v":0},{"$f":"BalanceComprobacion!F260","v":0},{"$f":"BalanceComprobacion!G260","v":5304736}]
[{"$f":"IFERROR(IF(B215<>0,Data!$B$2,\"\"),\"\")","v":"15603"},{"$f":"BalanceComprobacion!A261","v":3.1},{"$f":"BalanceComprobacion!B261","v":"1.2.5.01.05.99.3."},{"$f":"BalanceComprobacion!C261","v":"Otros equipos de comunicaciónDepreciaciones acumuladas"},{"$f":"BalanceComprobacion!D261","v":-309442.90999999997},{"$f":"BalanceComprobacion!E261","v":0},{"$f":"BalanceComprobacion!F261","v":221030.65},{"$f":"BalanceComprobacion!G261","v":-530473.56000000006}]
[{"$f":"IFERROR(IF(B216<>0,Data!$B$2,\"\"),\"\")","v":"15603"},{"$f":"BalanceComprobacion!A262","v":3.1},{"$f":"BalanceComprobacion!B262","v":"1.2.5.01.05.99.3.99999"},{"$f":"BalanceComprobacion!C262","v":"Otros equipos de comunicaciónDepreciaciones acumuladas"},{"$f":"BalanceComprobacion!D262","v":-309442.90999999997},{"$f":"BalanceComprobacion!E262","v":0},{"$f":"BalanceComprobacion!F262","v":221030.65},{"$f":"BalanceComprobacion!G262","v":-530473.56000000006}]
[{"$f":"IFERROR(IF(B217<>0,Data!$B$2,\"\"),\"\")","v":"15603"},{"$f":"BalanceComprobacion!A263","v":3.1},{"$f":"BalanceComprobacion!B263","v":"1.2.5.01.06."},{"$f":"BalanceComprobacion!C263","v":"Equipos  mobiliario de oficina"},{"$f":"BalanceComprobacion!D263","v":33924782.57},{"$f":"BalanceComprobacion!E263","v":6554791.0700000003},{"$f":"BalanceComprobacion!F263","v":4373207.45},{"$f":"BalanceComprobacion!G263","v":36106366.189999998}]
[{"$f":"IFERROR(IF(B218<>0,Data!$B$2,\"\"),\"\")","v":"15603"},{"$f":"BalanceComprobacion!A264","v":3.1},{"$f":"BalanceComprobacion!B264","v":"1.2.5.01.06.01."},{"$f":"BalanceComprobacion!C264","v":"Archivadores, bibliotecas  armarios"},{"$f":"BalanceComprobacion!D264","v":6140371.3799999999},{"$f":"BalanceComprobacion!E264","v":380518.34},{"$f":"BalanceComprobacion!F264","v":560351.99},{"$f":"BalanceComprobacion!G264","v":5960537.7300000004}]
[{"$f":"IFERROR(IF(B219<>0,Data!$B$2,\"\"),\"\")","v":"15603"},{"$f":"BalanceComprobacion!A265","v":3.1},{"$f":"BalanceComprobacion!B265","v":"1.2.5.01.06.01.1."},{"$f":"BalanceComprobacion!C265","v":"Archivadores, bibliotecas y armarios Valor Origen"},{"$f":"BalanceComprobacion!D265","v":17592360.27},{"$f":"BalanceComprobacion!E265","v":379225},{"$f":"BalanceComprobacion!F265","v":0},{"$f":"BalanceComprobacion!G265","v":17971585.27}]
[{"$f":"IFERROR(IF(B220<>0,Data!$B$2,\"\"),\"\")","v":"15603"},{"$f":"BalanceComprobacion!A266","v":3.1},{"$f":"BalanceComprobacion!B266","v":"1.2.5.01.06.01.1.99999"},{"$f":"BalanceComprobacion!C266","v":"Archivadores, bibliotecas y armarios Valor Origen"},{"$f":"BalanceComprobacion!D266","v":17592360.27},{"$f":"BalanceComprobacion!E266","v":379225},{"$f":"BalanceComprobacion!F266","v":0},{"$f":"BalanceComprobacion!G266","v":17971585.27}]
[{"$f":"IFERROR(IF(B221<>0,Data!$B$2,\"\"),\"\")","v":"15603"},{"$f":"BalanceComprobacion!A267","v":3.1},{"$f":"BalanceComprobacion!B267","v":"1.2.5.01.06.01.3."},{"$f":"BalanceComprobacion!C267","v":"Archivadores bibliotecas y armarios Deprec Acum"},{"$f":"BalanceComprobacion!D267","v":-11451988.890000001},{"$f":"BalanceComprobacion!E267","v":1293.3399999999999},{"$f":"BalanceComprobacion!F267","v":560351.99},{"$f":"BalanceComprobacion!G267","v":-12011047.539999999}]
[{"$f":"IFERROR(IF(B222<>0,Data!$B$2,\"\"),\"\")","v":"15603"},{"$f":"BalanceComprobacion!A268","v":3.1},{"$f":"BalanceComprobacion!B268","v":"1.2.5.01.06.01.3.99999"},{"$f":"BalanceComprobacion!C268","v":"Archivadores bibliotecas y armarios Deprec Acum"},{"$f":"BalanceComprobacion!D268","v":-11451988.890000001},{"$f":"BalanceComprobacion!E268","v":1293.3399999999999},{"$f":"BalanceComprobacion!F268","v":560351.99},{"$f":"BalanceComprobacion!G268","v":-12011047.539999999}]
[{"$f":"IFERROR(IF(B223<>0,Data!$B$2,\"\"),\"\")","v":"15603"},{"$f":"BalanceComprobacion!A269","v":3.1},{"$f":"BalanceComprobacion!B269","v":"1.2.5.01.06.02."},{"$f":"BalanceComprobacion!C269","v":"Mesas  escritorios"},{"$f":"BalanceComprobacion!D269","v":7882463.8700000001},{"$f":"BalanceComprobacion!E269","v":708311},{"$f":"BalanceComprobacion!F269","v":586657.98},{"$f":"BalanceComprobacion!G269","v":8004116.8899999997}]
[{"$f":"IFERROR(IF(B224<>0,Data!$B$2,\"\"),\"\")","v":"15603"},{"$f":"BalanceComprobacion!A270","v":3.1},{"$f":"BalanceComprobacion!B270","v":"1.2.5.01.06.02.1."},{"$f":"BalanceComprobacion!C270","v":"Mesas y escritorios Valores de origen"},{"$f":"BalanceComprobacion!D270","v":14653856.369999999},{"$f":"BalanceComprobacion!E270","v":708311},{"$f":"BalanceComprobacion!F270","v":0},{"$f":"BalanceComprobacion!G270","v":15362167.369999999}]
[{"$f":"IFERROR(IF(B225<>0,Data!$B$2,\"\"),\"\")","v":"15603"},{"$f":"BalanceComprobacion!A271","v":3.1},{"$f":"BalanceComprobacion!B271","v":"1.2.5.01.06.02.1.99999"},{"$f":"BalanceComprobacion!C271","v":"Mesas y escritorios Valores de origen"},{"$f":"BalanceComprobacion!D271","v":14653856.369999999},{"$f":"BalanceComprobacion!E271","v":708311},{"$f":"BalanceComprobacion!F271","v":0},{"$f":"BalanceComprobacion!G271","v":15362167.369999999}]
[{"$f":"IFERROR(IF(B226<>0,Data!$B$2,\"\"),\"\")","v":"15603"},{"$f":"BalanceComprobacion!A272","v":3.1},{"$f":"BalanceComprobacion!B272","v":"1.2.5.01.06.02.3."},{"$f":"BalanceComprobacion!C272","v":"Mesas y escritorios Depreciaciones acumuladas *"},{"$f":"BalanceComprobacion!D272","v":-6771392.5},{"$f":"BalanceComprobacion!E272","v":0},{"$f":"BalanceComprobacion!F272","v":586657.98},{"$f":"BalanceComprobacion!G272","v":-7358050.4800000004}]
[{"$f":"IFERROR(IF(B227<>0,Data!$B$2,\"\"),\"\")","v":"15603"},{"$f":"BalanceComprobacion!A273","v":3.1},{"$f":"BalanceComprobacion!B273","v":"1.2.5.01.06.02.3.99999"},{"$f":"BalanceComprobacion!C273","v":"Mesas y escritorios Depreciaciones acumuladas *"},{"$f":"BalanceComprobacion!D273","v":-6771392.5},{"$f":"BalanceComprobacion!E273","v":0},{"$f":"BalanceComprobacion!F273","v":586657.98},{"$f":"BalanceComprobacion!G273","v":-7358050.4800000004}]
[{"$f":"IFERROR(IF(B228<>0,Data!$B$2,\"\"),\"\")","v":"15603"},{"$f":"BalanceComprobacion!A274","v":3.1},{"$f":"BalanceComprobacion!B274","v":"1.2.5.01.06.03."},{"$f":"BalanceComprobacion!C274","v":"Sillas  bancos"},{"$f":"BalanceComprobacion!D274","v":5051640.6900000004},{"$f":"BalanceComprobacion!E274","v":277396},{"$f":"BalanceComprobacion!F274","v":384008.43},{"$f":"BalanceComprobacion!G274","v":4945028.26}]
[{"$f":"IFERROR(IF(B229<>0,Data!$B$2,\"\"),\"\")","v":"15603"},{"$f":"BalanceComprobacion!A275","v":3.1},{"$f":"BalanceComprobacion!B275","v":"1.2.5.01.06.03.1."},{"$f":"BalanceComprobacion!C275","v":"Sillas y bancos Valores de origen"},{"$f":"BalanceComprobacion!D275","v":9996276.9199999999},{"$f":"BalanceComprobacion!E275","v":277396},{"$f":"BalanceComprobacion!F275","v":0},{"$f":"BalanceComprobacion!G275","v":10273672.92}]
[{"$f":"IFERROR(IF(B230<>0,Data!$B$2,\"\"),\"\")","v":"15603"},{"$f":"BalanceComprobacion!A276","v":3.1},{"$f":"BalanceComprobacion!B276","v":"1.2.5.01.06.03.1.99999"},{"$f":"BalanceComprobacion!C276","v":"Sillas y bancos Valores de origen"},{"$f":"BalanceComprobacion!D276","v":9996276.9199999999},{"$f":"BalanceComprobacion!E276","v":277396},{"$f":"BalanceComprobacion!F276","v":0},{"$f":"BalanceComprobacion!G276","v":10273672.92}]
[{"$f":"IFERROR(IF(B231<>0,Data!$B$2,\"\"),\"\")","v":"15603"},{"$f":"BalanceComprobacion!A277","v":3.1},{"$f":"BalanceComprobacion!B277","v":"1.2.5.01.06.03.3."},{"$f":"BalanceComprobacion!C277","v":"Sillas y bancos Depreciaciones acumuladas *"},{"$f":"BalanceComprobacion!D277","v":-4944636.2300000004},{"$f":"BalanceComprobacion!E277","v":0},{"$f":"BalanceComprobacion!F277","v":384008.43},{"$f":"BalanceComprobacion!G277","v":-5328644.66}]
[{"$f":"IFERROR(IF(B232<>0,Data!$B$2,\"\"),\"\")","v":"15603"},{"$f":"BalanceComprobacion!A278","v":3.1},{"$f":"BalanceComprobacion!B278","v":"1.2.5.01.06.03.3.99999"},{"$f":"BalanceComprobacion!C278","v":"Sillas y bancos Depreciaciones acumuladas *"},{"$f":"BalanceComprobacion!D278","v":-4944636.2300000004},{"$f":"BalanceComprobacion!E278","v":0},{"$f":"BalanceComprobacion!F278","v":384008.43},{"$f":"BalanceComprobacion!G278","v":-5328644.66}]
[{"$f":"IFERROR(IF(B233<>0,Data!$B$2,\"\"),\"\")","v":"15603"},{"$f":"BalanceComprobacion!A279","v":3.1},{"$f":"BalanceComprobacion!B279","v":"1.2.5.01.06.05."},{"$f":"BalanceComprobacion!C279","v":"Equipos de ventilación"},{"$f":"BalanceComprobacion!D279","v":10651401.060000001},{"$f":"BalanceComprobacion!E279","v":3377208.34},{"$f":"BalanceComprobacion!F279","v":2027615.65},{"$f":"BalanceComprobacion!G279","v":12000993.75}]
[{"$f":"IFERROR(IF(B234<>0,Data!$B$2,\"\"),\"\")","v":"15603"},{"$f":"BalanceComprobacion!A280","v":3.1},{"$f":"BalanceComprobacion!B280","v":"1.2.5.01.06.05.1."},{"$f":"BalanceComprobacion!C280","v":"Equipos de ventilación Valores de origen"},{"$f":"BalanceComprobacion!D280","v":19490955},{"$f":"BalanceComprobacion!E280","v":3362500},{"$f":"BalanceComprobacion!F280","v":0},{"$f":"BalanceComprobacion!G280","v":22853455}]
[{"$f":"IFERROR(IF(B235<>0,Data!$B$2,\"\"),\"\")","v":"15603"},{"$f":"BalanceComprobacion!A281","v":3.1},{"$f":"BalanceComprobacion!B281","v":"1.2.5.01.06.05.1.99999"},{"$f":"BalanceComprobacion!C281","v":"Equipos de ventilación Valores de origen"},{"$f":"BalanceComprobacion!D281","v":19490955},{"$f":"BalanceComprobacion!E281","v":3362500},{"$f":"BalanceComprobacion!F281","v":0},{"$f":"BalanceComprobacion!G281","v":22853455}]
[{"$f":"IFERROR(IF(B236<>0,Data!$B$2,\"\"),\"\")","v":"15603"},{"$f":"BalanceComprobacion!A282","v":3.1},{"$f":"BalanceComprobacion!B282","v":"1.2.5.01.06.05.3."},{"$f":"BalanceComprobacion!C282","v":"Equipos de ventilación Depreciaciones acumuladas *"},{"$f":"BalanceComprobacion!D282","v":-8839553.9399999995},{"$f":"BalanceComprobacion!E282","v":14708.34},{"$f":"BalanceComprobacion!F282","v":2027615.65},{"$f":"BalanceComprobacion!G282","v":-10852461.25}]
[{"$f":"IFERROR(IF(B237<>0,Data!$B$2,\"\"),\"\")","v":"15603"},{"$f":"BalanceComprobacion!A283","v":3.1},{"$f":"BalanceComprobacion!B283","v":"1.2.5.01.06.05.3.99999"},{"$f":"BalanceComprobacion!C283","v":"Equipos de ventilación Depreciaciones acumuladas *"},{"$f":"BalanceComprobacion!D283","v":-8839553.9399999995},{"$f":"BalanceComprobacion!E283","v":14708.34},{"$f":"BalanceComprobacion!F283","v":2027615.65},{"$f":"BalanceComprobacion!G283","v":-10852461.25}]
[{"$f":"IFERROR(IF(B238<>0,Data!$B$2,\"\"),\"\")","v":"15603"},{"$f":"BalanceComprobacion!A284","v":3.1},{"$f":"BalanceComprobacion!B284","v":"1.2.5.01.06.99."},{"$f":"BalanceComprobacion!C284","v":"Otros equipos  mobiliario"},{"$f":"BalanceComprobacion!D284","v":4198905.57},{"$f":"BalanceComprobacion!E284","v":1811357.39},{"$f":"BalanceComprobacion!F284","v":814573.4},{"$f":"BalanceComprobacion!G284","v":5195689.5599999996}]
[{"$f":"IFERROR(IF(B239<>0,Data!$B$2,\"\"),\"\")","v":"15603"},{"$f":"BalanceComprobacion!A285","v":3.1},{"$f":"BalanceComprobacion!B285","v":"1.2.5.01.06.99.1."},{"$f":"BalanceComprobacion!C285","v":"Otros equipos y mobiliario Valores de origen"},{"$f":"BalanceComprobacion!D285","v":8129156.3399999999},{"$f":"BalanceComprobacion!E285","v":1809524},{"$f":"BalanceComprobacion!F285","v":0},{"$f":"BalanceComprobacion!G285","v":9938680.3399999999}]
[{"$f":"IFERROR(IF(B240<>0,Data!$B$2,\"\"),\"\")","v":"15603"},{"$f":"BalanceComprobacion!A286","v":3.1},{"$f":"BalanceComprobacion!B286","v":"1.2.5.01.06.99.1.99999"},{"$f":"BalanceComprobacion!C286","v":"Otros equipos y mobiliario Valores de origen"},{"$f":"BalanceComprobacion!D286","v":8129156.3399999999},{"$f":"BalanceComprobacion!E286","v":1809524},{"$f":"BalanceComprobacion!F286","v":0},{"$f":"BalanceComprobacion!G286","v":9938680.3399999999}]
[{"$f":"IFERROR(IF(B241<>0,Data!$B$2,\"\"),\"\")","v":"15603"},{"$f":"BalanceComprobacion!A287","v":3.1},{"$f":"BalanceComprobacion!B287","v":"1.2.5.01.06.99.3."},{"$f":"BalanceComprobacion!C287","v":"Otros equipos y mobiliario Depreciaciones acumuladas"},{"$f":"BalanceComprobacion!D287","v":-3930250.77},{"$f":"BalanceComprobacion!E287","v":1833.39},{"$f":"BalanceComprobacion!F287","v":814573.4},{"$f":"BalanceComprobacion!G287","v":-4742990.78}]
[{"$f":"IFERROR(IF(B242<>0,Data!$B$2,\"\"),\"\")","v":"15603"},{"$f":"BalanceComprobacion!A288","v":3.1},{"$f":"BalanceComprobacion!B288","v":"1.2.5.01.06.99.3.99999"},{"$f":"BalanceComprobacion!C288","v":"Otros equipos y mobiliario Depreciaciones acumuladas"},{"$f":"BalanceComprobacion!D288","v":-3930250.77},{"$f":"BalanceComprobacion!E288","v":1833.39},{"$f":"BalanceComprobacion!F288","v":814573.4},{"$f":"BalanceComprobacion!G288","v":-4742990.78}]
[{"$f":"IFERROR(IF(B243<>0,Data!$B$2,\"\"),\"\")","v":"15603"},{"$f":"BalanceComprobacion!A289","v":3.1},{"$f":"BalanceComprobacion!B289","v":"1.2.5.01.07."},{"$f":"BalanceComprobacion!C289","v":"Equipos para computación"},{"$f":"BalanceComprobacion!D289","v":25812942.670000002},{"$f":"BalanceComprobacion!E289","v":7718387.0700000003},{"$f":"BalanceComprobacion!F289","v":5888815.9000000004},{"$f":"BalanceComprobacion!G289","v":27642513.84}]
[{"$f":"IFERROR(IF(B244<>0,Data!$B$2,\"\"),\"\")","v":"15603"},{"$f":"BalanceComprobacion!A290","v":3.1},{"$f":"BalanceComprobacion!B290","v":"1.2.5.01.07.01."},{"$f":"BalanceComprobacion!C290","v":"Computadoras"},{"$f":"BalanceComprobacion!D290","v":15771655.710000001},{"$f":"BalanceComprobacion!E290","v":5567670.2000000002},{"$f":"BalanceComprobacion!F290","v":3606288.7},{"$f":"BalanceComprobacion!G290","v":17733037.210000001}]
[{"$f":"IFERROR(IF(B245<>0,Data!$B$2,\"\"),\"\")","v":"15603"},{"$f":"BalanceComprobacion!A291","v":3.1},{"$f":"BalanceComprobacion!B291","v":"1.2.5.01.07.01.1."},{"$f":"BalanceComprobacion!C291","v":"Computadoras Valores de origen"},{"$f":"BalanceComprobacion!D291","v":62424668.5},{"$f":"BalanceComprobacion!E291","v":5493835},{"$f":"BalanceComprobacion!F291","v":0},{"$f":"BalanceComprobacion!G291","v":67918503.5}]
[{"$f":"IFERROR(IF(B246<>0,Data!$B$2,\"\"),\"\")","v":"15603"},{"$f":"BalanceComprobacion!A292","v":3.1},{"$f":"BalanceComprobacion!B292","v":"1.2.5.01.07.01.1.99999"},{"$f":"BalanceComprobacion!C292","v":"Computadoras Valores de origen"},{"$f":"BalanceComprobacion!D292","v":62424668.5},{"$f":"BalanceComprobacion!E292","v":5493835},{"$f":"BalanceComprobacion!F292","v":0},{"$f":"BalanceComprobacion!G292","v":67918503.5}]
[{"$f":"IFERROR(IF(B247<>0,Data!$B$2,\"\"),\"\")","v":"15603"},{"$f":"BalanceComprobacion!A293","v":3.1},{"$f":"BalanceComprobacion!B293","v":"1.2.5.01.07.01.3."},{"$f":"BalanceComprobacion!C293","v":"Computadoras Depreciaciones acumuladas *"},{"$f":"BalanceComprobacion!D293","v":-46653012.789999999},{"$f":"BalanceComprobacion!E293","v":73835.199999999997},{"$f":"BalanceComprobacion!F293","v":3606288.7},{"$f":"BalanceComprobacion!G293","v":-50185466.289999999}]
[{"$f":"IFERROR(IF(B248<>0,Data!$B$2,\"\"),\"\")","v":"15603"},{"$f":"BalanceComprobacion!A294","v":3.1},{"$f":"BalanceComprobacion!B294","v":"1.2.5.01.07.01.3.99999"},{"$f":"BalanceComprobacion!C294","v":"Computadoras Depreciaciones acumuladas *"},{"$f":"BalanceComprobacion!D294","v":-46653012.789999999},{"$f":"BalanceComprobacion!E294","v":73835.199999999997},{"$f":"BalanceComprobacion!F294","v":3606288.7},{"$f":"BalanceComprobacion!G294","v":-50185466.289999999}]
[{"$f":"IFERROR(IF(B249<>0,Data!$B$2,\"\"),\"\")","v":"15603"},{"$f":"BalanceComprobacion!A295","v":3.1},{"$f":"BalanceComprobacion!B295","v":"1.2.5.01.07.02."},{"$f":"BalanceComprobacion!C295","v":"Impresoras"},{"$f":"BalanceComprobacion!D295","v":4395203.12},{"$f":"BalanceComprobacion!E295","v":483046},{"$f":"BalanceComprobacion!F295","v":957146.06},{"$f":"BalanceComprobacion!G295","v":3921103.06}]
[{"$f":"IFERROR(IF(B250<>0,Data!$B$2,\"\"),\"\")","v":"15603"},{"$f":"BalanceComprobacion!A296","v":3.1},{"$f":"BalanceComprobacion!B296","v":"1.2.5.01.07.02.1."},{"$f":"BalanceComprobacion!C296","v":"Impresoras Valores de origen"},{"$f":"BalanceComprobacion!D296","v":18223755.879999999},{"$f":"BalanceComprobacion!E296","v":483046},{"$f":"BalanceComprobacion!F296","v":0},{"$f":"BalanceComprobacion!G296","v":18706801.879999999}]
[{"$f":"IFERROR(IF(B251<>0,Data!$B$2,\"\"),\"\")","v":"15603"},{"$f":"BalanceComprobacion!A297","v":3.1},{"$f":"BalanceComprobacion!B297","v":"1.2.5.01.07.02.1.99999"},{"$f":"BalanceComprobacion!C297","v":"Impresoras Valores de origen"},{"$f":"BalanceComprobacion!D297","v":18223755.879999999},{"$f":"BalanceComprobacion!E297","v":483046},{"$f":"BalanceComprobacion!F297","v":0},{"$f":"BalanceComprobacion!G297","v":18706801.879999999}]
[{"$f":"IFERROR(IF(B252<>0,Data!$B$2,\"\"),\"\")","v":"15603"},{"$f":"BalanceComprobacion!A298","v":3.1},{"$f":"BalanceComprobacion!B298","v":"1.2.5.01.07.02.3."},{"$f":"BalanceComprobacion!C298","v":"Impresoras Depreciaciones acumuladas *"},{"$f":"BalanceComprobacion!D298","v":-13828552.76},{"$f":"BalanceComprobacion!E298","v":0},{"$f":"BalanceComprobacion!F298","v":957146.06},{"$f":"BalanceComprobacion!G298","v":-14785698.82}]
[{"$f":"IFERROR(IF(B253<>0,Data!$B$2,\"\"),\"\")","v":"15603"},{"$f":"BalanceComprobacion!A299","v":3.1},{"$f":"BalanceComprobacion!B299","v":"1.2.5.01.07.02.3.99999"},{"$f":"BalanceComprobacion!C299","v":"Impresoras Depreciaciones acumuladas *"},{"$f":"BalanceComprobacion!D299","v":-13828552.76},{"$f":"BalanceComprobacion!E299","v":0},{"$f":"BalanceComprobacion!F299","v":957146.06},{"$f":"BalanceComprobacion!G299","v":-14785698.82}]
[{"$f":"IFERROR(IF(B254<>0,Data!$B$2,\"\"),\"\")","v":"15603"},{"$f":"BalanceComprobacion!A300","v":3.1},{"$f":"BalanceComprobacion!B300","v":"1.2.5.01.07.04."},{"$f":"BalanceComprobacion!C300","v":"Monitores"},{"$f":"BalanceComprobacion!D300","v":2262347.1800000002},{"$f":"BalanceComprobacion!E300","v":984321.87},{"$f":"BalanceComprobacion!F300","v":690121.53},{"$f":"BalanceComprobacion!G300","v":2556547.52}]
[{"$f":"IFERROR(IF(B255<>0,Data!$B$2,\"\"),\"\")","v":"15603"},{"$f":"BalanceComprobacion!A301","v":3.1},{"$f":"BalanceComprobacion!B301","v":"1.2.5.01.07.04.1."},{"$f":"BalanceComprobacion!C301","v":"Monitores Valores de origen"},{"$f":"BalanceComprobacion!D301","v":8849612.7400000002},{"$f":"BalanceComprobacion!E301","v":616590},{"$f":"BalanceComprobacion!F301","v":0},{"$f":"BalanceComprobacion!G301","v":9466202.7400000002}]
[{"$f":"IFERROR(IF(B256<>0,Data!$B$2,\"\"),\"\")","v":"15603"},{"$f":"BalanceComprobacion!A302","v":3.1},{"$f":"BalanceComprobacion!B302","v":"1.2.5.01.07.04.1.99999"},{"$f":"BalanceComprobacion!C302","v":"Monitores Valores de origen"},{"$f":"BalanceComprobacion!D302","v":8849612.7400000002},{"$f":"BalanceComprobacion!E302","v":616590},{"$f":"BalanceComprobacion!F302","v":0},{"$f":"BalanceComprobacion!G302","v":9466202.7400000002}]
[{"$f":"IFERROR(IF(B257<>0,Data!$B$2,\"\"),\"\")","v":"15603"},{"$f":"BalanceComprobacion!A303","v":3.1},{"$f":"BalanceComprobacion!B303","v":"1.2.5.01.07.04.3."},{"$f":"BalanceComprobacion!C303","v":"Monitores Depreciaciones acumuladas *"},{"$f":"BalanceComprobacion!D303","v":-6587265.5599999996},{"$f":"BalanceComprobacion!E303","v":367731.87},{"$f":"BalanceComprobacion!F303","v":690121.53},{"$f":"BalanceComprobacion!G303","v":-6909655.2199999997}]
[{"$f":"IFERROR(IF(B258<>0,Data!$B$2,\"\"),\"\")","v":"15603"},{"$f":"BalanceComprobacion!A304","v":3.1},{"$f":"BalanceComprobacion!B304","v":"1.2.5.01.07.04.3.99999"},{"$f":"BalanceComprobacion!C304","v":"Monitores Depreciaciones acumuladas *"},{"$f":"BalanceComprobacion!D304","v":-6587265.5599999996},{"$f":"BalanceComprobacion!E304","v":367731.87},{"$f":"BalanceComprobacion!F304","v":690121.53},{"$f":"BalanceComprobacion!G304","v":-6909655.2199999997}]
[{"$f":"IFERROR(IF(B259<>0,Data!$B$2,\"\"),\"\")","v":"15603"},{"$f":"BalanceComprobacion!A305","v":3.1},{"$f":"BalanceComprobacion!B305","v":"1.2.5.01.07.05."},{"$f":"BalanceComprobacion!C305","v":"UPS"},{"$f":"BalanceComprobacion!D305","v":161609.03},{"$f":"BalanceComprobacion!E305","v":63274},{"$f":"BalanceComprobacion!F305","v":31199.97},{"$f":"BalanceComprobacion!G305","v":193683.06}]
[{"$f":"IFERROR(IF(B260<>0,Data!$B$2,\"\"),\"\")","v":"15603"},{"$f":"BalanceComprobacion!A306","v":3.1},{"$f":"BalanceComprobacion!B306","v":"1.2.5.01.07.05.1."},{"$f":"BalanceComprobacion!C306","v":"UPS Valores de origen"},{"$f":"BalanceComprobacion!D306","v":1260960.6499999999},{"$f":"BalanceComprobacion!E306","v":63274},{"$f":"BalanceComprobacion!F306","v":0},{"$f":"BalanceComprobacion!G306","v":1324234.6499999999}]
[{"$f":"IFERROR(IF(B261<>0,Data!$B$2,\"\"),\"\")","v":"15603"},{"$f":"BalanceComprobacion!A307","v":3.1},{"$f":"BalanceComprobacion!B307","v":"1.2.5.01.07.05.1.99999"},{"$f":"BalanceComprobacion!C307","v":"UPS Valores de origen"},{"$f":"BalanceComprobacion!D307","v":1260960.6499999999},{"$f":"BalanceComprobacion!E307","v":63274},{"$f":"BalanceComprobacion!F307","v":0},{"$f":"BalanceComprobacion!G307","v":1324234.6499999999}]
[{"$f":"IFERROR(IF(B262<>0,Data!$B$2,\"\"),\"\")","v":"15603"},{"$f":"BalanceComprobacion!A308","v":3.1},{"$f":"BalanceComprobacion!B308","v":"1.2.5.01.07.05.3."},{"$f":"BalanceComprobacion!C308","v":"UPS Depreciaciones acumuladas *"},{"$f":"BalanceComprobacion!D308","v":-1099351.6200000001},{"$f":"BalanceComprobacion!E308","v":0},{"$f":"BalanceComprobacion!F308","v":31199.97},{"$f":"BalanceComprobacion!G308","v":-1130551.5900000001}]
[{"$f":"IFERROR(IF(B263<>0,Data!$B$2,\"\"),\"\")","v":"15603"},{"$f":"BalanceComprobacion!A309","v":3.1},{"$f":"BalanceComprobacion!B309","v":"1.2.5.01.07.05.3.99999"},{"$f":"BalanceComprobacion!C309","v":"UPS Depreciaciones acumuladas *"},{"$f":"BalanceComprobacion!D309","v":-1099351.6200000001},{"$f":"BalanceComprobacion!E309","v":0},{"$f":"BalanceComprobacion!F309","v":31199.97},{"$f":"BalanceComprobacion!G309","v":-1130551.5900000001}]
[{"$f":"IFERROR(IF(B264<>0,Data!$B$2,\"\"),\"\")","v":"15603"},{"$f":"BalanceComprobacion!A310","v":3.1},{"$f":"BalanceComprobacion!B310","v":"1.2.5.01.07.99."},{"$f":"BalanceComprobacion!C310","v":"Otros equipos de cómputo"},{"$f":"BalanceComprobacion!D310","v":3222127.63},{"$f":"BalanceComprobacion!E310","v":620075},{"$f":"BalanceComprobacion!F310","v":604059.64},{"$f":"BalanceComprobacion!G310","v":3238142.99}]
[{"$f":"IFERROR(IF(B265<>0,Data!$B$2,\"\"),\"\")","v":"15603"},{"$f":"BalanceComprobacion!A311","v":3.1},{"$f":"BalanceComprobacion!B311","v":"1.2.5.01.07.99.1."},{"$f":"BalanceComprobacion!C311","v":"Otros equipos de cómputo Valores de origen"},{"$f":"BalanceComprobacion!D311","v":8565461.8399999999},{"$f":"BalanceComprobacion!E311","v":620075},{"$f":"BalanceComprobacion!F311","v":0},{"$f":"BalanceComprobacion!G311","v":9185536.8399999999}]
[{"$f":"IFERROR(IF(B266<>0,Data!$B$2,\"\"),\"\")","v":"15603"},{"$f":"BalanceComprobacion!A312","v":3.1},{"$f":"BalanceComprobacion!B312","v":"1.2.5.01.07.99.1.99999"},{"$f":"BalanceComprobacion!C312","v":"Otros equipos de cómputo Valores de origen"},{"$f":"BalanceComprobacion!D312","v":8565461.8399999999},{"$f":"BalanceComprobacion!E312","v":620075},{"$f":"BalanceComprobacion!F312","v":0},{"$f":"BalanceComprobacion!G312","v":9185536.8399999999}]
[{"$f":"IFERROR(IF(B267<>0,Data!$B$2,\"\"),\"\")","v":"15603"},{"$f":"BalanceComprobacion!A313","v":3.1},{"$f":"BalanceComprobacion!B313","v":"1.2.5.01.07.99.3."},{"$f":"BalanceComprobacion!C313","v":"Otros equipos de cómputo Depreciaciones acumuladas *"},{"$f":"BalanceComprobacion!D313","v":-5343334.21},{"$f":"BalanceComprobacion!E313","v":0},{"$f":"BalanceComprobacion!F313","v":604059.64},{"$f":"BalanceComprobacion!G313","v":-5947393.8499999996}]
[{"$f":"IFERROR(IF(B268<>0,Data!$B$2,\"\"),\"\")","v":"15603"},{"$f":"BalanceComprobacion!A314","v":3.1},{"$f":"BalanceComprobacion!B314","v":"1.2.5.01.07.99.3.99999"},{"$f":"BalanceComprobacion!C314","v":"Otros equipos de cómputo Depreciaciones acumuladas *"},{"$f":"BalanceComprobacion!D314","v":-5343334.21},{"$f":"BalanceComprobacion!E314","v":0},{"$f":"BalanceComprobacion!F314","v":604059.64},{"$f":"BalanceComprobacion!G314","v":-5947393.8499999996}]
[{"$f":"IFERROR(IF(B269<>0,Data!$B$2,\"\"),\"\")","v":"15603"},{"$f":"BalanceComprobacion!A315","v":3.1},{"$f":"BalanceComprobacion!B315","v":"1.2.5.01.09."},{"$f":"BalanceComprobacion!C315","v":"Equipos y  mobiliario educacional deportivo  recreativo"},{"$f":"BalanceComprobacion!D315","v":0},{"$f":"BalanceComprobacion!E315","v":12633214.119999999},{"$f":"BalanceComprobacion!F315","v":631660.71},{"$f":"BalanceComprobacion!G315","v":12001553.41}]
[{"$f":"IFERROR(IF(B270<>0,Data!$B$2,\"\"),\"\")","v":"15603"},{"$f":"BalanceComprobacion!A316","v":3.1},{"$f":"BalanceComprobacion!B316","v":"1.2.5.01.09.05."},{"$f":"BalanceComprobacion!C316","v":"Equipos de entretenimiento"},{"$f":"BalanceComprobacion!D316","v":0},{"$f":"BalanceComprobacion!E316","v":12633214.119999999},{"$f":"BalanceComprobacion!F316","v":631660.71},{"$f":"BalanceComprobacion!G316","v":12001553.41}]
[{"$f":"IFERROR(IF(B271<>0,Data!$B$2,\"\"),\"\")","v":"15603"},{"$f":"BalanceComprobacion!A317","v":3.1},{"$f":"BalanceComprobacion!B317","v":"1.2.5.01.09.05.1."},{"$f":"BalanceComprobacion!C317","v":"Equipos de entretenimiento Valores de origen"},{"$f":"BalanceComprobacion!D317","v":0},{"$f":"BalanceComprobacion!E317","v":12633214.119999999},{"$f":"BalanceComprobacion!F317","v":0},{"$f":"BalanceComprobacion!G317","v":12633214.119999999}]
[{"$f":"IFERROR(IF(B272<>0,Data!$B$2,\"\"),\"\")","v":"15603"},{"$f":"BalanceComprobacion!A318","v":3.1},{"$f":"BalanceComprobacion!B318","v":"1.2.5.01.09.05.1.99999"},{"$f":"BalanceComprobacion!C318","v":"Equipos de entretenimiento Valores de origen"},{"$f":"BalanceComprobacion!D318","v":0},{"$f":"BalanceComprobacion!E318","v":12633214.119999999},{"$f":"BalanceComprobacion!F318","v":0},{"$f":"BalanceComprobacion!G318","v":12633214.119999999}]
[{"$f":"IFERROR(IF(B273<>0,Data!$B$2,\"\"),\"\")","v":"15603"},{"$f":"BalanceComprobacion!A319","v":3.1},{"$f":"BalanceComprobacion!B319","v":"1.2.5.01.09.05.3."},{"$f":"BalanceComprobacion!C319","v":"Equip de entretenimiento Depreciaciones acumuladas"},{"$f":"BalanceComprobacion!D319","v":0},{"$f":"BalanceComprobacion!E319","v":0},{"$f":"BalanceComprobacion!F319","v":631660.71},{"$f":"BalanceComprobacion!G319","v":-631660.71}]
[{"$f":"IFERROR(IF(B274<>0,Data!$B$2,\"\"),\"\")","v":"15603"},{"$f":"BalanceComprobacion!A320","v":3.1},{"$f":"BalanceComprobacion!B320","v":"1.2.5.01.09.05.3.99999"},{"$f":"BalanceComprobacion!C320","v":"Equip de entretenimiento Depreciaciones acumuladas"},{"$f":"BalanceComprobacion!D320","v":0},{"$f":"BalanceComprobacion!E320","v":0},{"$f":"BalanceComprobacion!F320","v":631660.71},{"$f":"BalanceComprobacion!G320","v":-631660.71}]
[{"$f":"IFERROR(IF(B275<>0,Data!$B$2,\"\"),\"\")","v":"15603"},{"$f":"BalanceComprobacion!A321","v":3.1},{"$f":"BalanceComprobacion!B321","v":"1.2.5.01.10."},{"$f":"BalanceComprobacion!C321","v":"Equipos de seguridad, orden, vigilancia y control público"},{"$f":"BalanceComprobacion!D321","v":1566953.8},{"$f":"BalanceComprobacion!E321","v":775296.88},{"$f":"BalanceComprobacion!F321","v":603054.81999999995},{"$f":"BalanceComprobacion!G321","v":1739195.86}]
[{"$f":"IFERROR(IF(B276<>0,Data!$B$2,\"\"),\"\")","v":"15603"},{"$f":"BalanceComprobacion!A322","v":3.1},{"$f":"BalanceComprobacion!B322","v":"1.2.5.01.10.01."},{"$f":"BalanceComprobacion!C322","v":"Equipos de protección contra incendios"},{"$f":"BalanceComprobacion!D322","v":1215568.82},{"$f":"BalanceComprobacion!E322","v":210000},{"$f":"BalanceComprobacion!F322","v":41017.57},{"$f":"BalanceComprobacion!G322","v":1384551.25}]
[{"$f":"IFERROR(IF(B277<>0,Data!$B$2,\"\"),\"\")","v":"15603"},{"$f":"BalanceComprobacion!A323","v":3.1},{"$f":"BalanceComprobacion!B323","v":"1.2.5.01.10.01.1."},{"$f":"BalanceComprobacion!C323","v":"Equipos de protección contra incendios Valores Origen"},{"$f":"BalanceComprobacion!D323","v":1350632},{"$f":"BalanceComprobacion!E323","v":210000},{"$f":"BalanceComprobacion!F323","v":0},{"$f":"BalanceComprobacion!G323","v":1560632}]
[{"$f":"IFERROR(IF(B278<>0,Data!$B$2,\"\"),\"\")","v":"15603"},{"$f":"BalanceComprobacion!A324","v":3.1},{"$f":"BalanceComprobacion!B324","v":"1.2.5.01.10.01.1.99999"},{"$f":"BalanceComprobacion!C324","v":"Equipos de protección contra incendios Valores Origen"},{"$f":"BalanceComprobacion!D324","v":1350632},{"$f":"BalanceComprobacion!E324","v":210000},{"$f":"BalanceComprobacion!F324","v":0},{"$f":"BalanceComprobacion!G324","v":1560632}]
[{"$f":"IFERROR(IF(B279<>0,Data!$B$2,\"\"),\"\")","v":"15603"},{"$f":"BalanceComprobacion!A325","v":3.1},{"$f":"BalanceComprobacion!B325","v":"1.2.5.01.10.01.3."},{"$f":"BalanceComprobacion!C325","v":"Equipos de protección contra incendios Depreciación Acumulada"},{"$f":"BalanceComprobacion!D325","v":-135063.18},{"$f":"BalanceComprobacion!E325","v":0},{"$f":"BalanceComprobacion!F325","v":41017.57},{"$f":"BalanceComprobacion!G325","v":-176080.75}]
[{"$f":"IFERROR(IF(B280<>0,Data!$B$2,\"\"),\"\")","v":"15603"},{"$f":"BalanceComprobacion!A326","v":3.1},{"$f":"BalanceComprobacion!B326","v":"1.2.5.01.10.01.3.99999"},{"$f":"BalanceComprobacion!C326","v":"Equipos de protección contra incendios Depreciación Acumulada"},{"$f":"BalanceComprobacion!D326","v":-135063.18},{"$f":"BalanceComprobacion!E326","v":0},{"$f":"BalanceComprobacion!F326","v":41017.57},{"$f":"BalanceComprobacion!G326","v":-176080.75}]
[{"$f":"IFERROR(IF(B281<>0,Data!$B$2,\"\"),\"\")","v":"15603"},{"$f":"BalanceComprobacion!A327","v":3.1},{"$f":"BalanceComprobacion!B327","v":"1.2.5.01.10.03."},{"$f":"BalanceComprobacion!C327","v":"Armas"},{"$f":"BalanceComprobacion!D327","v":21562.49},{"$f":"BalanceComprobacion!E327","v":0},{"$f":"BalanceComprobacion!F327","v":4687.5},{"$f":"BalanceComprobacion!G327","v":16874.990000000002}]
[{"$f":"IFERROR(IF(B282<>0,Data!$B$2,\"\"),\"\")","v":"15603"},{"$f":"BalanceComprobacion!A328","v":3.1},{"$f":"BalanceComprobacion!B328","v":"1.2.5.01.10.03.1."},{"$f":"BalanceComprobacion!C328","v":"Armas Valores de origen"},{"$f":"BalanceComprobacion!D328","v":225000},{"$f":"BalanceComprobacion!E328","v":0},{"$f":"BalanceComprobacion!F328","v":0},{"$f":"BalanceComprobacion!G328","v":225000}]
[{"$f":"IFERROR(IF(B283<>0,Data!$B$2,\"\"),\"\")","v":"15603"},{"$f":"BalanceComprobacion!A329","v":3.1},{"$f":"BalanceComprobacion!B329","v":"1.2.5.01.10.03.1.99999"},{"$f":"BalanceComprobacion!C329","v":"Armas Valores de origen"},{"$f":"BalanceComprobacion!D329","v":225000},{"$f":"BalanceComprobacion!E329","v":0},{"$f":"BalanceComprobacion!F329","v":0},{"$f":"BalanceComprobacion!G329","v":225000}]
[{"$f":"IFERROR(IF(B284<>0,Data!$B$2,\"\"),\"\")","v":"15603"},{"$f":"BalanceComprobacion!A330","v":3.1},{"$f":"BalanceComprobacion!B330","v":"1.2.5.01.10.03.3."},{"$f":"BalanceComprobacion!C330","v":"Armas Depreciaciones acumuladas *"},{"$f":"BalanceComprobacion!D330","v":-203437.51},{"$f":"BalanceComprobacion!E330","v":0},{"$f":"BalanceComprobacion!F330","v":4687.5},{"$f":"BalanceComprobacion!G330","v":-208125.01}]
[{"$f":"IFERROR(IF(B285<>0,Data!$B$2,\"\"),\"\")","v":"15603"},{"$f":"BalanceComprobacion!A331","v":3.1},{"$f":"BalanceComprobacion!B331","v":"1.2.5.01.10.03.3.99999"},{"$f":"BalanceComprobacion!C331","v":"Armas Depreciaciones acumuladas *"},{"$f":"BalanceComprobacion!D331","v":-203437.51},{"$f":"BalanceComprobacion!E331","v":0},{"$f":"BalanceComprobacion!F331","v":4687.5},{"$f":"BalanceComprobacion!G331","v":-208125.01}]
[{"$f":"IFERROR(IF(B286<>0,Data!$B$2,\"\"),\"\")","v":"15603"},{"$f":"BalanceComprobacion!A332","v":3.1},{"$f":"BalanceComprobacion!B332","v":"1.2.5.01.10.99."},{"$f":"BalanceComprobacion!C332","v":"Otros equipos de seguridad, orden, vigilancia y control público"},{"$f":"BalanceComprobacion!D332","v":329822.49},{"$f":"BalanceComprobacion!E332","v":565296.88},{"$f":"BalanceComprobacion!F332","v":557349.75},{"$f":"BalanceComprobacion!G332","v":337769.62}]
[{"$f":"IFERROR(IF(B287<>0,Data!$B$2,\"\"),\"\")","v":"15603"},{"$f":"BalanceComprobacion!A333","v":3.1},{"$f":"BalanceComprobacion!B333","v":"1.2.5.01.10.99.1."},{"$f":"BalanceComprobacion!C333","v":"Otros Equipos seguridad orden vigilancia control público Valor rigen"},{"$f":"BalanceComprobacion!D333","v":758241.92},{"$f":"BalanceComprobacion!E333","v":560625},{"$f":"BalanceComprobacion!F333","v":0},{"$f":"BalanceComprobacion!G333","v":1318866.92}]
[{"$f":"IFERROR(IF(B288<>0,Data!$B$2,\"\"),\"\")","v":"15603"},{"$f":"BalanceComprobacion!A334","v":3.1},{"$f":"BalanceComprobacion!B334","v":"1.2.5.01.10.99.1.99999"},{"$f":"BalanceComprobacion!C334","v":"Otros Equipos seguridad orden vigilancia control público Valor rigen"},{"$f":"BalanceComprobacion!D334","v":758241.92},{"$f":"BalanceComprobacion!E334","v":560625},{"$f":"BalanceComprobacion!F334","v":0},{"$f":"BalanceComprobacion!G334","v":1318866.92}]
[{"$f":"IFERROR(IF(B289<>0,Data!$B$2,\"\"),\"\")","v":"15603"},{"$f":"BalanceComprobacion!A335","v":3.1},{"$f":"BalanceComprobacion!B335","v":"1.2.5.01.10.99.3."},{"$f":"BalanceComprobacion!C335","v":"Otros Equipos seguridad orden vigilancia control Público Depreciacion Acumulada"},{"$f":"BalanceComprobacion!D335","v":-428419.43},{"$f":"BalanceComprobacion!E335","v":4671.88},{"$f":"BalanceComprobacion!F335","v":557349.75},{"$f":"BalanceComprobacion!G335","v":-981097.3}]
[{"$f":"IFERROR(IF(B290<>0,Data!$B$2,\"\"),\"\")","v":"15603"},{"$f":"BalanceComprobacion!A336","v":3.1},{"$f":"BalanceComprobacion!B336","v":"1.2.5.01.10.99.3.99999"},{"$f":"BalanceComprobacion!C336","v":"Otros Equipos seguridad orden vigilancia control Público Depreciacion Acumulada"},{"$f":"BalanceComprobacion!D336","v":-428419.43},{"$f":"BalanceComprobacion!E336","v":4671.88},{"$f":"BalanceComprobacion!F336","v":557349.75},{"$f":"BalanceComprobacion!G336","v":-981097.3}]
[{"$f":"IFERROR(IF(B291<>0,Data!$B$2,\"\"),\"\")","v":"15603"},{"$f":"BalanceComprobacion!A337","v":3.1},{"$f":"BalanceComprobacion!B337","v":"1.2.5.01.99."},{"$f":"BalanceComprobacion!C337","v":"Maquinarias, equipos  mobiliarios diversos"},{"$f":"BalanceComprobacion!D337","v":2421424.65},{"$f":"BalanceComprobacion!E337","v":0},{"$f":"BalanceComprobacion!F337","v":197357.81},{"$f":"BalanceComprobacion!G337","v":2224066.84}]
[{"$f":"IFERROR(IF(B292<>0,Data!$B$2,\"\"),\"\")","v":"15603"},{"$f":"BalanceComprobacion!A338","v":3.1},{"$f":"BalanceComprobacion!B338","v":"1.2.5.01.99.02."},{"$f":"BalanceComprobacion!C338","v":"Equipos  mobiliario doméstico"},{"$f":"BalanceComprobacion!D338","v":464154.19},{"$f":"BalanceComprobacion!E338","v":0},{"$f":"BalanceComprobacion!F338","v":54512.4},{"$f":"BalanceComprobacion!G338","v":409641.79}]
[{"$f":"IFERROR(IF(B293<>0,Data!$B$2,\"\"),\"\")","v":"15603"},{"$f":"BalanceComprobacion!A339","v":3.1},{"$f":"BalanceComprobacion!B339","v":"1.2.5.01.99.02.1."},{"$f":"BalanceComprobacion!C339","v":"Equipos y mobiliario doméstico Valores de origen"},{"$f":"BalanceComprobacion!D339","v":1551357.89},{"$f":"BalanceComprobacion!E339","v":0},{"$f":"BalanceComprobacion!F339","v":0},{"$f":"BalanceComprobacion!G339","v":1551357.89}]
[{"$f":"IFERROR(IF(B294<>0,Data!$B$2,\"\"),\"\")","v":"15603"},{"$f":"BalanceComprobacion!A340","v":3.1},{"$f":"BalanceComprobacion!B340","v":"1.2.5.01.99.02.1.99999"},{"$f":"BalanceComprobacion!C340","v":"Equipos y mobiliario doméstico Valores de origen"},{"$f":"BalanceComprobacion!D340","v":1551357.89},{"$f":"BalanceComprobacion!E340","v":0},{"$f":"BalanceComprobacion!F340","v":0},{"$f":"BalanceComprobacion!G340","v":1551357.89}]
[{"$f":"IFERROR(IF(B295<>0,Data!$B$2,\"\"),\"\")","v":"15603"},{"$f":"BalanceComprobacion!A341","v":3.1},{"$f":"BalanceComprobacion!B341","v":"1.2.5.01.99.02.3."},{"$f":"BalanceComprobacion!C341","v":"Equip y Mobiliario doméstico Depreciaciones acumuladas"},{"$f":"BalanceComprobacion!D341","v":-1087203.7},{"$f":"BalanceComprobacion!E341","v":0},{"$f":"BalanceComprobacion!F341","v":54512.4},{"$f":"BalanceComprobacion!G341","v":-1141716.1000000001}]
[{"$f":"IFERROR(IF(B296<>0,Data!$B$2,\"\"),\"\")","v":"15603"},{"$f":"BalanceComprobacion!A342","v":3.1},{"$f":"BalanceComprobacion!B342","v":"1.2.5.01.99.02.3.99999"},{"$f":"BalanceComprobacion!C342","v":"Equip y Mobiliario doméstico Depreciaciones acumuladas"},{"$f":"BalanceComprobacion!D342","v":-1087203.7},{"$f":"BalanceComprobacion!E342","v":0},{"$f":"BalanceComprobacion!F342","v":54512.4},{"$f":"BalanceComprobacion!G342","v":-1141716.1000000001}]
[{"$f":"IFERROR(IF(B297<>0,Data!$B$2,\"\"),\"\")","v":"15603"},{"$f":"BalanceComprobacion!A343","v":3.1},{"$f":"BalanceComprobacion!B343","v":"1.2.5.01.99.03."},{"$f":"BalanceComprobacion!C343","v":"Equipos fotográficos  de revelado"},{"$f":"BalanceComprobacion!D343","v":1957270.46},{"$f":"BalanceComprobacion!E343","v":0},{"$f":"BalanceComprobacion!F343","v":142845.41},{"$f":"BalanceComprobacion!G343","v":1814425.05}]
[{"$f":"IFERROR(IF(B298<>0,Data!$B$2,\"\"),\"\")","v":"15603"},{"$f":"BalanceComprobacion!A344","v":3.1},{"$f":"BalanceComprobacion!B344","v":"1.2.5.01.99.03.1."},{"$f":"BalanceComprobacion!C344","v":"Equipos fotográficos y de revelado Valores origen"},{"$f":"BalanceComprobacion!D344","v":3870352.18},{"$f":"BalanceComprobacion!E344","v":0},{"$f":"BalanceComprobacion!F344","v":0},{"$f":"BalanceComprobacion!G344","v":3870352.18}]
[{"$f":"IFERROR(IF(B299<>0,Data!$B$2,\"\"),\"\")","v":"15603"},{"$f":"BalanceComprobacion!A345","v":3.1},{"$f":"BalanceComprobacion!B345","v":"1.2.5.01.99.03.1.99999"},{"$f":"BalanceComprobacion!C345","v":"Equipos fotográficos y de revelado Valores origen"},{"$f":"BalanceComprobacion!D345","v":3870352.18},{"$f":"BalanceComprobacion!E345","v":0},{"$f":"BalanceComprobacion!F345","v":0},{"$f":"BalanceComprobacion!G345","v":3870352.18}]
[{"$f":"IFERROR(IF(B300<>0,Data!$B$2,\"\"),\"\")","v":"15603"},{"$f":"BalanceComprobacion!A346","v":3.1},{"$f":"BalanceComprobacion!B346","v":"1.2.5.01.99.03.3."},{"$f":"BalanceComprobacion!C346","v":"Equip fotográficos y revelado Depreciaioón Acumulada"},{"$f":"BalanceComprobacion!D346","v":-1913081.72},{"$f":"BalanceComprobacion!E346","v":0},{"$f":"BalanceComprobacion!F346","v":142845.41},{"$f":"BalanceComprobacion!G346","v":-2055927.13}]
[{"$f":"IFERROR(IF(B301<>0,Data!$B$2,\"\"),\"\")","v":"15603"},{"$f":"BalanceComprobacion!A347","v":3.1},{"$f":"BalanceComprobacion!B347","v":"1.2.5.01.99.03.3.99999"},{"$f":"BalanceComprobacion!C347","v":"Equip fotográficos y revelado Depreciaioón Acumulada"},{"$f":"BalanceComprobacion!D347","v":-1913081.72},{"$f":"BalanceComprobacion!E347","v":0},{"$f":"BalanceComprobacion!F347","v":142845.41},{"$f":"BalanceComprobacion!G347","v":-2055927.13}]
[{"$f":"IFERROR(IF(B302<>0,Data!$B$2,\"\"),\"\")","v":"15603"},{"$f":"BalanceComprobacion!A348","v":3.1},{"$f":"BalanceComprobacion!B348","v":"1.2.5.04."},{"$f":"BalanceComprobacion!C348","v":"Bienes de infraestructura y de beneficio y uso público en servicio"},{"$f":"BalanceComprobacion!D348","v":160765498081.76001},{"$f":"BalanceComprobacion!E348","v":0},{"$f":"BalanceComprobacion!F348","v":0},{"$f":"BalanceComprobacion!G348","v":160765498081.76001}]
[{"$f":"IFERROR(IF(B303<>0,Data!$B$2,\"\"),\"\")","v":"15603"},{"$f":"BalanceComprobacion!A349","v":3.1},{"$f":"BalanceComprobacion!B349","v":"1.2.5.04.01."},{"$f":"BalanceComprobacion!C349","v":"Vías de comunicación terrestre"},{"$f":"BalanceComprobacion!D349","v":156731927507.54001},{"$f":"BalanceComprobacion!E349","v":0},{"$f":"BalanceComprobacion!F349","v":0},{"$f":"BalanceComprobacion!G349","v":156731927507.54001}]
[{"$f":"IFERROR(IF(B304<>0,Data!$B$2,\"\"),\"\")","v":"15603"},{"$f":"BalanceComprobacion!A350","v":3.1},{"$f":"BalanceComprobacion!B350","v":"1.2.5.04.01.01."},{"$f":"BalanceComprobacion!C350","v":"Carreteras  caminos"},{"$f":"BalanceComprobacion!D350","v":143329792712.5},{"$f":"BalanceComprobacion!E350","v":0},{"$f":"BalanceComprobacion!F350","v":0},{"$f":"BalanceComprobacion!G350","v":143329792712.5}]
[{"$f":"IFERROR(IF(B305<>0,Data!$B$2,\"\"),\"\")","v":"15603"},{"$f":"BalanceComprobacion!A351","v":3.1},{"$f":"BalanceComprobacion!B351","v":"1.2.5.04.01.01.1."},{"$f":"BalanceComprobacion!C351","v":"Carreteras y caminos Valores de origen"},{"$f":"BalanceComprobacion!D351","v":22435224766.720001},{"$f":"BalanceComprobacion!E351","v":0},{"$f":"BalanceComprobacion!F351","v":0},{"$f":"BalanceComprobacion!G351","v":22435224766.720001}]
[{"$f":"IFERROR(IF(B306<>0,Data!$B$2,\"\"),\"\")","v":"15603"},{"$f":"BalanceComprobacion!A352","v":3.1},{"$f":"BalanceComprobacion!B352","v":"1.2.5.04.01.01.1.99999"},{"$f":"BalanceComprobacion!C352","v":"Carreteras y caminos Valores de origen"},{"$f":"BalanceComprobacion!D352","v":22435224766.720001},{"$f":"BalanceComprobacion!E352","v":0},{"$f":"BalanceComprobacion!F352","v":0},{"$f":"BalanceComprobacion!G352","v":22435224766.720001}]
[{"$f":"IFERROR(IF(B307<>0,Data!$B$2,\"\"),\"\")","v":"15603"},{"$f":"BalanceComprobacion!A353","v":3.1},{"$f":"BalanceComprobacion!B353","v":"1.2.5.04.01.01.6."},{"$f":"BalanceComprobacion!C353","v":"Carreteras y caminos Porción terreno: Valor Origen"},{"$f":"BalanceComprobacion!D353","v":120894567945.78},{"$f":"BalanceComprobacion!E353","v":0},{"$f":"BalanceComprobacion!F353","v":0},{"$f":"BalanceComprobacion!G353","v":120894567945.78}]
[{"$f":"IFERROR(IF(B308<>0,Data!$B$2,\"\"),\"\")","v":"15603"},{"$f":"BalanceComprobacion!A354","v":3.1},{"$f":"BalanceComprobacion!B354","v":"1.2.5.04.01.01.6.99999"},{"$f":"BalanceComprobacion!C354","v":"Carreteras y caminos Porción terreno: Valor Origen"},{"$f":"BalanceComprobacion!D354","v":120894567945.78},{"$f":"BalanceComprobacion!E354","v":0},{"$f":"BalanceComprobacion!F354","v":0},{"$f":"BalanceComprobacion!G354","v":120894567945.78}]
[{"$f":"IFERROR(IF(B309<>0,Data!$B$2,\"\"),\"\")","v":"15603"},{"$f":"BalanceComprobacion!A355","v":3.1},{"$f":"BalanceComprobacion!B355","v":"1.2.5.04.01.03."},{"$f":"BalanceComprobacion!C355","v":"Puentes"},{"$f":"BalanceComprobacion!D355","v":13385469370.68},{"$f":"BalanceComprobacion!E355","v":0},{"$f":"BalanceComprobacion!F355","v":0},{"$f":"BalanceComprobacion!G355","v":13385469370.68}]
[{"$f":"IFERROR(IF(B310<>0,Data!$B$2,\"\"),\"\")","v":"15603"},{"$f":"BalanceComprobacion!A356","v":3.1},{"$f":"BalanceComprobacion!B356","v":"1.2.5.04.01.03.1."},{"$f":"BalanceComprobacion!C356","v":"Puentes Valores de origen"},{"$f":"BalanceComprobacion!D356","v":7882316153.8999996},{"$f":"BalanceComprobacion!E356","v":0},{"$f":"BalanceComprobacion!F356","v":0},{"$f":"BalanceComprobacion!G356","v":7882316153.8999996}]
[{"$f":"IFERROR(IF(B311<>0,Data!$B$2,\"\"),\"\")","v":"15603"},{"$f":"BalanceComprobacion!A357","v":3.1},{"$f":"BalanceComprobacion!B357","v":"1.2.5.04.01.03.1.99999"},{"$f":"BalanceComprobacion!C357","v":"Puentes Valores de origen"},{"$f":"BalanceComprobacion!D357","v":7882316153.8999996},{"$f":"BalanceComprobacion!E357","v":0},{"$f":"BalanceComprobacion!F357","v":0},{"$f":"BalanceComprobacion!G357","v":7882316153.8999996}]
[{"$f":"IFERROR(IF(B312<>0,Data!$B$2,\"\"),\"\")","v":"15603"},{"$f":"BalanceComprobacion!A358","v":3.1},{"$f":"BalanceComprobacion!B358","v":"1.2.5.04.01.03.6."},{"$f":"BalanceComprobacion!C358","v":"Puentes Porción terreno: valores de origen"},{"$f":"BalanceComprobacion!D358","v":5503153216.7799997},{"$f":"BalanceComprobacion!E358","v":0},{"$f":"BalanceComprobacion!F358","v":0},{"$f":"BalanceComprobacion!G358","v":5503153216.7799997}]
[{"$f":"IFERROR(IF(B313<>0,Data!$B$2,\"\"),\"\")","v":"15603"},{"$f":"BalanceComprobacion!A359","v":3.1},{"$f":"BalanceComprobacion!B359","v":"1.2.5.04.01.03.6.99999"},{"$f":"BalanceComprobacion!C359","v":"Puentes Porción terreno: valores de origen"},{"$f":"BalanceComprobacion!D359","v":5503153216.7799997},{"$f":"BalanceComprobacion!E359","v":0},{"$f":"BalanceComprobacion!F359","v":0},{"$f":"BalanceComprobacion!G359","v":5503153216.7799997}]
[{"$f":"IFERROR(IF(B314<>0,Data!$B$2,\"\"),\"\")","v":"15603"},{"$f":"BalanceComprobacion!A360","v":3.1},{"$f":"BalanceComprobacion!B360","v":"1.2.5.04.01.99."},{"$f":"BalanceComprobacion!C360","v":"Otras vías de comunicación terrestre"},{"$f":"BalanceComprobacion!D360","v":16665424.359999999},{"$f":"BalanceComprobacion!E360","v":0},{"$f":"BalanceComprobacion!F360","v":0},{"$f":"BalanceComprobacion!G360","v":16665424.359999999}]
[{"$f":"IFERROR(IF(B315<>0,Data!$B$2,\"\"),\"\")","v":"15603"},{"$f":"BalanceComprobacion!A361","v":3.1},{"$f":"BalanceComprobacion!B361","v":"1.2.5.04.01.99.1."},{"$f":"BalanceComprobacion!C361","v":"Otras vías de comunicación terrestre  Valores Origen"},{"$f":"BalanceComprobacion!D361","v":16665424.359999999},{"$f":"BalanceComprobacion!E361","v":0},{"$f":"BalanceComprobacion!F361","v":0},{"$f":"BalanceComprobacion!G361","v":16665424.359999999}]
[{"$f":"IFERROR(IF(B316<>0,Data!$B$2,\"\"),\"\")","v":"15603"},{"$f":"BalanceComprobacion!A362","v":3.1},{"$f":"BalanceComprobacion!B362","v":"1.2.5.04.01.99.1.99999"},{"$f":"BalanceComprobacion!C362","v":"Otras vías de comunicación terrestre  Valores Origen"},{"$f":"BalanceComprobacion!D362","v":16665424.359999999},{"$f":"BalanceComprobacion!E362","v":0},{"$f":"BalanceComprobacion!F362","v":0},{"$f":"BalanceComprobacion!G362","v":16665424.359999999}]
[{"$f":"IFERROR(IF(B317<>0,Data!$B$2,\"\"),\"\")","v":"15603"},{"$f":"BalanceComprobacion!A363","v":3.1},{"$f":"BalanceComprobacion!B363","v":"1.2.5.04.03."},{"$f":"BalanceComprobacion!C363","v":"Centrales  redes de comunicación  energía"},{"$f":"BalanceComprobacion!D363","v":4013723664.2199998},{"$f":"BalanceComprobacion!E363","v":0},{"$f":"BalanceComprobacion!F363","v":0},{"$f":"BalanceComprobacion!G363","v":4013723664.2199998}]
[{"$f":"IFERROR(IF(B318<>0,Data!$B$2,\"\"),\"\")","v":"15603"},{"$f":"BalanceComprobacion!A364","v":3.1},{"$f":"BalanceComprobacion!B364","v":"1.2.5.04.03.01."},{"$f":"BalanceComprobacion!C364","v":"Centrales  redes acuíferas, cloacales  pluviales"},{"$f":"BalanceComprobacion!D364","v":4013723664.2199998},{"$f":"BalanceComprobacion!E364","v":0},{"$f":"BalanceComprobacion!F364","v":0},{"$f":"BalanceComprobacion!G364","v":4013723664.2199998}]
[{"$f":"IFERROR(IF(B319<>0,Data!$B$2,\"\"),\"\")","v":"15603"},{"$f":"BalanceComprobacion!A365","v":3.1},{"$f":"BalanceComprobacion!B365","v":"1.2.5.04.03.01.1."},{"$f":"BalanceComprobacion!C365","v":"Centrales  redes acuíferas, cloacales  pluviales Valor Origen"},{"$f":"BalanceComprobacion!D365","v":4013723664.2199998},{"$f":"BalanceComprobacion!E365","v":0},{"$f":"BalanceComprobacion!F365","v":0},{"$f":"BalanceComprobacion!G365","v":4013723664.2199998}]
[{"$f":"IFERROR(IF(B320<>0,Data!$B$2,\"\"),\"\")","v":"15603"},{"$f":"BalanceComprobacion!A366","v":3.1},{"$f":"BalanceComprobacion!B366","v":"1.2.5.04.03.01.1.99999"},{"$f":"BalanceComprobacion!C366","v":"Centrales  redes acuíferas, cloacales  pluviales Valor Origen"},{"$f":"BalanceComprobacion!D366","v":4013723664.2199998},{"$f":"BalanceComprobacion!E366","v":0},{"$f":"BalanceComprobacion!F366","v":0},{"$f":"BalanceComprobacion!G366","v":4013723664.2199998}]
[{"$f":"IFERROR(IF(B321<>0,Data!$B$2,\"\"),\"\")","v":"15603"},{"$f":"BalanceComprobacion!A367","v":3.1},{"$f":"BalanceComprobacion!B367","v":"1.2.5.04.99."},{"$f":"BalanceComprobacion!C367","v":"Otros bienes de infraestructura y de beneficio y uso público en servicio"},{"$f":"BalanceComprobacion!D367","v":19846910},{"$f":"BalanceComprobacion!E367","v":0},{"$f":"BalanceComprobacion!F367","v":0},{"$f":"BalanceComprobacion!G367","v":19846910}]
[{"$f":"IFERROR(IF(B322<>0,Data!$B$2,\"\"),\"\")","v":"15603"},{"$f":"BalanceComprobacion!A368","v":3.1},{"$f":"BalanceComprobacion!B368","v":"1.2.5.04.99.99."},{"$f":"BalanceComprobacion!C368","v":"Otros bienes de infraestructura y de beneficio y uso público diversos"},{"$f":"BalanceComprobacion!D368","v":19846910},{"$f":"BalanceComprobacion!E368","v":0},{"$f":"BalanceComprobacion!F368","v":0},{"$f":"BalanceComprobacion!G368","v":19846910}]
[{"$f":"IFERROR(IF(B323<>0,Data!$B$2,\"\"),\"\")","v":"15603"},{"$f":"BalanceComprobacion!A369","v":3.1},{"$f":"BalanceComprobacion!B369","v":"1.2.5.04.99.99.1."},{"$f":"BalanceComprobacion!C369","v":"Otros bienes de infraestructura y de beneficio y uso público diversos Valores de origen"},{"$f":"BalanceComprobacion!D369","v":19846910},{"$f":"BalanceComprobacion!E369","v":0},{"$f":"BalanceComprobacion!F369","v":0},{"$f":"BalanceComprobacion!G369","v":19846910}]
[{"$f":"IFERROR(IF(B324<>0,Data!$B$2,\"\"),\"\")","v":"15603"},{"$f":"BalanceComprobacion!A370","v":3.1},{"$f":"BalanceComprobacion!B370","v":"1.2.5.04.99.99.1.99999"},{"$f":"BalanceComprobacion!C370","v":"Otros bienes de infraestructura y de beneficio y uso público diversos Valores de origen"},{"$f":"BalanceComprobacion!D370","v":19846910},{"$f":"BalanceComprobacion!E370","v":0},{"$f":"BalanceComprobacion!F370","v":0},{"$f":"BalanceComprobacion!G370","v":19846910}]
[{"$f":"IFERROR(IF(B325<>0,Data!$B$2,\"\"),\"\")","v":"15603"},{"$f":"BalanceComprobacion!A371","v":3.1},{"$f":"BalanceComprobacion!B371","v":"1.2.5.08."},{"$f":"BalanceComprobacion!C371","v":"Bienes intangibles no concesionados"},{"$f":"BalanceComprobacion!D371","v":12565235.460000001},{"$f":"BalanceComprobacion!E371","v":1527054.85},{"$f":"BalanceComprobacion!F371","v":10617518.560000001},{"$f":"BalanceComprobacion!G371","v":3474771.75}]
[{"$f":"IFERROR(IF(B326<>0,Data!$B$2,\"\"),\"\")","v":"15603"},{"$f":"BalanceComprobacion!A372","v":3.1},{"$f":"BalanceComprobacion!B372","v":"1.2.5.08.03."},{"$f":"BalanceComprobacion!C372","v":"Software  programas"},{"$f":"BalanceComprobacion!D372","v":12565235.460000001},{"$f":"BalanceComprobacion!E372","v":997294.85},{"$f":"BalanceComprobacion!F372","v":10087758.560000001},{"$f":"BalanceComprobacion!G372","v":3474771.75}]
[{"$f":"IFERROR(IF(B327<>0,Data!$B$2,\"\"),\"\")","v":"15603"},{"$f":"BalanceComprobacion!A373","v":3.1},{"$f":"BalanceComprobacion!B373","v":"1.2.5.08.03.01."},{"$f":"BalanceComprobacion!C373","v":"Software y programas Valores de origen"},{"$f":"BalanceComprobacion!D373","v":12565235.460000001},{"$f":"BalanceComprobacion!E373","v":997294.85},{"$f":"BalanceComprobacion!F373","v":10087758.560000001},{"$f":"BalanceComprobacion!G373","v":3474771.75}]
[{"$f":"IFERROR(IF(B328<>0,Data!$B$2,\"\"),\"\")","v":"15603"},{"$f":"BalanceComprobacion!A374","v":3.1},{"$f":"BalanceComprobacion!B374","v":"1.2.5.08.03.01.0."},{"$f":"BalanceComprobacion!C374","v":"Software y programas Valores de origen"},{"$f":"BalanceComprobacion!D374","v":12565235.460000001},{"$f":"BalanceComprobacion!E374","v":997294.85},{"$f":"BalanceComprobacion!F374","v":10087758.560000001},{"$f":"BalanceComprobacion!G374","v":3474771.75}]
[{"$f":"IFERROR(IF(B329<>0,Data!$B$2,\"\"),\"\")","v":"15603"},{"$f":"BalanceComprobacion!A375","v":3.1},{"$f":"BalanceComprobacion!B375","v":"1.2.5.08.03.01.0.99999"},{"$f":"BalanceComprobacion!C375","v":"Software y programas Valores de origen"},{"$f":"BalanceComprobacion!D375","v":12565235.460000001},{"$f":"BalanceComprobacion!E375","v":997294.85},{"$f":"BalanceComprobacion!F375","v":10087758.560000001},{"$f":"BalanceComprobacion!G375","v":3474771.75}]
[{"$f":"IFERROR(IF(B330<>0,Data!$B$2,\"\"),\"\")","v":"15603"},{"$f":"BalanceComprobacion!A376","v":3.1},{"$f":"BalanceComprobacion!B376","v":"1.2.5.08.99."},{"$f":"BalanceComprobacion!C376","v":"Otros bienes intangibles"},{"$f":"BalanceComprobacion!D376","v":0},{"$f":"BalanceComprobacion!E376","v":529760},{"$f":"BalanceComprobacion!F376","v":529760},{"$f":"BalanceComprobacion!G376","v":0}]
[{"$f":"IFERROR(IF(B331<>0,Data!$B$2,\"\"),\"\")","v":"15603"},{"$f":"BalanceComprobacion!A377","v":3.1},{"$f":"BalanceComprobacion!B377","v":"1.2.5.08.99.01."},{"$f":"BalanceComprobacion!C377","v":"Otros bienes intangibles Valores de origen"},{"$f":"BalanceComprobacion!D377","v":0},{"$f":"BalanceComprobacion!E377","v":529760},{"$f":"BalanceComprobacion!F377","v":529760},{"$f":"BalanceComprobacion!G377","v":0}]
[{"$f":"IFERROR(IF(B332<>0,Data!$B$2,\"\"),\"\")","v":"15603"},{"$f":"BalanceComprobacion!A378","v":3.1},{"$f":"BalanceComprobacion!B378","v":"1.2.5.08.99.01.0."},{"$f":"BalanceComprobacion!C378","v":"Otros bienes intangibles Valores de origen"},{"$f":"BalanceComprobacion!D378","v":0},{"$f":"BalanceComprobacion!E378","v":529760},{"$f":"BalanceComprobacion!F378","v":529760},{"$f":"BalanceComprobacion!G378","v":0}]
[{"$f":"IFERROR(IF(B333<>0,Data!$B$2,\"\"),\"\")","v":"15603"},{"$f":"BalanceComprobacion!A379","v":3.1},{"$f":"BalanceComprobacion!B379","v":"1.2.5.08.99.01.0.99999"},{"$f":"BalanceComprobacion!C379","v":"Otros bienes intangibles Valores de origen"},{"$f":"BalanceComprobacion!D379","v":0},{"$f":"BalanceComprobacion!E379","v":529760},{"$f":"BalanceComprobacion!F379","v":529760},{"$f":"BalanceComprobacion!G379","v":0}]
[{"$f":"IFERROR(IF(B334<>0,Data!$B$2,\"\"),\"\")","v":"15603"},{"$f":"BalanceComprobacion!A380","v":3.1},{"$f":"BalanceComprobacion!B380","v":"1.2.5.99."},{"$f":"BalanceComprobacion!C380","v":"Bienes no concesionados en proceso de producción"},{"$f":"BalanceComprobacion!D380","v":77580961.049999997},{"$f":"BalanceComprobacion!E380","v":0},{"$f":"BalanceComprobacion!F380","v":0},{"$f":"BalanceComprobacion!G380","v":77580961.049999997}]
[{"$f":"IFERROR(IF(B335<>0,Data!$B$2,\"\"),\"\")","v":"15603"},{"$f":"BalanceComprobacion!A381","v":3.1},{"$f":"BalanceComprobacion!B381","v":"1.2.5.99.08."},{"$f":"BalanceComprobacion!C381","v":"Bienes intangibles en proceso de producción"},{"$f":"BalanceComprobacion!D381","v":77580961.049999997},{"$f":"BalanceComprobacion!E381","v":0},{"$f":"BalanceComprobacion!F381","v":0},{"$f":"BalanceComprobacion!G381","v":77580961.049999997}]
[{"$f":"IFERROR(IF(B336<>0,Data!$B$2,\"\"),\"\")","v":"15603"},{"$f":"BalanceComprobacion!A382","v":3.1},{"$f":"BalanceComprobacion!B382","v":"1.2.5.99.08.03."},{"$f":"BalanceComprobacion!C382","v":"Producción en proceso de software y programas"},{"$f":"BalanceComprobacion!D382","v":77580961.049999997},{"$f":"BalanceComprobacion!E382","v":0},{"$f":"BalanceComprobacion!F382","v":0},{"$f":"BalanceComprobacion!G382","v":77580961.049999997}]
[{"$f":"IFERROR(IF(B337<>0,Data!$B$2,\"\"),\"\")","v":"15603"},{"$f":"BalanceComprobacion!A383","v":3.1},{"$f":"BalanceComprobacion!B383","v":"1.2.5.99.08.03.0."},{"$f":"BalanceComprobacion!C383","v":"Producción en proceso de software y programas"},{"$f":"BalanceComprobacion!D383","v":77580961.049999997},{"$f":"BalanceComprobacion!E383","v":0},{"$f":"BalanceComprobacion!F383","v":0},{"$f":"BalanceComprobacion!G383","v":77580961.049999997}]
[{"$f":"IFERROR(IF(B338<>0,Data!$B$2,\"\"),\"\")","v":"15603"},{"$f":"BalanceComprobacion!A384","v":3.1},{"$f":"BalanceComprobacion!B384","v":"1.2.5.99.08.03.0.99999"},{"$f":"BalanceComprobacion!C384","v":"Producción en proceso de software y programas"},{"$f":"BalanceComprobacion!D384","v":77580961.049999997},{"$f":"BalanceComprobacion!E384","v":0},{"$f":"BalanceComprobacion!F384","v":0},{"$f":"BalanceComprobacion!G384","v":77580961.049999997}]
[{"$f":"IFERROR(IF(B339<>0,Data!$B$2,\"\"),\"\")","v":"15603"},{"$f":"BalanceComprobacion!A385","v":3.1},{"$f":"BalanceComprobacion!B385","v":"2."},{"$f":"BalanceComprobacion!C385","v":"PASIVO"},{"$f":"BalanceComprobacion!D385","v":1698526087.6199999},{"$f":"BalanceComprobacion!E385","v":3012373214},{"$f":"BalanceComprobacion!F385","v":3204364062.1599998},{"$f":"BalanceComprobacion!G385","v":1890516935.78}]
[{"$f":"IFERROR(IF(B340<>0,Data!$B$2,\"\"),\"\")","v":"15603"},{"$f":"BalanceComprobacion!A386","v":3.1},{"$f":"BalanceComprobacion!B386","v":"2.1."},{"$f":"BalanceComprobacion!C386","v":"Pasivo Corriente"},{"$f":"BalanceComprobacion!D386","v":152486979.41},{"$f":"BalanceComprobacion!E386","v":2224451202.9200001},{"$f":"BalanceComprobacion!F386","v":2888451010.0999999},{"$f":"BalanceComprobacion!G386","v":816486786.59000003}]
[{"$f":"IFERROR(IF(B341<>0,Data!$B$2,\"\"),\"\")","v":"15603"},{"$f":"BalanceComprobacion!A387","v":3.1},{"$f":"BalanceComprobacion!B387","v":"2.1.1."},{"$f":"BalanceComprobacion!C387","v":"Deudas a corto plazo"},{"$f":"BalanceComprobacion!D387","v":86261732.549999997},{"$f":"BalanceComprobacion!E387","v":2011663149.4200001},{"$f":"BalanceComprobacion!F387","v":2198367204.1900001},{"$f":"BalanceComprobacion!G387","v":272965787.31999999}]
[{"$f":"IFERROR(IF(B342<>0,Data!$B$2,\"\"),\"\")","v":"15603"},{"$f":"BalanceComprobacion!A388","v":3.1},{"$f":"BalanceComprobacion!B388","v":"2.1.1.01."},{"$f":"BalanceComprobacion!C388","v":"Deudas comerciales a corto plazo"},{"$f":"BalanceComprobacion!D388","v":1108985.7},{"$f":"BalanceComprobacion!E388","v":1258761223.6099999},{"$f":"BalanceComprobacion!F388","v":1428856468.51},{"$f":"BalanceComprobacion!G388","v":171204230.59999999}]
[{"$f":"IFERROR(IF(B343<>0,Data!$B$2,\"\"),\"\")","v":"15603"},{"$f":"BalanceComprobacion!A389","v":3.1},{"$f":"BalanceComprobacion!B389","v":"2.1.1.01.01."},{"$f":"BalanceComprobacion!C389","v":"Deudas por adquisición de inventarios c/p"},{"$f":"BalanceComprobacion!D389","v":1108985.7},{"$f":"BalanceComprobacion!E389","v":280004903.17000002},{"$f":"BalanceComprobacion!F389","v":298265729.67000002},{"$f":"BalanceComprobacion!G389","v":19369812.199999999}]
[{"$f":"IFERROR(IF(B344<>0,Data!$B$2,\"\"),\"\")","v":"15603"},{"$f":"BalanceComprobacion!A390","v":3.1},{"$f":"BalanceComprobacion!B390","v":"2.1.1.01.01.01."},{"$f":"BalanceComprobacion!C390","v":"Deudas comerciales por adquisición de materiales y suministros para consumo y prestación de servicios c/p"},{"$f":"BalanceComprobacion!D390","v":1108985.7},{"$f":"BalanceComprobacion!E390","v":230004903.16999999},{"$f":"BalanceComprobacion!F390","v":248265729.66999999},{"$f":"BalanceComprobacion!G390","v":19369812.199999999}]
[{"$f":"IFERROR(IF(B345<>0,Data!$B$2,\"\"),\"\")","v":"15603"},{"$f":"BalanceComprobacion!A391","v":3.1},{"$f":"BalanceComprobacion!B391","v":"2.1.1.01.01.01.0."},{"$f":"BalanceComprobacion!C391","v":"Deudas comerciales por adquisición de materiales y suministros para consumo y prestación de servicios c/p"},{"$f":"BalanceComprobacion!D391","v":1108985.7},{"$f":"BalanceComprobacion!E391","v":230004903.16999999},{"$f":"BalanceComprobacion!F391","v":248265729.66999999},{"$f":"BalanceComprobacion!G391","v":19369812.199999999}]
[{"$f":"IFERROR(IF(B346<>0,Data!$B$2,\"\"),\"\")","v":"15603"},{"$f":"BalanceComprobacion!A392","v":3.1},{"$f":"BalanceComprobacion!B392","v":"2.1.1.01.01.01.0.99999"},{"$f":"BalanceComprobacion!C392","v":"Deudas comerciales por adquisición de materiales y suministros para consumo y prestación de servicios c/p"},{"$f":"BalanceComprobacion!D392","v":1108985.7},{"$f":"BalanceComprobacion!E392","v":230004903.16999999},{"$f":"BalanceComprobacion!F392","v":248265729.66999999},{"$f":"BalanceComprobacion!G392","v":19369812.199999999}]
[{"$f":"IFERROR(IF(B347<>0,Data!$B$2,\"\"),\"\")","v":"15603"},{"$f":"BalanceComprobacion!A393","v":3.1},{"$f":"BalanceComprobacion!B393","v":"2.1.1.01.01.02."},{"$f":"BalanceComprobacion!C393","v":"Deudas comerciales por adquisición de bienes para la venta c/p"},{"$f":"BalanceComprobacion!D393","v":0},{"$f":"BalanceComprobacion!E393","v":50000000},{"$f":"BalanceComprobacion!F393","v":50000000},{"$f":"BalanceComprobacion!G393","v":0}]
[{"$f":"IFERROR(IF(B348<>0,Data!$B$2,\"\"),\"\")","v":"15603"},{"$f":"BalanceComprobacion!A394","v":3.1},{"$f":"BalanceComprobacion!B394","v":"2.1.1.01.01.02.0."},{"$f":"BalanceComprobacion!C394","v":"Deudas comerciales por adquisición de bienes para la venta c/p"},{"$f":"BalanceComprobacion!D394","v":0},{"$f":"BalanceComprobacion!E394","v":50000000},{"$f":"BalanceComprobacion!F394","v":50000000},{"$f":"BalanceComprobacion!G394","v":0}]
[{"$f":"IFERROR(IF(B349<>0,Data!$B$2,\"\"),\"\")","v":"15603"},{"$f":"BalanceComprobacion!A395","v":3.1},{"$f":"BalanceComprobacion!B395","v":"2.1.1.01.01.02.0.99999"},{"$f":"BalanceComprobacion!C395","v":"Deudas comerciales por adquisición de bienes para la venta c/p"},{"$f":"BalanceComprobacion!D395","v":0},{"$f":"BalanceComprobacion!E395","v":50000000},{"$f":"BalanceComprobacion!F395","v":50000000},{"$f":"BalanceComprobacion!G395","v":0}]
[{"$f":"IFERROR(IF(B350<>0,Data!$B$2,\"\"),\"\")","v":"15603"},{"$f":"BalanceComprobacion!A396","v":3.1},{"$f":"BalanceComprobacion!B396","v":"2.1.1.01.02."},{"$f":"BalanceComprobacion!C396","v":"Deudas por adquisición de bienes distintos de inventarios c/p"},{"$f":"BalanceComprobacion!D396","v":0},{"$f":"BalanceComprobacion!E396","v":731351227.08000004},{"$f":"BalanceComprobacion!F396","v":877163902.58000004},{"$f":"BalanceComprobacion!G396","v":145812675.5}]
[{"$f":"IFERROR(IF(B351<>0,Data!$B$2,\"\"),\"\")","v":"15603"},{"$f":"BalanceComprobacion!A397","v":3.1},{"$f":"BalanceComprobacion!B397","v":"2.1.1.01.02.01."},{"$f":"BalanceComprobacion!C397","v":"Deudas comerciales por adquisición de propiedades, planta y equipos en explotación c/p"},{"$f":"BalanceComprobacion!D397","v":0},{"$f":"BalanceComprobacion!E397","v":27830783.120000001},{"$f":"BalanceComprobacion!F397","v":27830783.120000001},{"$f":"BalanceComprobacion!G397","v":0}]
[{"$f":"IFERROR(IF(B352<>0,Data!$B$2,\"\"),\"\")","v":"15603"},{"$f":"BalanceComprobacion!A398","v":3.1},{"$f":"BalanceComprobacion!B398","v":"2.1.1.01.02.01.0."},{"$f":"BalanceComprobacion!C398","v":"Deudas comerciales por adquisición de propiedades, planta y equipos en explotación c/p"},{"$f":"BalanceComprobacion!D398","v":0},{"$f":"BalanceComprobacion!E398","v":27830783.120000001},{"$f":"BalanceComprobacion!F398","v":27830783.120000001},{"$f":"BalanceComprobacion!G398","v":0}]
[{"$f":"IFERROR(IF(B353<>0,Data!$B$2,\"\"),\"\")","v":"15603"},{"$f":"BalanceComprobacion!A399","v":3.1},{"$f":"BalanceComprobacion!B399","v":"2.1.1.01.02.01.0.99999"},{"$f":"BalanceComprobacion!C399","v":"Deudas comerciales por adquisición de propiedades, planta y equipos en explotación c/p"},{"$f":"BalanceComprobacion!D399","v":0},{"$f":"BalanceComprobacion!E399","v":27830783.120000001},{"$f":"BalanceComprobacion!F399","v":27830783.120000001},{"$f":"BalanceComprobacion!G399","v":0}]
[{"$f":"IFERROR(IF(B354<>0,Data!$B$2,\"\"),\"\")","v":"15603"},{"$f":"BalanceComprobacion!A400","v":3.1},{"$f":"BalanceComprobacion!B400","v":"2.1.1.01.02.04."},{"$f":"BalanceComprobacion!C400","v":"Deudas comerciales por adquisición de bienes de infraestructura y de beneficio y uso público c/p"},{"$f":"BalanceComprobacion!D400","v":0},{"$f":"BalanceComprobacion!E400","v":701302486.13},{"$f":"BalanceComprobacion!F400","v":847115161.63},{"$f":"BalanceComprobacion!G400","v":145812675.5}]
[{"$f":"IFERROR(IF(B355<>0,Data!$B$2,\"\"),\"\")","v":"15603"},{"$f":"BalanceComprobacion!A401","v":3.1},{"$f":"BalanceComprobacion!B401","v":"2.1.1.01.02.04.0."},{"$f":"BalanceComprobacion!C401","v":"Deudas comerciales por adquisición de bienes de infraestructura y de beneficio y uso público c/p"},{"$f":"BalanceComprobacion!D401","v":0},{"$f":"BalanceComprobacion!E401","v":701302486.13},{"$f":"BalanceComprobacion!F401","v":847115161.63},{"$f":"BalanceComprobacion!G401","v":145812675.5}]
[{"$f":"IFERROR(IF(B356<>0,Data!$B$2,\"\"),\"\")","v":"15603"},{"$f":"BalanceComprobacion!A402","v":3.1},{"$f":"BalanceComprobacion!B402","v":"2.1.1.01.02.04.0.99999"},{"$f":"BalanceComprobacion!C402","v":"Deudas comerciales por adquisición de bienes de infraestructura y de beneficio y uso público c/p"},{"$f":"BalanceComprobacion!D402","v":0},{"$f":"BalanceComprobacion!E402","v":701302486.13},{"$f":"BalanceComprobacion!F402","v":847115161.63},{"$f":"BalanceComprobacion!G402","v":145812675.5}]
[{"$f":"IFERROR(IF(B357<>0,Data!$B$2,\"\"),\"\")","v":"15603"},{"$f":"BalanceComprobacion!A403","v":3.1},{"$f":"BalanceComprobacion!B403","v":"2.1.1.01.02.08."},{"$f":"BalanceComprobacion!C403","v":"Deudas comerciales por adquisición de bienes intangibles c/p"},{"$f":"BalanceComprobacion!D403","v":0},{"$f":"BalanceComprobacion!E403","v":2217957.83},{"$f":"BalanceComprobacion!F403","v":2217957.83},{"$f":"BalanceComprobacion!G403","v":0}]
[{"$f":"IFERROR(IF(B358<>0,Data!$B$2,\"\"),\"\")","v":"15603"},{"$f":"BalanceComprobacion!A404","v":3.1},{"$f":"BalanceComprobacion!B404","v":"2.1.1.01.02.08.0."},{"$f":"BalanceComprobacion!C404","v":"Deudas comerciales por adquisición de bienes intangibles c/p"},{"$f":"BalanceComprobacion!D404","v":0},{"$f":"BalanceComprobacion!E404","v":2217957.83},{"$f":"BalanceComprobacion!F404","v":2217957.83},{"$f":"BalanceComprobacion!G404","v":0}]
[{"$f":"IFERROR(IF(B359<>0,Data!$B$2,\"\"),\"\")","v":"15603"},{"$f":"BalanceComprobacion!A405","v":3.1},{"$f":"BalanceComprobacion!B405","v":"2.1.1.01.02.08.0.99999"},{"$f":"BalanceComprobacion!C405","v":"Deudas comerciales por adquisición de bienes intangibles c/p"},{"$f":"BalanceComprobacion!D405","v":0},{"$f":"BalanceComprobacion!E405","v":2217957.83},{"$f":"BalanceComprobacion!F405","v":2217957.83},{"$f":"BalanceComprobacion!G405","v":0}]
[{"$f":"IFERROR(IF(B360<>0,Data!$B$2,\"\"),\"\")","v":"15603"},{"$f":"BalanceComprobacion!A406","v":3.1},{"$f":"BalanceComprobacion!B406","v":"2.1.1.01.04."},{"$f":"BalanceComprobacion!C406","v":"Deudas por adquisición de servicios c/p"},{"$f":"BalanceComprobacion!D406","v":0},{"$f":"BalanceComprobacion!E406","v":247405093.36000001},{"$f":"BalanceComprobacion!F406","v":253426836.25999999},{"$f":"BalanceComprobacion!G406","v":6021742.9000000004}]
[{"$f":"IFERROR(IF(B361<>0,Data!$B$2,\"\"),\"\")","v":"15603"},{"$f":"BalanceComprobacion!A407","v":3.1},{"$f":"BalanceComprobacion!B407","v":"2.1.1.01.04.01."},{"$f":"BalanceComprobacion!C407","v":"Deudas comerciales por alquileres y derechos sobre bienes c/p"},{"$f":"BalanceComprobacion!D407","v":0},{"$f":"BalanceComprobacion!E407","v":76424440.799999997},{"$f":"BalanceComprobacion!F407","v":76424440.799999997},{"$f":"BalanceComprobacion!G407","v":0}]
[{"$f":"IFERROR(IF(B362<>0,Data!$B$2,\"\"),\"\")","v":"15603"},{"$f":"BalanceComprobacion!A408","v":3.1},{"$f":"BalanceComprobacion!B408","v":"2.1.1.01.04.01.0."},{"$f":"BalanceComprobacion!C408","v":"Deudas comerciales por alquileres y derechos sobre bienes c/p"},{"$f":"BalanceComprobacion!D408","v":0},{"$f":"BalanceComprobacion!E408","v":76424440.799999997},{"$f":"BalanceComprobacion!F408","v":76424440.799999997},{"$f":"BalanceComprobacion!G408","v":0}]
[{"$f":"IFERROR(IF(B363<>0,Data!$B$2,\"\"),\"\")","v":"15603"},{"$f":"BalanceComprobacion!A409","v":3.1},{"$f":"BalanceComprobacion!B409","v":"2.1.1.01.04.01.0.99999"},{"$f":"BalanceComprobacion!C409","v":"Deudas comerciales por alquileres y derechos sobre bienes c/p"},{"$f":"BalanceComprobacion!D409","v":0},{"$f":"BalanceComprobacion!E409","v":76424440.799999997},{"$f":"BalanceComprobacion!F409","v":76424440.799999997},{"$f":"BalanceComprobacion!G409","v":0}]
[{"$f":"IFERROR(IF(B364<>0,Data!$B$2,\"\"),\"\")","v":"15603"},{"$f":"BalanceComprobacion!A410","v":3.1},{"$f":"BalanceComprobacion!B410","v":"2.1.1.01.04.02."},{"$f":"BalanceComprobacion!C410","v":"Deudas comerciales por servicios básicos c/p"},{"$f":"BalanceComprobacion!D410","v":0},{"$f":"BalanceComprobacion!E410","v":69865393.760000005},{"$f":"BalanceComprobacion!F410","v":69865393.760000005},{"$f":"BalanceComprobacion!G410","v":0}]
[{"$f":"IFERROR(IF(B365<>0,Data!$B$2,\"\"),\"\")","v":"15603"},{"$f":"BalanceComprobacion!A411","v":3.1},{"$f":"BalanceComprobacion!B411","v":"2.1.1.01.04.02.0."},{"$f":"BalanceComprobacion!C411","v":"Deudas comerciales por servicios básicos c/p"},{"$f":"BalanceComprobacion!D411","v":0},{"$f":"BalanceComprobacion!E411","v":69865393.760000005},{"$f":"BalanceComprobacion!F411","v":69865393.760000005},{"$f":"BalanceComprobacion!G411","v":0}]
[{"$f":"IFERROR(IF(B366<>0,Data!$B$2,\"\"),\"\")","v":"15603"},{"$f":"BalanceComprobacion!A412","v":3.1},{"$f":"BalanceComprobacion!B412","v":"2.1.1.01.04.02.0.99999"},{"$f":"BalanceComprobacion!C412","v":"Deudas comerciales por servicios básicos c/p"},{"$f":"BalanceComprobacion!D412","v":0},{"$f":"BalanceComprobacion!E412","v":69865393.760000005},{"$f":"BalanceComprobacion!F412","v":69865393.760000005},{"$f":"BalanceComprobacion!G412","v":0}]
[{"$f":"IFERROR(IF(B367<>0,Data!$B$2,\"\"),\"\")","v":"15603"},{"$f":"BalanceComprobacion!A413","v":3.1},{"$f":"BalanceComprobacion!B413","v":"2.1.1.01.04.03."},{"$f":"BalanceComprobacion!C413","v":"Deudas comerciales por servicios comerciales y financieros c/p"},{"$f":"BalanceComprobacion!D413","v":0},{"$f":"BalanceComprobacion!E413","v":7318476.7000000002},{"$f":"BalanceComprobacion!F413","v":7318476.7000000002},{"$f":"BalanceComprobacion!G413","v":0}]
[{"$f":"IFERROR(IF(B368<>0,Data!$B$2,\"\"),\"\")","v":"15603"},{"$f":"BalanceComprobacion!A414","v":3.1},{"$f":"BalanceComprobacion!B414","v":"2.1.1.01.04.03.0."},{"$f":"BalanceComprobacion!C414","v":"Deudas comerciales por servicios comerciales y financieros c/p"},{"$f":"BalanceComprobacion!D414","v":0},{"$f":"BalanceComprobacion!E414","v":7318476.7000000002},{"$f":"BalanceComprobacion!F414","v":7318476.7000000002},{"$f":"BalanceComprobacion!G414","v":0}]
[{"$f":"IFERROR(IF(B369<>0,Data!$B$2,\"\"),\"\")","v":"15603"},{"$f":"BalanceComprobacion!A415","v":3.1},{"$f":"BalanceComprobacion!B415","v":"2.1.1.01.04.03.0.99999"},{"$f":"BalanceComprobacion!C415","v":"Deudas comerciales por servicios comerciales y financieros c/p"},{"$f":"BalanceComprobacion!D415","v":0},{"$f":"BalanceComprobacion!E415","v":7318476.7000000002},{"$f":"BalanceComprobacion!F415","v":7318476.7000000002},{"$f":"BalanceComprobacion!G415","v":0}]
[{"$f":"IFERROR(IF(B370<>0,Data!$B$2,\"\"),\"\")","v":"15603"},{"$f":"BalanceComprobacion!A416","v":3.1},{"$f":"BalanceComprobacion!B416","v":"2.1.1.01.04.04."},{"$f":"BalanceComprobacion!C416","v":"Deudas comerciales por servicios de gestión y apoyo c/p"},{"$f":"BalanceComprobacion!D416","v":0},{"$f":"BalanceComprobacion!E416","v":51490355.310000002},{"$f":"BalanceComprobacion!F416","v":54995998.210000001},{"$f":"BalanceComprobacion!G416","v":3505642.9}]
[{"$f":"IFERROR(IF(B371<>0,Data!$B$2,\"\"),\"\")","v":"15603"},{"$f":"BalanceComprobacion!A417","v":3.1},{"$f":"BalanceComprobacion!B417","v":"2.1.1.01.04.04.0."},{"$f":"BalanceComprobacion!C417","v":"Deudas comerciales por servicios de gestión y apoyo c/p"},{"$f":"BalanceComprobacion!D417","v":0},{"$f":"BalanceComprobacion!E417","v":51490355.310000002},{"$f":"BalanceComprobacion!F417","v":54995998.210000001},{"$f":"BalanceComprobacion!G417","v":3505642.9}]
[{"$f":"IFERROR(IF(B372<>0,Data!$B$2,\"\"),\"\")","v":"15603"},{"$f":"BalanceComprobacion!A418","v":3.1},{"$f":"BalanceComprobacion!B418","v":"2.1.1.01.04.04.0.99999"},{"$f":"BalanceComprobacion!C418","v":"Deudas comerciales por servicios de gestión y apoyo c/p"},{"$f":"BalanceComprobacion!D418","v":0},{"$f":"BalanceComprobacion!E418","v":51490355.310000002},{"$f":"BalanceComprobacion!F418","v":54995998.210000001},{"$f":"BalanceComprobacion!G418","v":3505642.9}]
[{"$f":"IFERROR(IF(B373<>0,Data!$B$2,\"\"),\"\")","v":"15603"},{"$f":"BalanceComprobacion!A419","v":3.1},{"$f":"BalanceComprobacion!B419","v":"2.1.1.01.04.05."},{"$f":"BalanceComprobacion!C419","v":"Deudas comerciales por gastos de viaje y transporte c/p"},{"$f":"BalanceComprobacion!D419","v":0},{"$f":"BalanceComprobacion!E419","v":3709190},{"$f":"BalanceComprobacion!F419","v":3709190},{"$f":"BalanceComprobacion!G419","v":0}]
[{"$f":"IFERROR(IF(B374<>0,Data!$B$2,\"\"),\"\")","v":"15603"},{"$f":"BalanceComprobacion!A420","v":3.1},{"$f":"BalanceComprobacion!B420","v":"2.1.1.01.04.05.0."},{"$f":"BalanceComprobacion!C420","v":"Deudas comerciales por gastos de viaje y transporte c/p"},{"$f":"BalanceComprobacion!D420","v":0},{"$f":"BalanceComprobacion!E420","v":3709190},{"$f":"BalanceComprobacion!F420","v":3709190},{"$f":"BalanceComprobacion!G420","v":0}]
[{"$f":"IFERROR(IF(B375<>0,Data!$B$2,\"\"),\"\")","v":"15603"},{"$f":"BalanceComprobacion!A421","v":3.1},{"$f":"BalanceComprobacion!B421","v":"2.1.1.01.04.05.0.99999"},{"$f":"BalanceComprobacion!C421","v":"Deudas comerciales por gastos de viaje y transporte c/p"},{"$f":"BalanceComprobacion!D421","v":0},{"$f":"BalanceComprobacion!E421","v":3709190},{"$f":"BalanceComprobacion!F421","v":3709190},{"$f":"BalanceComprobacion!G421","v":0}]
[{"$f":"IFERROR(IF(B376<>0,Data!$B$2,\"\"),\"\")","v":"15603"},{"$f":"BalanceComprobacion!A422","v":3.1},{"$f":"BalanceComprobacion!B422","v":"2.1.1.01.04.06."},{"$f":"BalanceComprobacion!C422","v":"Deudas comerciales por seguros, reaseguros y otras obligaciones c/p"},{"$f":"BalanceComprobacion!D422","v":0},{"$f":"BalanceComprobacion!E422","v":6459311},{"$f":"BalanceComprobacion!F422","v":6459311},{"$f":"BalanceComprobacion!G422","v":0}]
[{"$f":"IFERROR(IF(B377<>0,Data!$B$2,\"\"),\"\")","v":"15603"},{"$f":"BalanceComprobacion!A423","v":3.1},{"$f":"BalanceComprobacion!B423","v":"2.1.1.01.04.06.0."},{"$f":"BalanceComprobacion!C423","v":"Deudas comerciales por seguros, reaseguros y otras obligaciones c/p"},{"$f":"BalanceComprobacion!D423","v":0},{"$f":"BalanceComprobacion!E423","v":6459311},{"$f":"BalanceComprobacion!F423","v":6459311},{"$f":"BalanceComprobacion!G423","v":0}]
[{"$f":"IFERROR(IF(B378<>0,Data!$B$2,\"\"),\"\")","v":"15603"},{"$f":"BalanceComprobacion!A424","v":3.1},{"$f":"BalanceComprobacion!B424","v":"2.1.1.01.04.06.0.99999"},{"$f":"BalanceComprobacion!C424","v":"Deudas comerciales por seguros, reaseguros y otras obligaciones c/p"},{"$f":"BalanceComprobacion!D424","v":0},{"$f":"BalanceComprobacion!E424","v":6459311},{"$f":"BalanceComprobacion!F424","v":6459311},{"$f":"BalanceComprobacion!G424","v":0}]
[{"$f":"IFERROR(IF(B379<>0,Data!$B$2,\"\"),\"\")","v":"15603"},{"$f":"BalanceComprobacion!A425","v":3.1},{"$f":"BalanceComprobacion!B425","v":"2.1.1.01.04.07."},{"$f":"BalanceComprobacion!C425","v":"Deudas comerciales por capacitación y protocolo c/p"},{"$f":"BalanceComprobacion!D425","v":0},{"$f":"BalanceComprobacion!E425","v":10860000},{"$f":"BalanceComprobacion!F425","v":10860000},{"$f":"BalanceComprobacion!G425","v":0}]
[{"$f":"IFERROR(IF(B380<>0,Data!$B$2,\"\"),\"\")","v":"15603"},{"$f":"BalanceComprobacion!A426","v":3.1},{"$f":"BalanceComprobacion!B426","v":"2.1.1.01.04.07.0."},{"$f":"BalanceComprobacion!C426","v":"Deudas comerciales por capacitación y protocolo c/p"},{"$f":"BalanceComprobacion!D426","v":0},{"$f":"BalanceComprobacion!E426","v":10860000},{"$f":"BalanceComprobacion!F426","v":10860000},{"$f":"BalanceComprobacion!G426","v":0}]
[{"$f":"IFERROR(IF(B381<>0,Data!$B$2,\"\"),\"\")","v":"15603"},{"$f":"BalanceComprobacion!A427","v":3.1},{"$f":"BalanceComprobacion!B427","v":"2.1.1.01.04.07.0.99999"},{"$f":"BalanceComprobacion!C427","v":"Deudas comerciales por capacitación y protocolo c/p"},{"$f":"BalanceComprobacion!D427","v":0},{"$f":"BalanceComprobacion!E427","v":10860000},{"$f":"BalanceComprobacion!F427","v":10860000},{"$f":"BalanceComprobacion!G427","v":0}]
[{"$f":"IFERROR(IF(B382<>0,Data!$B$2,\"\"),\"\")","v":"15603"},{"$f":"BalanceComprobacion!A428","v":3.1},{"$f":"BalanceComprobacion!B428","v":"2.1.1.01.04.08."},{"$f":"BalanceComprobacion!C428","v":"Deudas comerciales por mantenimiento y reparaciones c/p"},{"$f":"BalanceComprobacion!D428","v":0},{"$f":"BalanceComprobacion!E428","v":21277925.789999999},{"$f":"BalanceComprobacion!F428","v":23794025.789999999},{"$f":"BalanceComprobacion!G428","v":2516100}]
[{"$f":"IFERROR(IF(B383<>0,Data!$B$2,\"\"),\"\")","v":"15603"},{"$f":"BalanceComprobacion!A429","v":3.1},{"$f":"BalanceComprobacion!B429","v":"2.1.1.01.04.08.0."},{"$f":"BalanceComprobacion!C429","v":"Deudas comerciales por mantenimiento y reparaciones c/p"},{"$f":"BalanceComprobacion!D429","v":0},{"$f":"BalanceComprobacion!E429","v":21277925.789999999},{"$f":"BalanceComprobacion!F429","v":23794025.789999999},{"$f":"BalanceComprobacion!G429","v":2516100}]
[{"$f":"IFERROR(IF(B384<>0,Data!$B$2,\"\"),\"\")","v":"15603"},{"$f":"BalanceComprobacion!A430","v":3.1},{"$f":"BalanceComprobacion!B430","v":"2.1.1.01.04.08.0.99999"},{"$f":"BalanceComprobacion!C430","v":"Deudas comerciales por mantenimiento y reparaciones c/p"},{"$f":"BalanceComprobacion!D430","v":0},{"$f":"BalanceComprobacion!E430","v":21277925.789999999},{"$f":"BalanceComprobacion!F430","v":23794025.789999999},{"$f":"BalanceComprobacion!G430","v":2516100}]
[{"$f":"IFERROR(IF(B385<>0,Data!$B$2,\"\"),\"\")","v":"15603"},{"$f":"BalanceComprobacion!A431","v":3.1},{"$f":"BalanceComprobacion!B431","v":"2.1.1.02."},{"$f":"BalanceComprobacion!C431","v":"Deudas sociales y fiscales a corto plazo"},{"$f":"BalanceComprobacion!D431","v":21545672.420000002},{"$f":"BalanceComprobacion!E431","v":554992288.67999995},{"$f":"BalanceComprobacion!F431","v":609015678.88999999},{"$f":"BalanceComprobacion!G431","v":75569062.629999995}]
[{"$f":"IFERROR(IF(B386<>0,Data!$B$2,\"\"),\"\")","v":"15603"},{"$f":"BalanceComprobacion!A432","v":3.1},{"$f":"BalanceComprobacion!B432","v":"2.1.1.02.01."},{"$f":"BalanceComprobacion!C432","v":"Deudas por beneficios a los empleados c/p"},{"$f":"BalanceComprobacion!D432","v":7857628.0099999998},{"$f":"BalanceComprobacion!E432","v":516635177.13},{"$f":"BalanceComprobacion!F432","v":577731201.74000001},{"$f":"BalanceComprobacion!G432","v":68953652.620000005}]
[{"$f":"IFERROR(IF(B387<>0,Data!$B$2,\"\"),\"\")","v":"15603"},{"$f":"BalanceComprobacion!A433","v":3.1},{"$f":"BalanceComprobacion!B433","v":"2.1.1.02.01.01."},{"$f":"BalanceComprobacion!C433","v":"Remuneraciones básicas y eventuales a pagar c/p"},{"$f":"BalanceComprobacion!D433","v":699494.06},{"$f":"BalanceComprobacion!E433","v":433711819.75999999},{"$f":"BalanceComprobacion!F433","v":443748079.45999998},{"$f":"BalanceComprobacion!G433","v":10735753.76}]
[{"$f":"IFERROR(IF(B388<>0,Data!$B$2,\"\"),\"\")","v":"15603"},{"$f":"BalanceComprobacion!A434","v":3.1},{"$f":"BalanceComprobacion!B434","v":"2.1.1.02.01.01.1."},{"$f":"BalanceComprobacion!C434","v":"Remuneraciones"},{"$f":"BalanceComprobacion!D434","v":699494.06},{"$f":"BalanceComprobacion!E434","v":433711819.75999999},{"$f":"BalanceComprobacion!F434","v":443748079.45999998},{"$f":"BalanceComprobacion!G434","v":10735753.76}]
[{"$f":"IFERROR(IF(B389<>0,Data!$B$2,\"\"),\"\")","v":"15603"},{"$f":"BalanceComprobacion!A435","v":3.1},{"$f":"BalanceComprobacion!B435","v":"2.1.1.02.01.01.1.99999"},{"$f":"BalanceComprobacion!C435","v":"Remuneraciones"},{"$f":"BalanceComprobacion!D435","v":699494.06},{"$f":"BalanceComprobacion!E435","v":433711819.75999999},{"$f":"BalanceComprobacion!F435","v":443748079.45999998},{"$f":"BalanceComprobacion!G435","v":10735753.76}]
[{"$f":"IFERROR(IF(B390<>0,Data!$B$2,\"\"),\"\")","v":"15603"},{"$f":"BalanceComprobacion!A436","v":3.1},{"$f":"BalanceComprobacion!B436","v":"2.1.1.02.01.03."},{"$f":"BalanceComprobacion!C436","v":"Incentivos salariales a pagar c/p"},{"$f":"BalanceComprobacion!D436","v":7158133.9500000002},{"$f":"BalanceComprobacion!E436","v":1505084.57},{"$f":"BalanceComprobacion!F436","v":36424858.880000003},{"$f":"BalanceComprobacion!G436","v":42077908.259999998}]
[{"$f":"IFERROR(IF(B391<>0,Data!$B$2,\"\"),\"\")","v":"15603"},{"$f":"BalanceComprobacion!A437","v":3.1},{"$f":"BalanceComprobacion!B437","v":"2.1.1.02.01.03.3."},{"$f":"BalanceComprobacion!C437","v":"Decimotercer mes a pagar c/p"},{"$f":"BalanceComprobacion!D437","v":7158133.9500000002},{"$f":"BalanceComprobacion!E437","v":1505084.57},{"$f":"BalanceComprobacion!F437","v":36424858.880000003},{"$f":"BalanceComprobacion!G437","v":42077908.259999998}]
[{"$f":"IFERROR(IF(B392<>0,Data!$B$2,\"\"),\"\")","v":"15603"},{"$f":"BalanceComprobacion!A438","v":3.1},{"$f":"BalanceComprobacion!B438","v":"2.1.1.02.01.03.3.99999"},{"$f":"BalanceComprobacion!C438","v":"Decimotercer mes a pagar c/p"},{"$f":"BalanceComprobacion!D438","v":7158133.9500000002},{"$f":"BalanceComprobacion!E438","v":1505084.57},{"$f":"BalanceComprobacion!F438","v":36424858.880000003},{"$f":"BalanceComprobacion!G438","v":42077908.259999998}]
[{"$f":"IFERROR(IF(B393<>0,Data!$B$2,\"\"),\"\")","v":"15603"},{"$f":"BalanceComprobacion!A439","v":3.1},{"$f":"BalanceComprobacion!B439","v":"2.1.1.02.01.04."},{"$f":"BalanceComprobacion!C439","v":"Contribuciones patronales al desarrollo y la seguridad social a pagar c/p"},{"$f":"BalanceComprobacion!D439","v":0},{"$f":"BalanceComprobacion!E439","v":81418272.799999997},{"$f":"BalanceComprobacion!F439","v":97558263.400000006},{"$f":"BalanceComprobacion!G439","v":16139990.6}]
[{"$f":"IFERROR(IF(B394<>0,Data!$B$2,\"\"),\"\")","v":"15603"},{"$f":"BalanceComprobacion!A440","v":3.1},{"$f":"BalanceComprobacion!B440","v":"2.1.1.02.01.04.0."},{"$f":"BalanceComprobacion!C440","v":"Contribuciones patronales al desarrollo y la seguridad social a pagar c/p"},{"$f":"BalanceComprobacion!D440","v":0},{"$f":"BalanceComprobacion!E440","v":81418272.799999997},{"$f":"BalanceComprobacion!F440","v":97558263.400000006},{"$f":"BalanceComprobacion!G440","v":16139990.6}]
[{"$f":"IFERROR(IF(B395<>0,Data!$B$2,\"\"),\"\")","v":"15603"},{"$f":"BalanceComprobacion!A441","v":3.1},{"$f":"BalanceComprobacion!B441","v":"2.1.1.02.01.04.0.14120"},{"$f":"BalanceComprobacion!C441","v":"Contribuciones patronales al desarrollo y la seguridad social a pagar c/p (Aporte Patronal FCL - CCSS)"},{"$f":"BalanceComprobacion!D441","v":0},{"$f":"BalanceComprobacion!E441","v":81418272.799999997},{"$f":"BalanceComprobacion!F441","v":97558263.400000006},{"$f":"BalanceComprobacion!G441","v":16139990.6}]
[{"$f":"IFERROR(IF(B396<>0,Data!$B$2,\"\"),\"\")","v":"15603"},{"$f":"BalanceComprobacion!A442","v":3.1},{"$f":"BalanceComprobacion!B442","v":"2.1.1.02.01.04.0.31104"},{"$f":"BalanceComprobacion!C442","v":"Contribuciones patronales al desarrollo y la seguridad social a pagar c/p (Cont. Patronal BPDC)"},{"$f":"BalanceComprobacion!D442","v":0},{"$f":"BalanceComprobacion!E442","v":0},{"$f":"BalanceComprobacion!F442","v":0},{"$f":"BalanceComprobacion!G442","v":0}]
[{"$f":"IFERROR(IF(B397<>0,Data!$B$2,\"\"),\"\")","v":"15603"},{"$f":"BalanceComprobacion!A443","v":3.1},{"$f":"BalanceComprobacion!B443","v":"2.1.1.02.02."},{"$f":"BalanceComprobacion!C443","v":"Deudas fiscales c/p"},{"$f":"BalanceComprobacion!D443","v":13688044.41},{"$f":"BalanceComprobacion!E443","v":38357111.549999997},{"$f":"BalanceComprobacion!F443","v":31284477.16},{"$f":"BalanceComprobacion!G443","v":6615410.0199999996}]
[{"$f":"IFERROR(IF(B398<>0,Data!$B$2,\"\"),\"\")","v":"15603"},{"$f":"BalanceComprobacion!A444","v":3.1},{"$f":"BalanceComprobacion!B444","v":"2.1.1.02.02.02."},{"$f":"BalanceComprobacion!C444","v":"Retenciones de impuestos nacionales a pagar c/p"},{"$f":"BalanceComprobacion!D444","v":13688044.41},{"$f":"BalanceComprobacion!E444","v":33081570.449999999},{"$f":"BalanceComprobacion!F444","v":26008936.059999999},{"$f":"BalanceComprobacion!G444","v":6615410.0199999996}]
[{"$f":"IFERROR(IF(B399<>0,Data!$B$2,\"\"),\"\")","v":"15603"},{"$f":"BalanceComprobacion!A445","v":3.1},{"$f":"BalanceComprobacion!B445","v":"2.1.1.02.02.02.0."},{"$f":"BalanceComprobacion!C445","v":"Retenciones de impuestos nacionales a pagar c/p"},{"$f":"BalanceComprobacion!D445","v":13688044.41},{"$f":"BalanceComprobacion!E445","v":33081570.449999999},{"$f":"BalanceComprobacion!F445","v":26008936.059999999},{"$f":"BalanceComprobacion!G445","v":6615410.0199999996}]
[{"$f":"IFERROR(IF(B400<>0,Data!$B$2,\"\"),\"\")","v":"15603"},{"$f":"BalanceComprobacion!A446","v":3.1},{"$f":"BalanceComprobacion!B446","v":"2.1.1.02.02.02.0.11206"},{"$f":"BalanceComprobacion!C446","v":"Ministerio de Hacienda (MHD)"},{"$f":"BalanceComprobacion!D446","v":13688044.41},{"$f":"BalanceComprobacion!E446","v":33081570.449999999},{"$f":"BalanceComprobacion!F446","v":26008936.059999999},{"$f":"BalanceComprobacion!G446","v":6615410.0199999996}]
[{"$f":"IFERROR(IF(B401<>0,Data!$B$2,\"\"),\"\")","v":"15603"},{"$f":"BalanceComprobacion!A447","v":3.1},{"$f":"BalanceComprobacion!B447","v":"2.1.1.02.02.04."},{"$f":"BalanceComprobacion!C447","v":"Retenciones de impuestos entidades relacionadas a pagar c/p"},{"$f":"BalanceComprobacion!D447","v":0},{"$f":"BalanceComprobacion!E447","v":5275541.0999999996},{"$f":"BalanceComprobacion!F447","v":5275541.0999999996},{"$f":"BalanceComprobacion!G447","v":0}]
[{"$f":"IFERROR(IF(B402<>0,Data!$B$2,\"\"),\"\")","v":"15603"},{"$f":"BalanceComprobacion!A448","v":3.1},{"$f":"BalanceComprobacion!B448","v":"2.1.1.02.02.04.0."},{"$f":"BalanceComprobacion!C448","v":"Retenciones de impuestos entidades relacionadas a pagar c/p"},{"$f":"BalanceComprobacion!D448","v":0},{"$f":"BalanceComprobacion!E448","v":5275541.0999999996},{"$f":"BalanceComprobacion!F448","v":5275541.0999999996},{"$f":"BalanceComprobacion!G448","v":0}]
[{"$f":"IFERROR(IF(B403<>0,Data!$B$2,\"\"),\"\")","v":"15603"},{"$f":"BalanceComprobacion!A449","v":3.1},{"$f":"BalanceComprobacion!B449","v":"2.1.1.02.02.04.0.12784"},{"$f":"BalanceComprobacion!C449","v":"Retenciones de impuestos entidades relacionadas a pagar c/p"},{"$f":"BalanceComprobacion!D449","v":0},{"$f":"BalanceComprobacion!E449","v":5275541.0999999996},{"$f":"BalanceComprobacion!F449","v":5275541.0999999996},{"$f":"BalanceComprobacion!G449","v":0}]
[{"$f":"IFERROR(IF(B404<>0,Data!$B$2,\"\"),\"\")","v":"15603"},{"$f":"BalanceComprobacion!A450","v":3.1},{"$f":"BalanceComprobacion!B450","v":"2.1.1.03."},{"$f":"BalanceComprobacion!C450","v":"Transferencias a pagar a corto plazo"},{"$f":"BalanceComprobacion!D450","v":63607074.43},{"$f":"BalanceComprobacion!E450","v":56381407.850000001},{"$f":"BalanceComprobacion!F450","v":18966827.510000002},{"$f":"BalanceComprobacion!G450","v":26192494.09}]
[{"$f":"IFERROR(IF(B405<>0,Data!$B$2,\"\"),\"\")","v":"15603"},{"$f":"BalanceComprobacion!A451","v":3.1},{"$f":"BalanceComprobacion!B451","v":"2.1.1.03.02."},{"$f":"BalanceComprobacion!C451","v":"Transferencias al sector público interno a pagar c/p"},{"$f":"BalanceComprobacion!D451","v":63607074.43},{"$f":"BalanceComprobacion!E451","v":56381407.850000001},{"$f":"BalanceComprobacion!F451","v":18966827.510000002},{"$f":"BalanceComprobacion!G451","v":26192494.09}]
[{"$f":"IFERROR(IF(B406<>0,Data!$B$2,\"\"),\"\")","v":"15603"},{"$f":"BalanceComprobacion!A452","v":3.1},{"$f":"BalanceComprobacion!B452","v":"2.1.1.03.02.01."},{"$f":"BalanceComprobacion!C452","v":"Transferencias al Gobierno Central a pagar c/p"},{"$f":"BalanceComprobacion!D452","v":983027.41},{"$f":"BalanceComprobacion!E452","v":0},{"$f":"BalanceComprobacion!F452","v":0},{"$f":"BalanceComprobacion!G452","v":983027.41}]
[{"$f":"IFERROR(IF(B407<>0,Data!$B$2,\"\"),\"\")","v":"15603"},{"$f":"BalanceComprobacion!A453","v":3.1},{"$f":"BalanceComprobacion!B453","v":"2.1.1.03.02.01.0."},{"$f":"BalanceComprobacion!C453","v":"Transferencias al Gobierno Central a pagar c/p"},{"$f":"BalanceComprobacion!D453","v":983027.41},{"$f":"BalanceComprobacion!E453","v":0},{"$f":"BalanceComprobacion!F453","v":0},{"$f":"BalanceComprobacion!G453","v":983027.41}]
[{"$f":"IFERROR(IF(B408<>0,Data!$B$2,\"\"),\"\")","v":"15603"},{"$f":"BalanceComprobacion!A454","v":3.1},{"$f":"BalanceComprobacion!B454","v":"2.1.1.03.02.01.0.11206"},{"$f":"BalanceComprobacion!C454","v":"Transferencias al Gobierno Central a pagar c/p"},{"$f":"BalanceComprobacion!D454","v":648323.05000000005},{"$f":"BalanceComprobacion!E454","v":0},{"$f":"BalanceComprobacion!F454","v":0},{"$f":"BalanceComprobacion!G454","v":648323.05000000005}]
[{"$f":"IFERROR(IF(B409<>0,Data!$B$2,\"\"),\"\")","v":"15603"},{"$f":"BalanceComprobacion!A455","v":3.1},{"$f":"BalanceComprobacion!B455","v":"2.1.1.03.02.01.0.11219"},{"$f":"BalanceComprobacion!C455","v":"Transferencias al Gobierno Central a pagar c/p"},{"$f":"BalanceComprobacion!D455","v":334704.36},{"$f":"BalanceComprobacion!E455","v":0},{"$f":"BalanceComprobacion!F455","v":0},{"$f":"BalanceComprobacion!G455","v":334704.36}]
[{"$f":"IFERROR(IF(B410<>0,Data!$B$2,\"\"),\"\")","v":"15603"},{"$f":"BalanceComprobacion!A456","v":3.1},{"$f":"BalanceComprobacion!B456","v":"2.1.1.03.02.02."},{"$f":"BalanceComprobacion!C456","v":"Transferencias a Órganos Desconcentrados a pagar c/p"},{"$f":"BalanceComprobacion!D456","v":2002155.83},{"$f":"BalanceComprobacion!E456","v":0},{"$f":"BalanceComprobacion!F456","v":0},{"$f":"BalanceComprobacion!G456","v":2002155.83}]
[{"$f":"IFERROR(IF(B411<>0,Data!$B$2,\"\"),\"\")","v":"15603"},{"$f":"BalanceComprobacion!A457","v":3.1},{"$f":"BalanceComprobacion!B457","v":"2.1.1.03.02.02.0."},{"$f":"BalanceComprobacion!C457","v":"Transferencias a Órganos Desconcentrados a pagar c/p"},{"$f":"BalanceComprobacion!D457","v":2002155.83},{"$f":"BalanceComprobacion!E457","v":0},{"$f":"BalanceComprobacion!F457","v":0},{"$f":"BalanceComprobacion!G457","v":2002155.83}]
[{"$f":"IFERROR(IF(B412<>0,Data!$B$2,\"\"),\"\")","v":"15603"},{"$f":"BalanceComprobacion!A458","v":3.1},{"$f":"BalanceComprobacion!B458","v":"2.1.1.03.02.02.0.12553"},{"$f":"BalanceComprobacion!C458","v":"Transferencias a Órganos Desconcentrados a pagar c/p"},{"$f":"BalanceComprobacion!D458","v":53127.68},{"$f":"BalanceComprobacion!E458","v":0},{"$f":"BalanceComprobacion!F458","v":0},{"$f":"BalanceComprobacion!G458","v":53127.68}]
[{"$f":"IFERROR(IF(B413<>0,Data!$B$2,\"\"),\"\")","v":"15603"},{"$f":"BalanceComprobacion!A459","v":3.1},{"$f":"BalanceComprobacion!B459","v":"2.1.1.03.02.02.0.12581"},{"$f":"BalanceComprobacion!C459","v":"Consejo Nacional de Personas con Discapacidad - CONAPDIS"},{"$f":"BalanceComprobacion!D459","v":652382.05000000005},{"$f":"BalanceComprobacion!E459","v":0},{"$f":"BalanceComprobacion!F459","v":0},{"$f":"BalanceComprobacion!G459","v":652382.05000000005}]
[{"$f":"IFERROR(IF(B414<>0,Data!$B$2,\"\"),\"\")","v":"15603"},{"$f":"BalanceComprobacion!A460","v":3.1},{"$f":"BalanceComprobacion!B460","v":"2.1.1.03.02.02.0.12784"},{"$f":"BalanceComprobacion!C460","v":"Transferencias a Órganos Desconcentrados a pagar c/p"},{"$f":"BalanceComprobacion!D460","v":1296646.1000000001},{"$f":"BalanceComprobacion!E460","v":0},{"$f":"BalanceComprobacion!F460","v":0},{"$f":"BalanceComprobacion!G460","v":1296646.1000000001}]
[{"$f":"IFERROR(IF(B415<>0,Data!$B$2,\"\"),\"\")","v":"15603"},{"$f":"BalanceComprobacion!A461","v":3.1},{"$f":"BalanceComprobacion!B461","v":"2.1.1.03.02.03."},{"$f":"BalanceComprobacion!C461","v":"Transferencias a Instituciones Descentralizadas no Empresariales a pagar c/p"},{"$f":"BalanceComprobacion!D461","v":56381407.850000001},{"$f":"BalanceComprobacion!E461","v":56381407.850000001},{"$f":"BalanceComprobacion!F461","v":18966827.510000002},{"$f":"BalanceComprobacion!G461","v":18966827.510000002}]
[{"$f":"IFERROR(IF(B416<>0,Data!$B$2,\"\"),\"\")","v":"15603"},{"$f":"BalanceComprobacion!A462","v":3.1},{"$f":"BalanceComprobacion!B462","v":"2.1.1.03.02.03.0."},{"$f":"BalanceComprobacion!C462","v":"Transferencias a Instituciones Descentralizadas no Empresariales a pagar c/p"},{"$f":"BalanceComprobacion!D462","v":56381407.850000001},{"$f":"BalanceComprobacion!E462","v":56381407.850000001},{"$f":"BalanceComprobacion!F462","v":18966827.510000002},{"$f":"BalanceComprobacion!G462","v":18966827.510000002}]
[{"$f":"IFERROR(IF(B417<>0,Data!$B$2,\"\"),\"\")","v":"15603"},{"$f":"BalanceComprobacion!A463","v":3.1},{"$f":"BalanceComprobacion!B463","v":"2.1.1.03.02.03.0.14253"},{"$f":"BalanceComprobacion!C463","v":"Transferencias a Instituciones Descentralizadas no Empresariales a pagar c/p"},{"$f":"BalanceComprobacion!D463","v":56381407.850000001},{"$f":"BalanceComprobacion!E463","v":56381407.850000001},{"$f":"BalanceComprobacion!F463","v":18966827.510000002},{"$f":"BalanceComprobacion!G463","v":18966827.510000002}]
[{"$f":"IFERROR(IF(B418<>0,Data!$B$2,\"\"),\"\")","v":"15603"},{"$f":"BalanceComprobacion!A464","v":3.1},{"$f":"BalanceComprobacion!B464","v":"2.1.1.03.02.99."},{"$f":"BalanceComprobacion!C464","v":"Transferencias a otras Instituciones de Gobiernos Locales a pagar c/p"},{"$f":"BalanceComprobacion!D464","v":4240483.34},{"$f":"BalanceComprobacion!E464","v":0},{"$f":"BalanceComprobacion!F464","v":0},{"$f":"BalanceComprobacion!G464","v":4240483.34}]
[{"$f":"IFERROR(IF(B419<>0,Data!$B$2,\"\"),\"\")","v":"15603"},{"$f":"BalanceComprobacion!A465","v":3.1},{"$f":"BalanceComprobacion!B465","v":"2.1.1.03.02.99.0."},{"$f":"BalanceComprobacion!C465","v":"Transferencias a otras Instituciones de Gobiernos Locales a pagar c/p"},{"$f":"BalanceComprobacion!D465","v":4240483.34},{"$f":"BalanceComprobacion!E465","v":0},{"$f":"BalanceComprobacion!F465","v":0},{"$f":"BalanceComprobacion!G465","v":4240483.34}]
[{"$f":"IFERROR(IF(B420<>0,Data!$B$2,\"\"),\"\")","v":"15603"},{"$f":"BalanceComprobacion!A466","v":3.1},{"$f":"BalanceComprobacion!B466","v":"2.1.1.03.02.99.0.15910"},{"$f":"BalanceComprobacion!C466","v":"Comités Cantonales de Deportes y Recreación"},{"$f":"BalanceComprobacion!D466","v":3914292.31},{"$f":"BalanceComprobacion!E466","v":0},{"$f":"BalanceComprobacion!F466","v":0},{"$f":"BalanceComprobacion!G466","v":3914292.31}]
[{"$f":"IFERROR(IF(B421<>0,Data!$B$2,\"\"),\"\")","v":"15603"},{"$f":"BalanceComprobacion!A467","v":3.1},{"$f":"BalanceComprobacion!B467","v":"2.1.1.03.02.99.0.15980"},{"$f":"BalanceComprobacion!C467","v":"Unión Nacional de Gobiernos Locales"},{"$f":"BalanceComprobacion!D467","v":326191.03000000003},{"$f":"BalanceComprobacion!E467","v":0},{"$f":"BalanceComprobacion!F467","v":0},{"$f":"BalanceComprobacion!G467","v":326191.03000000003}]
[{"$f":"IFERROR(IF(B422<>0,Data!$B$2,\"\"),\"\")","v":"15603"},{"$f":"BalanceComprobacion!A468","v":3.1},{"$f":"BalanceComprobacion!B468","v":"2.1.1.99."},{"$f":"BalanceComprobacion!C468","v":"Otras deudas a corto plazo"},{"$f":"BalanceComprobacion!D468","v":0},{"$f":"BalanceComprobacion!E468","v":141528229.28},{"$f":"BalanceComprobacion!F468","v":141528229.28},{"$f":"BalanceComprobacion!G468","v":0}]
[{"$f":"IFERROR(IF(B423<>0,Data!$B$2,\"\"),\"\")","v":"15603"},{"$f":"BalanceComprobacion!A469","v":3.1},{"$f":"BalanceComprobacion!B469","v":"2.1.1.99.99."},{"$f":"BalanceComprobacion!C469","v":"Deudas varias c/p"},{"$f":"BalanceComprobacion!D469","v":0},{"$f":"BalanceComprobacion!E469","v":141528229.28},{"$f":"BalanceComprobacion!F469","v":141528229.28},{"$f":"BalanceComprobacion!G469","v":0}]
[{"$f":"IFERROR(IF(B424<>0,Data!$B$2,\"\"),\"\")","v":"15603"},{"$f":"BalanceComprobacion!A470","v":3.1},{"$f":"BalanceComprobacion!B470","v":"2.1.1.99.99.02."},{"$f":"BalanceComprobacion!C470","v":"Deudas varias con el sector público interno c/p"},{"$f":"BalanceComprobacion!D470","v":0},{"$f":"BalanceComprobacion!E470","v":141528229.28},{"$f":"BalanceComprobacion!F470","v":141528229.28},{"$f":"BalanceComprobacion!G470","v":0}]
[{"$f":"IFERROR(IF(B425<>0,Data!$B$2,\"\"),\"\")","v":"15603"},{"$f":"BalanceComprobacion!A471","v":3.1},{"$f":"BalanceComprobacion!B471","v":"2.1.1.99.99.02.0."},{"$f":"BalanceComprobacion!C471","v":"Deudas varias con el sector público interno c/p"},{"$f":"BalanceComprobacion!D471","v":0},{"$f":"BalanceComprobacion!E471","v":141528229.28},{"$f":"BalanceComprobacion!F471","v":141528229.28},{"$f":"BalanceComprobacion!G471","v":0}]
[{"$f":"IFERROR(IF(B426<>0,Data!$B$2,\"\"),\"\")","v":"15603"},{"$f":"BalanceComprobacion!A472","v":3.1},{"$f":"BalanceComprobacion!B472","v":"2.1.1.99.99.02.0.99999"},{"$f":"BalanceComprobacion!C472","v":"Deudas varias con el sector público interno c/p"},{"$f":"BalanceComprobacion!D472","v":0},{"$f":"BalanceComprobacion!E472","v":141528229.28},{"$f":"BalanceComprobacion!F472","v":141528229.28},{"$f":"BalanceComprobacion!G472","v":0}]
[{"$f":"IFERROR(IF(B427<>0,Data!$B$2,\"\"),\"\")","v":"15603"},{"$f":"BalanceComprobacion!A473","v":3.1},{"$f":"BalanceComprobacion!B473","v":"2.1.2."},{"$f":"BalanceComprobacion!C473","v":"Endeudamiento público a corto plazo"},{"$f":"BalanceComprobacion!D473","v":0},{"$f":"BalanceComprobacion!E473","v":194210370.37},{"$f":"BalanceComprobacion!F473","v":679756970},{"$f":"BalanceComprobacion!G473","v":485546599.63}]
[{"$f":"IFERROR(IF(B428<>0,Data!$B$2,\"\"),\"\")","v":"15603"},{"$f":"BalanceComprobacion!A474","v":3.1},{"$f":"BalanceComprobacion!B474","v":"2.1.2.02."},{"$f":"BalanceComprobacion!C474","v":"Préstamos a pagar a corto plazo"},{"$f":"BalanceComprobacion!D474","v":0},{"$f":"BalanceComprobacion!E474","v":194210370.37},{"$f":"BalanceComprobacion!F474","v":679756970},{"$f":"BalanceComprobacion!G474","v":485546599.63}]
[{"$f":"IFERROR(IF(B429<>0,Data!$B$2,\"\"),\"\")","v":"15603"},{"$f":"BalanceComprobacion!A475","v":3.1},{"$f":"BalanceComprobacion!B475","v":"2.1.2.02.02."},{"$f":"BalanceComprobacion!C475","v":"Préstamos del sector público interno a pagar c/p"},{"$f":"BalanceComprobacion!D475","v":0},{"$f":"BalanceComprobacion!E475","v":194210370.37},{"$f":"BalanceComprobacion!F475","v":679756970},{"$f":"BalanceComprobacion!G475","v":485546599.63}]
[{"$f":"IFERROR(IF(B430<>0,Data!$B$2,\"\"),\"\")","v":"15603"},{"$f":"BalanceComprobacion!A476","v":3.1},{"$f":"BalanceComprobacion!B476","v":"2.1.2.02.02.99."},{"$f":"BalanceComprobacion!C476","v":"Préstamos de otras Instituciones de Gobiernos Locales a pagar c/p"},{"$f":"BalanceComprobacion!D476","v":0},{"$f":"BalanceComprobacion!E476","v":194210370.37},{"$f":"BalanceComprobacion!F476","v":679756970},{"$f":"BalanceComprobacion!G476","v":485546599.63}]
[{"$f":"IFERROR(IF(B431<>0,Data!$B$2,\"\"),\"\")","v":"15603"},{"$f":"BalanceComprobacion!A477","v":3.1},{"$f":"BalanceComprobacion!B477","v":"2.1.2.02.02.99.1."},{"$f":"BalanceComprobacion!C477","v":"Préstamos de otras Instituciones de Gobiernos Locales a pagar c/p - Capital"},{"$f":"BalanceComprobacion!D477","v":0},{"$f":"BalanceComprobacion!E477","v":194210370.37},{"$f":"BalanceComprobacion!F477","v":679756970},{"$f":"BalanceComprobacion!G477","v":485546599.63}]
[{"$f":"IFERROR(IF(B432<>0,Data!$B$2,\"\"),\"\")","v":"15603"},{"$f":"BalanceComprobacion!A478","v":3.1},{"$f":"BalanceComprobacion!B478","v":"2.1.2.02.02.99.1.14226"},{"$f":"BalanceComprobacion!C478","v":"Instituto de Fomento y Asesoría Municipal (IFAM) Préstamo corto Plazo"},{"$f":"BalanceComprobacion!D478","v":0},{"$f":"BalanceComprobacion!E478","v":194210370.37},{"$f":"BalanceComprobacion!F478","v":679756970},{"$f":"BalanceComprobacion!G478","v":485546599.63}]
[{"$f":"IFERROR(IF(B433<>0,Data!$B$2,\"\"),\"\")","v":"15603"},{"$f":"BalanceComprobacion!A479","v":3.1},{"$f":"BalanceComprobacion!B479","v":"2.1.3."},{"$f":"BalanceComprobacion!C479","v":"Fondos de terceros y en garantía"},{"$f":"BalanceComprobacion!D479","v":66225246.859999999},{"$f":"BalanceComprobacion!E479","v":18577683.129999999},{"$f":"BalanceComprobacion!F479","v":10326835.91},{"$f":"BalanceComprobacion!G479","v":57974399.640000001}]
[{"$f":"IFERROR(IF(B434<>0,Data!$B$2,\"\"),\"\")","v":"15603"},{"$f":"BalanceComprobacion!A480","v":3.1},{"$f":"BalanceComprobacion!B480","v":"2.1.3.03."},{"$f":"BalanceComprobacion!C480","v":"Depósitos en garantía"},{"$f":"BalanceComprobacion!D480","v":66225246.859999999},{"$f":"BalanceComprobacion!E480","v":18577683.129999999},{"$f":"BalanceComprobacion!F480","v":10326835.91},{"$f":"BalanceComprobacion!G480","v":57974399.640000001}]
[{"$f":"IFERROR(IF(B435<>0,Data!$B$2,\"\"),\"\")","v":"15603"},{"$f":"BalanceComprobacion!A481","v":3.1},{"$f":"BalanceComprobacion!B481","v":"2.1.3.03.01."},{"$f":"BalanceComprobacion!C481","v":"Depósitos en garantía del sector privado interno"},{"$f":"BalanceComprobacion!D481","v":66225246.859999999},{"$f":"BalanceComprobacion!E481","v":18577683.129999999},{"$f":"BalanceComprobacion!F481","v":10326835.91},{"$f":"BalanceComprobacion!G481","v":57974399.640000001}]
[{"$f":"IFERROR(IF(B436<>0,Data!$B$2,\"\"),\"\")","v":"15603"},{"$f":"BalanceComprobacion!A482","v":3.1},{"$f":"BalanceComprobacion!B482","v":"2.1.3.03.01.02."},{"$f":"BalanceComprobacion!C482","v":"Depósitos en garantía de empresas privadas"},{"$f":"BalanceComprobacion!D482","v":66225246.859999999},{"$f":"BalanceComprobacion!E482","v":18577683.129999999},{"$f":"BalanceComprobacion!F482","v":10326835.91},{"$f":"BalanceComprobacion!G482","v":57974399.640000001}]
[{"$f":"IFERROR(IF(B437<>0,Data!$B$2,\"\"),\"\")","v":"15603"},{"$f":"BalanceComprobacion!A483","v":3.1},{"$f":"BalanceComprobacion!B483","v":"2.1.3.03.01.02.0."},{"$f":"BalanceComprobacion!C483","v":"Depósitos en garantía de empresas privadas"},{"$f":"BalanceComprobacion!D483","v":66225246.859999999},{"$f":"BalanceComprobacion!E483","v":18577683.129999999},{"$f":"BalanceComprobacion!F483","v":10326835.91},{"$f":"BalanceComprobacion!G483","v":57974399.640000001}]
[{"$f":"IFERROR(IF(B438<>0,Data!$B$2,\"\"),\"\")","v":"15603"},{"$f":"BalanceComprobacion!A484","v":3.1},{"$f":"BalanceComprobacion!B484","v":"2.1.3.03.01.02.0.99999"},{"$f":"BalanceComprobacion!C484","v":"Depósitos en garantía de empresas privadas"},{"$f":"BalanceComprobacion!D484","v":66225246.859999999},{"$f":"BalanceComprobacion!E484","v":18577683.129999999},{"$f":"BalanceComprobacion!F484","v":10326835.91},{"$f":"BalanceComprobacion!G484","v":57974399.640000001}]
[{"$f":"IFERROR(IF(B439<>0,Data!$B$2,\"\"),\"\")","v":"15603"},{"$f":"BalanceComprobacion!A485","v":3.1},{"$f":"BalanceComprobacion!B485","v":"2.2."},{"$f":"BalanceComprobacion!C485","v":"Pasivo No Corriente"},{"$f":"BalanceComprobacion!D485","v":1546039108.21},{"$f":"BalanceComprobacion!E485","v":787922011.08000004},{"$f":"BalanceComprobacion!F485","v":315913052.06},{"$f":"BalanceComprobacion!G485","v":1074030149.1900001}]
[{"$f":"IFERROR(IF(B440<>0,Data!$B$2,\"\"),\"\")","v":"15603"},{"$f":"BalanceComprobacion!A486","v":3.1},{"$f":"BalanceComprobacion!B486","v":"2.2.2."},{"$f":"BalanceComprobacion!C486","v":"Endeudamiento público a largo plazo"},{"$f":"BalanceComprobacion!D486","v":1522925878.21},{"$f":"BalanceComprobacion!E486","v":786838411.08000004},{"$f":"BalanceComprobacion!F486","v":298894682.06},{"$f":"BalanceComprobacion!G486","v":1034982149.1900001}]
[{"$f":"IFERROR(IF(B441<>0,Data!$B$2,\"\"),\"\")","v":"15603"},{"$f":"BalanceComprobacion!A487","v":3.1},{"$f":"BalanceComprobacion!B487","v":"2.2.2.02."},{"$f":"BalanceComprobacion!C487","v":"Préstamos a pagar a largo plazo"},{"$f":"BalanceComprobacion!D487","v":1522925878.21},{"$f":"BalanceComprobacion!E487","v":786838411.08000004},{"$f":"BalanceComprobacion!F487","v":298894682.06},{"$f":"BalanceComprobacion!G487","v":1034982149.1900001}]
[{"$f":"IFERROR(IF(B442<>0,Data!$B$2,\"\"),\"\")","v":"15603"},{"$f":"BalanceComprobacion!A488","v":3.1},{"$f":"BalanceComprobacion!B488","v":"2.2.2.02.02."},{"$f":"BalanceComprobacion!C488","v":"Préstamos del sector público interno a pagar l/p"},{"$f":"BalanceComprobacion!D488","v":1522925878.21},{"$f":"BalanceComprobacion!E488","v":786838411.08000004},{"$f":"BalanceComprobacion!F488","v":298894682.06},{"$f":"BalanceComprobacion!G488","v":1034982149.1900001}]
[{"$f":"IFERROR(IF(B443<>0,Data!$B$2,\"\"),\"\")","v":"15603"},{"$f":"BalanceComprobacion!A489","v":3.1},{"$f":"BalanceComprobacion!B489","v":"2.2.2.02.02.99."},{"$f":"BalanceComprobacion!C489","v":"Préstamos de otras Instituciones de Gobiernos Locales a pagar l/p"},{"$f":"BalanceComprobacion!D489","v":1522925878.21},{"$f":"BalanceComprobacion!E489","v":786838411.08000004},{"$f":"BalanceComprobacion!F489","v":298894682.06},{"$f":"BalanceComprobacion!G489","v":1034982149.1900001}]
[{"$f":"IFERROR(IF(B444<>0,Data!$B$2,\"\"),\"\")","v":"15603"},{"$f":"BalanceComprobacion!A490","v":3.1},{"$f":"BalanceComprobacion!B490","v":"2.2.2.02.02.99.1."},{"$f":"BalanceComprobacion!C490","v":"Préstamos de otras Instituciones de Gobiernos Locales a pagar l/p - Capital"},{"$f":"BalanceComprobacion!D490","v":1522925878.21},{"$f":"BalanceComprobacion!E490","v":786838411.08000004},{"$f":"BalanceComprobacion!F490","v":298894682.06},{"$f":"BalanceComprobacion!G490","v":1034982149.1900001}]
[{"$f":"IFERROR(IF(B445<>0,Data!$B$2,\"\"),\"\")","v":"15603"},{"$f":"BalanceComprobacion!A491","v":3.1},{"$f":"BalanceComprobacion!B491","v":"2.2.2.02.02.99.1.14226"},{"$f":"BalanceComprobacion!C491","v":"Instituto de Fomento y Asesoría Municipal (IFAM) P Largo Plazo"},{"$f":"BalanceComprobacion!D491","v":1522925878.21},{"$f":"BalanceComprobacion!E491","v":786838411.08000004},{"$f":"BalanceComprobacion!F491","v":298894682.06},{"$f":"BalanceComprobacion!G491","v":1034982149.1900001}]
[{"$f":"IFERROR(IF(B446<>0,Data!$B$2,\"\"),\"\")","v":"15603"},{"$f":"BalanceComprobacion!A492","v":3.1},{"$f":"BalanceComprobacion!B492","v":"2.2.4."},{"$f":"BalanceComprobacion!C492","v":"Provisiones y reservas técnicas a largo plazo"},{"$f":"BalanceComprobacion!D492","v":23113230},{"$f":"BalanceComprobacion!E492","v":1083600},{"$f":"BalanceComprobacion!F492","v":17018370},{"$f":"BalanceComprobacion!G492","v":39048000}]
[{"$f":"IFERROR(IF(B447<>0,Data!$B$2,\"\"),\"\")","v":"15603"},{"$f":"BalanceComprobacion!A493","v":3.1},{"$f":"BalanceComprobacion!B493","v":"2.2.4.01."},{"$f":"BalanceComprobacion!C493","v":"Provisiones a largo plazo"},{"$f":"BalanceComprobacion!D493","v":23113230},{"$f":"BalanceComprobacion!E493","v":1083600},{"$f":"BalanceComprobacion!F493","v":17018370},{"$f":"BalanceComprobacion!G493","v":39048000}]
[{"$f":"IFERROR(IF(B448<>0,Data!$B$2,\"\"),\"\")","v":"15603"},{"$f":"BalanceComprobacion!A494","v":3.1},{"$f":"BalanceComprobacion!B494","v":"2.2.4.01.03."},{"$f":"BalanceComprobacion!C494","v":"Provisiones para beneficios a los empleados l/p"},{"$f":"BalanceComprobacion!D494","v":23113230},{"$f":"BalanceComprobacion!E494","v":1083600},{"$f":"BalanceComprobacion!F494","v":17018370},{"$f":"BalanceComprobacion!G494","v":39048000}]
[{"$f":"IFERROR(IF(B449<>0,Data!$B$2,\"\"),\"\")","v":"15603"},{"$f":"BalanceComprobacion!A495","v":3.1},{"$f":"BalanceComprobacion!B495","v":"2.2.4.01.03.02."},{"$f":"BalanceComprobacion!C495","v":"Provisiones para beneficios por terminación l/p"},{"$f":"BalanceComprobacion!D495","v":23113230},{"$f":"BalanceComprobacion!E495","v":1083600},{"$f":"BalanceComprobacion!F495","v":17018370},{"$f":"BalanceComprobacion!G495","v":39048000}]
[{"$f":"IFERROR(IF(B450<>0,Data!$B$2,\"\"),\"\")","v":"15603"},{"$f":"BalanceComprobacion!A496","v":3.1},{"$f":"BalanceComprobacion!B496","v":"2.2.4.01.03.02.0."},{"$f":"BalanceComprobacion!C496","v":"Provisiones para beneficios por terminación l/p"},{"$f":"BalanceComprobacion!D496","v":23113230},{"$f":"BalanceComprobacion!E496","v":1083600},{"$f":"BalanceComprobacion!F496","v":17018370},{"$f":"BalanceComprobacion!G496","v":39048000}]
[{"$f":"IFERROR(IF(B451<>0,Data!$B$2,\"\"),\"\")","v":"15603"},{"$f":"BalanceComprobacion!A497","v":3.1},{"$f":"BalanceComprobacion!B497","v":"2.2.4.01.03.02.0.99999"},{"$f":"BalanceComprobacion!C497","v":"Provisiones para beneficios por terminación l/p"},{"$f":"BalanceComprobacion!D497","v":23113230},{"$f":"BalanceComprobacion!E497","v":1083600},{"$f":"BalanceComprobacion!F497","v":17018370},{"$f":"BalanceComprobacion!G497","v":39048000}]
[{"$f":"IFERROR(IF(B452<>0,Data!$B$2,\"\"),\"\")","v":"15603"},{"$f":"BalanceComprobacion!A498","v":3.1},{"$f":"BalanceComprobacion!B498","v":"3."},{"$f":"BalanceComprobacion!C498","v":"PATRIMONIO"},{"$f":"BalanceComprobacion!D498","v":164134319241.19},{"$f":"BalanceComprobacion!E498","v":4543402953.96},{"$f":"BalanceComprobacion!F498","v":4528583574.1499996},{"$f":"BalanceComprobacion!G498","v":164119499861.38}]
[{"$f":"IFERROR(IF(B453<>0,Data!$B$2,\"\"),\"\")","v":"15603"},{"$f":"BalanceComprobacion!A499","v":3.1},{"$f":"BalanceComprobacion!B499","v":"3.1."},{"$f":"BalanceComprobacion!C499","v":"Patrimonio público"},{"$f":"BalanceComprobacion!D499","v":164134319241.19},{"$f":"BalanceComprobacion!E499","v":4543402953.96},{"$f":"BalanceComprobacion!F499","v":4528583574.1499996},{"$f":"BalanceComprobacion!G499","v":164119499861.38}]
[{"$f":"IFERROR(IF(B454<>0,Data!$B$2,\"\"),\"\")","v":"15603"},{"$f":"BalanceComprobacion!A500","v":3.1},{"$f":"BalanceComprobacion!B500","v":"3.1.1."},{"$f":"BalanceComprobacion!C500","v":"Capital"},{"$f":"BalanceComprobacion!D500","v":524.79999999999995},{"$f":"BalanceComprobacion!E500","v":0},{"$f":"BalanceComprobacion!F500","v":0},{"$f":"BalanceComprobacion!G500","v":524.79999999999995}]
[{"$f":"IFERROR(IF(B455<>0,Data!$B$2,\"\"),\"\")","v":"15603"},{"$f":"BalanceComprobacion!A501","v":3.1},{"$f":"BalanceComprobacion!B501","v":"3.1.1.01."},{"$f":"BalanceComprobacion!C501","v":"Capital inicial"},{"$f":"BalanceComprobacion!D501","v":524.79999999999995},{"$f":"BalanceComprobacion!E501","v":0},{"$f":"BalanceComprobacion!F501","v":0},{"$f":"BalanceComprobacion!G501","v":524.79999999999995}]
[{"$f":"IFERROR(IF(B456<>0,Data!$B$2,\"\"),\"\")","v":"15603"},{"$f":"BalanceComprobacion!A502","v":3.1},{"$f":"BalanceComprobacion!B502","v":"3.1.1.01.01."},{"$f":"BalanceComprobacion!C502","v":"Capital inicial a valores históricos"},{"$f":"BalanceComprobacion!D502","v":524.79999999999995},{"$f":"BalanceComprobacion!E502","v":0},{"$f":"BalanceComprobacion!F502","v":0},{"$f":"BalanceComprobacion!G502","v":524.79999999999995}]
[{"$f":"IFERROR(IF(B457<>0,Data!$B$2,\"\"),\"\")","v":"15603"},{"$f":"BalanceComprobacion!A503","v":3.1},{"$f":"BalanceComprobacion!B503","v":"3.1.1.01.01.00."},{"$f":"BalanceComprobacion!C503","v":"Capital inicial a valores históricos"},{"$f":"BalanceComprobacion!D503","v":524.79999999999995},{"$f":"BalanceComprobacion!E503","v":0},{"$f":"BalanceComprobacion!F503","v":0},{"$f":"BalanceComprobacion!G503","v":524.79999999999995}]
[{"$f":"IFERROR(IF(B458<>0,Data!$B$2,\"\"),\"\")","v":"15603"},{"$f":"BalanceComprobacion!A504","v":3.1},{"$f":"BalanceComprobacion!B504","v":"3.1.1.01.01.00.0."},{"$f":"BalanceComprobacion!C504","v":"Capital inicial a valores históricos"},{"$f":"BalanceComprobacion!D504","v":524.79999999999995},{"$f":"BalanceComprobacion!E504","v":0},{"$f":"BalanceComprobacion!F504","v":0},{"$f":"BalanceComprobacion!G504","v":524.79999999999995}]
[{"$f":"IFERROR(IF(B459<>0,Data!$B$2,\"\"),\"\")","v":"15603"},{"$f":"BalanceComprobacion!A505","v":3.1},{"$f":"BalanceComprobacion!B505","v":"3.1.1.01.01.00.0.99999"},{"$f":"BalanceComprobacion!C505","v":"Capital inicial a valores históricos"},{"$f":"BalanceComprobacion!D505","v":524.79999999999995},{"$f":"BalanceComprobacion!E505","v":0},{"$f":"BalanceComprobacion!F505","v":0},{"$f":"BalanceComprobacion!G505","v":524.79999999999995}]
[{"$f":"IFERROR(IF(B460<>0,Data!$B$2,\"\"),\"\")","v":"15603"},{"$f":"BalanceComprobacion!A506","v":3.1},{"$f":"BalanceComprobacion!B506","v":"3.1.4."},{"$f":"BalanceComprobacion!C506","v":"Variaciones no asignables a reservas"},{"$f":"BalanceComprobacion!D506","v":0},{"$f":"BalanceComprobacion!E506","v":4365184120.7299995},{"$f":"BalanceComprobacion!F506","v":4365184120.7299995},{"$f":"BalanceComprobacion!G506","v":0}]
[{"$f":"IFERROR(IF(B461<>0,Data!$B$2,\"\"),\"\")","v":"15603"},{"$f":"BalanceComprobacion!A507","v":3.1},{"$f":"BalanceComprobacion!B507","v":"3.1.4.99."},{"$f":"BalanceComprobacion!C507","v":"Otras variaciones no asignables a reservas"},{"$f":"BalanceComprobacion!D507","v":0},{"$f":"BalanceComprobacion!E507","v":4365184120.7299995},{"$f":"BalanceComprobacion!F507","v":4365184120.7299995},{"$f":"BalanceComprobacion!G507","v":0}]
[{"$f":"IFERROR(IF(B462<>0,Data!$B$2,\"\"),\"\")","v":"15603"},{"$f":"BalanceComprobacion!A508","v":3.1},{"$f":"BalanceComprobacion!B508","v":"3.1.4.99.99."},{"$f":"BalanceComprobacion!C508","v":"Otras variaciones no asignables a reservas varias"},{"$f":"BalanceComprobacion!D508","v":0},{"$f":"BalanceComprobacion!E508","v":4365184120.7299995},{"$f":"BalanceComprobacion!F508","v":4365184120.7299995},{"$f":"BalanceComprobacion!G508","v":0}]
[{"$f":"IFERROR(IF(B463<>0,Data!$B$2,\"\"),\"\")","v":"15603"},{"$f":"BalanceComprobacion!A509","v":3.1},{"$f":"BalanceComprobacion!B509","v":"3.1.4.99.99.00."},{"$f":"BalanceComprobacion!C509","v":"Otras variaciones no asignables a reservas varias"},{"$f":"BalanceComprobacion!D509","v":0},{"$f":"BalanceComprobacion!E509","v":4365184120.7299995},{"$f":"BalanceComprobacion!F509","v":4365184120.7299995},{"$f":"BalanceComprobacion!G509","v":0}]
[{"$f":"IFERROR(IF(B464<>0,Data!$B$2,\"\"),\"\")","v":"15603"},{"$f":"BalanceComprobacion!A510","v":3.1},{"$f":"BalanceComprobacion!B510","v":"3.1.4.99.99.00.0."},{"$f":"BalanceComprobacion!C510","v":"Otras variaciones no asignables a reservas varias"},{"$f":"BalanceComprobacion!D510","v":0},{"$f":"BalanceComprobacion!E510","v":4365184120.7299995},{"$f":"BalanceComprobacion!F510","v":4365184120.7299995},{"$f":"BalanceComprobacion!G510","v":0}]
[{"$f":"IFERROR(IF(B465<>0,Data!$B$2,\"\"),\"\")","v":"15603"},{"$f":"BalanceComprobacion!A511","v":3.1},{"$f":"BalanceComprobacion!B511","v":"3.1.4.99.99.00.0.99999"},{"$f":"BalanceComprobacion!C511","v":"Otras variaciones no asignables a reservas varias"},{"$f":"BalanceComprobacion!D511","v":0},{"$f":"BalanceComprobacion!E511","v":4365184120.7299995},{"$f":"BalanceComprobacion!F511","v":4365184120.7299995},{"$f":"BalanceComprobacion!G511","v":0}]
[{"$f":"IFERROR(IF(B466<>0,Data!$B$2,\"\"),\"\")","v":"15603"},{"$f":"BalanceComprobacion!A512","v":3.1},{"$f":"BalanceComprobacion!B512","v":"3.1.5."},{"$f":"BalanceComprobacion!C512","v":"Resultados acumulados"},{"$f":"BalanceComprobacion!D512","v":164134318716.39001},{"$f":"BalanceComprobacion!E512","v":178218833.22999999},{"$f":"BalanceComprobacion!F512","v":163399453.41999999},{"$f":"BalanceComprobacion!G512","v":164119499336.57999}]
[{"$f":"IFERROR(IF(B467<>0,Data!$B$2,\"\"),\"\")","v":"15603"},{"$f":"BalanceComprobacion!A513","v":3.1},{"$f":"BalanceComprobacion!B513","v":"3.1.5.01."},{"$f":"BalanceComprobacion!C513","v":"Resultados acumulados de ejercicios anteriores"},{"$f":"BalanceComprobacion!D513","v":164134318716.39001},{"$f":"BalanceComprobacion!E513","v":178218833.22999999},{"$f":"BalanceComprobacion!F513","v":163399453.41999999},{"$f":"BalanceComprobacion!G513","v":164119499336.57999}]
[{"$f":"IFERROR(IF(B468<>0,Data!$B$2,\"\"),\"\")","v":"15603"},{"$f":"BalanceComprobacion!A514","v":3.1},{"$f":"BalanceComprobacion!B514","v":"3.1.5.01.01."},{"$f":"BalanceComprobacion!C514","v":"Resultados de ejercicios anteriores"},{"$f":"BalanceComprobacion!D514","v":164283654503.60001},{"$f":"BalanceComprobacion!E514","v":178218833.22999999},{"$f":"BalanceComprobacion!F514","v":163399453.41999999},{"$f":"BalanceComprobacion!G514","v":164268835123.79001}]
[{"$f":"IFERROR(IF(B469<>0,Data!$B$2,\"\"),\"\")","v":"15603"},{"$f":"BalanceComprobacion!A515","v":3.1},{"$f":"BalanceComprobacion!B515","v":"3.1.5.01.01.00."},{"$f":"BalanceComprobacion!C515","v":"Resultados de ejercicios anteriores"},{"$f":"BalanceComprobacion!D515","v":164283654503.60001},{"$f":"BalanceComprobacion!E515","v":178218833.22999999},{"$f":"BalanceComprobacion!F515","v":163399453.41999999},{"$f":"BalanceComprobacion!G515","v":164268835123.79001}]
[{"$f":"IFERROR(IF(B470<>0,Data!$B$2,\"\"),\"\")","v":"15603"},{"$f":"BalanceComprobacion!A516","v":3.1},{"$f":"BalanceComprobacion!B516","v":"3.1.5.01.01.00.0."},{"$f":"BalanceComprobacion!C516","v":"Resultados de ejercicios anteriores"},{"$f":"BalanceComprobacion!D516","v":164283654503.60001},{"$f":"BalanceComprobacion!E516","v":178218833.22999999},{"$f":"BalanceComprobacion!F516","v":163399453.41999999},{"$f":"BalanceComprobacion!G516","v":164268835123.79001}]
[{"$f":"IFERROR(IF(B471<>0,Data!$B$2,\"\"),\"\")","v":"15603"},{"$f":"BalanceComprobacion!A517","v":3.1},{"$f":"BalanceComprobacion!B517","v":"3.1.5.01.01.00.0.99999"},{"$f":"BalanceComprobacion!C517","v":"Resultados de ejercicios anteriores"},{"$f":"BalanceComprobacion!D517","v":164283654503.60001},{"$f":"BalanceComprobacion!E517","v":178218833.22999999},{"$f":"BalanceComprobacion!F517","v":163399453.41999999},{"$f":"BalanceComprobacion!G517","v":164268835123.79001}]
[{"$f":"IFERROR(IF(B472<>0,Data!$B$2,\"\"),\"\")","v":"15603"},{"$f":"BalanceComprobacion!A518","v":3.1},{"$f":"BalanceComprobacion!B518","v":"3.1.5.01.02."},{"$f":"BalanceComprobacion!C518","v":"Ajuste de resultados de ejercicios anteriores"},{"$f":"BalanceComprobacion!D518","v":-149335787.21000001},{"$f":"BalanceComprobacion!E518","v":0},{"$f":"BalanceComprobacion!F518","v":0},{"$f":"BalanceComprobacion!G518","v":-149335787.21000001}]
[{"$f":"IFERROR(IF(B473<>0,Data!$B$2,\"\"),\"\")","v":"15603"},{"$f":"BalanceComprobacion!A519","v":3.1},{"$f":"BalanceComprobacion!B519","v":"3.1.5.01.02.06."},{"$f":"BalanceComprobacion!C519","v":"Ajuste de resultados acumulados"},{"$f":"BalanceComprobacion!D519","v":-149335787.21000001},{"$f":"BalanceComprobacion!E519","v":0},{"$f":"BalanceComprobacion!F519","v":0},{"$f":"BalanceComprobacion!G519","v":-149335787.21000001}]
[{"$f":"IFERROR(IF(B474<>0,Data!$B$2,\"\"),\"\")","v":"15603"},{"$f":"BalanceComprobacion!A520","v":3.1},{"$f":"BalanceComprobacion!B520","v":"3.1.5.01.02.06.1."},{"$f":"BalanceComprobacion!C520","v":"Ajuste por corrección de errores realizados retroactivamente"},{"$f":"BalanceComprobacion!D520","v":-149335787.21000001},{"$f":"BalanceComprobacion!E520","v":0},{"$f":"BalanceComprobacion!F520","v":0},{"$f":"BalanceComprobacion!G520","v":-149335787.21000001}]
[{"$f":"IFERROR(IF(B475<>0,Data!$B$2,\"\"),\"\")","v":"15603"},{"$f":"BalanceComprobacion!A521","v":3.1},{"$f":"BalanceComprobacion!B521","v":"3.1.5.01.02.06.1.99999"},{"$f":"BalanceComprobacion!C521","v":"Ajuste por corrección de errores realizados retroactivamente"},{"$f":"BalanceComprobacion!D521","v":-149335787.21000001},{"$f":"BalanceComprobacion!E521","v":0},{"$f":"BalanceComprobacion!F521","v":0},{"$f":"BalanceComprobacion!G521","v":-149335787.21000001}]
[{"$f":"IFERROR(IF(B476<>0,Data!$B$2,\"\"),\"\")","v":"15603"},{"$f":"BalanceComprobacion!A522","v":3.1},{"$f":"BalanceComprobacion!B522","v":"4."},{"$f":"BalanceComprobacion!C522","v":"INGRESOS"},{"$f":"BalanceComprobacion!D522","v":0},{"$f":"BalanceComprobacion!E522","v":5656978.1500000004},{"$f":"BalanceComprobacion!F522","v":4670690209.0799999},{"$f":"BalanceComprobacion!G522","v":4665033230.9300003}]
[{"$f":"IFERROR(IF(B477<>0,Data!$B$2,\"\"),\"\")","v":"15603"},{"$f":"BalanceComprobacion!A523","v":3.1},{"$f":"BalanceComprobacion!B523","v":"4.1."},{"$f":"BalanceComprobacion!C523","v":"Impuestos"},{"$f":"BalanceComprobacion!D523","v":0},{"$f":"BalanceComprobacion!E523","v":2194913.17},{"$f":"BalanceComprobacion!F523","v":514550648.17000002},{"$f":"BalanceComprobacion!G523","v":512355735}]
[{"$f":"IFERROR(IF(B478<>0,Data!$B$2,\"\"),\"\")","v":"15603"},{"$f":"BalanceComprobacion!A524","v":3.1},{"$f":"BalanceComprobacion!B524","v":"4.1.2."},{"$f":"BalanceComprobacion!C524","v":"Impuestos sobre la propiedad"},{"$f":"BalanceComprobacion!D524","v":0},{"$f":"BalanceComprobacion!E524","v":471780.17},{"$f":"BalanceComprobacion!F524","v":329029432.45999998},{"$f":"BalanceComprobacion!G524","v":328557652.29000002}]
[{"$f":"IFERROR(IF(B479<>0,Data!$B$2,\"\"),\"\")","v":"15603"},{"$f":"BalanceComprobacion!A525","v":3.1},{"$f":"BalanceComprobacion!B525","v":"4.1.2.01."},{"$f":"BalanceComprobacion!C525","v":"Impuesto sobre la propiedad de bienes inmuebles"},{"$f":"BalanceComprobacion!D525","v":0},{"$f":"BalanceComprobacion!E525","v":471780.17},{"$f":"BalanceComprobacion!F525","v":329029432.45999998},{"$f":"BalanceComprobacion!G525","v":328557652.29000002}]
[{"$f":"IFERROR(IF(B480<>0,Data!$B$2,\"\"),\"\")","v":"15603"},{"$f":"BalanceComprobacion!A526","v":3.1},{"$f":"BalanceComprobacion!B526","v":"4.1.2.01.01."},{"$f":"BalanceComprobacion!C526","v":"Impuesto sobre la propiedad de bienes inmuebles"},{"$f":"BalanceComprobacion!D526","v":0},{"$f":"BalanceComprobacion!E526","v":471780.17},{"$f":"BalanceComprobacion!F526","v":329029432.45999998},{"$f":"BalanceComprobacion!G526","v":328557652.29000002}]
[{"$f":"IFERROR(IF(B481<>0,Data!$B$2,\"\"),\"\")","v":"15603"},{"$f":"BalanceComprobacion!A527","v":3.1},{"$f":"BalanceComprobacion!B527","v":"4.1.2.01.01.00."},{"$f":"BalanceComprobacion!C527","v":"Impuesto sobre la propiedad de bienes inmuebles"},{"$f":"BalanceComprobacion!D527","v":0},{"$f":"BalanceComprobacion!E527","v":471780.17},{"$f":"BalanceComprobacion!F527","v":329029432.45999998},{"$f":"BalanceComprobacion!G527","v":328557652.29000002}]
[{"$f":"IFERROR(IF(B482<>0,Data!$B$2,\"\"),\"\")","v":"15603"},{"$f":"BalanceComprobacion!A528","v":3.1},{"$f":"BalanceComprobacion!B528","v":"4.1.2.01.01.00.0."},{"$f":"BalanceComprobacion!C528","v":"Impuesto sobre la propiedad de bienes inmuebles"},{"$f":"BalanceComprobacion!D528","v":0},{"$f":"BalanceComprobacion!E528","v":471780.17},{"$f":"BalanceComprobacion!F528","v":329029432.45999998},{"$f":"BalanceComprobacion!G528","v":328557652.29000002}]
[{"$f":"IFERROR(IF(B483<>0,Data!$B$2,\"\"),\"\")","v":"15603"},{"$f":"BalanceComprobacion!A529","v":3.1},{"$f":"BalanceComprobacion!B529","v":"4.1.2.01.01.00.0.99999"},{"$f":"BalanceComprobacion!C529","v":"Impuesto sobre la propiedad de bienes inmuebles"},{"$f":"BalanceComprobacion!D529","v":0},{"$f":"BalanceComprobacion!E529","v":471780.17},{"$f":"BalanceComprobacion!F529","v":329029432.45999998},{"$f":"BalanceComprobacion!G529","v":328557652.29000002}]
[{"$f":"IFERROR(IF(B484<>0,Data!$B$2,\"\"),\"\")","v":"15603"},{"$f":"BalanceComprobacion!A530","v":3.1},{"$f":"BalanceComprobacion!B530","v":"4.1.3."},{"$f":"BalanceComprobacion!C530","v":"Impuestos sobre bienes y servicios"},{"$f":"BalanceComprobacion!D530","v":0},{"$f":"BalanceComprobacion!E530","v":1723133},{"$f":"BalanceComprobacion!F530","v":185521215.71000001},{"$f":"BalanceComprobacion!G530","v":183798082.71000001}]
[{"$f":"IFERROR(IF(B485<>0,Data!$B$2,\"\"),\"\")","v":"15603"},{"$f":"BalanceComprobacion!A531","v":3.1},{"$f":"BalanceComprobacion!B531","v":"4.1.3.01."},{"$f":"BalanceComprobacion!C531","v":"Impuestos generales y selectivos sobre ventas y consumo"},{"$f":"BalanceComprobacion!D531","v":0},{"$f":"BalanceComprobacion!E531","v":1619138},{"$f":"BalanceComprobacion!F531","v":156872088.19999999},{"$f":"BalanceComprobacion!G531","v":155252950.19999999}]
[{"$f":"IFERROR(IF(B486<>0,Data!$B$2,\"\"),\"\")","v":"15603"},{"$f":"BalanceComprobacion!A532","v":3.1},{"$f":"BalanceComprobacion!B532","v":"4.1.3.01.01."},{"$f":"BalanceComprobacion!C532","v":"Impuesto general sobre las ventas de bienes y servicios"},{"$f":"BalanceComprobacion!D532","v":0},{"$f":"BalanceComprobacion!E532","v":1619138},{"$f":"BalanceComprobacion!F532","v":156872088.19999999},{"$f":"BalanceComprobacion!G532","v":155252950.19999999}]
[{"$f":"IFERROR(IF(B487<>0,Data!$B$2,\"\"),\"\")","v":"15603"},{"$f":"BalanceComprobacion!A533","v":3.1},{"$f":"BalanceComprobacion!B533","v":"4.1.3.01.01.01."},{"$f":"BalanceComprobacion!C533","v":"Impuesto general sobre las ventas de bienes y servicios internos"},{"$f":"BalanceComprobacion!D533","v":0},{"$f":"BalanceComprobacion!E533","v":1619138},{"$f":"BalanceComprobacion!F533","v":156872088.19999999},{"$f":"BalanceComprobacion!G533","v":155252950.19999999}]
[{"$f":"IFERROR(IF(B488<>0,Data!$B$2,\"\"),\"\")","v":"15603"},{"$f":"BalanceComprobacion!A534","v":3.1},{"$f":"BalanceComprobacion!B534","v":"4.1.3.01.01.01.1."},{"$f":"BalanceComprobacion!C534","v":"Impuesto general sobre las ventas de bienes y servicios internos"},{"$f":"BalanceComprobacion!D534","v":0},{"$f":"BalanceComprobacion!E534","v":1619138},{"$f":"BalanceComprobacion!F534","v":156872088.19999999},{"$f":"BalanceComprobacion!G534","v":155252950.19999999}]
[{"$f":"IFERROR(IF(B489<>0,Data!$B$2,\"\"),\"\")","v":"15603"},{"$f":"BalanceComprobacion!A535","v":3.1},{"$f":"BalanceComprobacion!B535","v":"4.1.3.01.01.01.1.99999"},{"$f":"BalanceComprobacion!C535","v":"Impuesto general sobre las ventas de bienes y servicios internos"},{"$f":"BalanceComprobacion!D535","v":0},{"$f":"BalanceComprobacion!E535","v":1619138},{"$f":"BalanceComprobacion!F535","v":156872088.19999999},{"$f":"BalanceComprobacion!G535","v":155252950.19999999}]
[{"$f":"IFERROR(IF(B490<>0,Data!$B$2,\"\"),\"\")","v":"15603"},{"$f":"BalanceComprobacion!A536","v":3.1},{"$f":"BalanceComprobacion!B536","v":"4.1.3.02."},{"$f":"BalanceComprobacion!C536","v":"Impuestos específicos sobre la producción y consumo de bienes y servicios"},{"$f":"BalanceComprobacion!D536","v":0},{"$f":"BalanceComprobacion!E536","v":103995},{"$f":"BalanceComprobacion!F536","v":25399127.510000002},{"$f":"BalanceComprobacion!G536","v":25295132.510000002}]
[{"$f":"IFERROR(IF(B491<>0,Data!$B$2,\"\"),\"\")","v":"15603"},{"$f":"BalanceComprobacion!A537","v":3.1},{"$f":"BalanceComprobacion!B537","v":"4.1.3.02.01."},{"$f":"BalanceComprobacion!C537","v":"Impuestos específicos sobre la producción y consumo de bienes"},{"$f":"BalanceComprobacion!D537","v":0},{"$f":"BalanceComprobacion!E537","v":0},{"$f":"BalanceComprobacion!F537","v":18806254.649999999},{"$f":"BalanceComprobacion!G537","v":18806254.649999999}]
[{"$f":"IFERROR(IF(B492<>0,Data!$B$2,\"\"),\"\")","v":"15603"},{"$f":"BalanceComprobacion!A538","v":3.1},{"$f":"BalanceComprobacion!B538","v":"4.1.3.02.01.02."},{"$f":"BalanceComprobacion!C538","v":"Impuestos específicos sobre la explotación de recursos naturales y minerales"},{"$f":"BalanceComprobacion!D538","v":0},{"$f":"BalanceComprobacion!E538","v":0},{"$f":"BalanceComprobacion!F538","v":1288265.56},{"$f":"BalanceComprobacion!G538","v":1288265.56}]
[{"$f":"IFERROR(IF(B493<>0,Data!$B$2,\"\"),\"\")","v":"15603"},{"$f":"BalanceComprobacion!A539","v":3.1},{"$f":"BalanceComprobacion!B539","v":"4.1.3.02.01.02.1."},{"$f":"BalanceComprobacion!C539","v":"Impuestos específicos sobre la explotación de recursos naturales y minerales"},{"$f":"BalanceComprobacion!D539","v":0},{"$f":"BalanceComprobacion!E539","v":0},{"$f":"BalanceComprobacion!F539","v":1288265.56},{"$f":"BalanceComprobacion!G539","v":1288265.56}]
[{"$f":"IFERROR(IF(B494<>0,Data!$B$2,\"\"),\"\")","v":"15603"},{"$f":"BalanceComprobacion!A540","v":3.1},{"$f":"BalanceComprobacion!B540","v":"4.1.3.02.01.02.1.99999"},{"$f":"BalanceComprobacion!C540","v":"Impuestos específicos sobre la explotación de recursos naturales y minerales"},{"$f":"BalanceComprobacion!D540","v":0},{"$f":"BalanceComprobacion!E540","v":0},{"$f":"BalanceComprobacion!F540","v":1288265.56},{"$f":"BalanceComprobacion!G540","v":1288265.56}]
[{"$f":"IFERROR(IF(B495<>0,Data!$B$2,\"\"),\"\")","v":"15603"},{"$f":"BalanceComprobacion!A541","v":3.1},{"$f":"BalanceComprobacion!B541","v":"4.1.3.02.01.05."},{"$f":"BalanceComprobacion!C541","v":"Impuestos específicos sobre la construcción"},{"$f":"BalanceComprobacion!D541","v":0},{"$f":"BalanceComprobacion!E541","v":0},{"$f":"BalanceComprobacion!F541","v":17517989.09},{"$f":"BalanceComprobacion!G541","v":17517989.09}]
[{"$f":"IFERROR(IF(B496<>0,Data!$B$2,\"\"),\"\")","v":"15603"},{"$f":"BalanceComprobacion!A542","v":3.1},{"$f":"BalanceComprobacion!B542","v":"4.1.3.02.01.05.1."},{"$f":"BalanceComprobacion!C542","v":"Impuestos específicos sobre la construcción"},{"$f":"BalanceComprobacion!D542","v":0},{"$f":"BalanceComprobacion!E542","v":0},{"$f":"BalanceComprobacion!F542","v":17517989.09},{"$f":"BalanceComprobacion!G542","v":17517989.09}]
[{"$f":"IFERROR(IF(B497<>0,Data!$B$2,\"\"),\"\")","v":"15603"},{"$f":"BalanceComprobacion!A543","v":3.1},{"$f":"BalanceComprobacion!B543","v":"4.1.3.02.01.05.1.99999"},{"$f":"BalanceComprobacion!C543","v":"Impuestos específicos sobre la construcción"},{"$f":"BalanceComprobacion!D543","v":0},{"$f":"BalanceComprobacion!E543","v":0},{"$f":"BalanceComprobacion!F543","v":17517989.09},{"$f":"BalanceComprobacion!G543","v":17517989.09}]
[{"$f":"IFERROR(IF(B498<>0,Data!$B$2,\"\"),\"\")","v":"15603"},{"$f":"BalanceComprobacion!A544","v":3.1},{"$f":"BalanceComprobacion!B544","v":"4.1.3.02.02."},{"$f":"BalanceComprobacion!C544","v":"Impuestos específicos sobre la producción y consumo de servicios"},{"$f":"BalanceComprobacion!D544","v":0},{"$f":"BalanceComprobacion!E544","v":103995},{"$f":"BalanceComprobacion!F544","v":6592872.8600000003},{"$f":"BalanceComprobacion!G544","v":6488877.8600000003}]
[{"$f":"IFERROR(IF(B499<>0,Data!$B$2,\"\"),\"\")","v":"15603"},{"$f":"BalanceComprobacion!A545","v":3.1},{"$f":"BalanceComprobacion!B545","v":"4.1.3.02.02.03."},{"$f":"BalanceComprobacion!C545","v":"Impuestos específicos a los servicios de diversión y esparcimiento"},{"$f":"BalanceComprobacion!D545","v":0},{"$f":"BalanceComprobacion!E545","v":0},{"$f":"BalanceComprobacion!F545","v":742500},{"$f":"BalanceComprobacion!G545","v":742500}]
[{"$f":"IFERROR(IF(B500<>0,Data!$B$2,\"\"),\"\")","v":"15603"},{"$f":"BalanceComprobacion!A546","v":3.1},{"$f":"BalanceComprobacion!B546","v":"4.1.3.02.02.03.1."},{"$f":"BalanceComprobacion!C546","v":"Impuestos específicos a los servicios de diversión y esparcimiento"},{"$f":"BalanceComprobacion!D546","v":0},{"$f":"BalanceComprobacion!E546","v":0},{"$f":"BalanceComprobacion!F546","v":742500},{"$f":"BalanceComprobacion!G546","v":742500}]
[{"$f":"IFERROR(IF(B501<>0,Data!$B$2,\"\"),\"\")","v":"15603"},{"$f":"BalanceComprobacion!A547","v":3.1},{"$f":"BalanceComprobacion!B547","v":"4.1.3.02.02.03.1.99999"},{"$f":"BalanceComprobacion!C547","v":"Impuestos específicos a los servicios de diversión y esparcimiento"},{"$f":"BalanceComprobacion!D547","v":0},{"$f":"BalanceComprobacion!E547","v":0},{"$f":"BalanceComprobacion!F547","v":742500},{"$f":"BalanceComprobacion!G547","v":742500}]
[{"$f":"IFERROR(IF(B502<>0,Data!$B$2,\"\"),\"\")","v":"15603"},{"$f":"BalanceComprobacion!A548","v":3.1},{"$f":"BalanceComprobacion!B548","v":"4.1.3.02.02.99."},{"$f":"BalanceComprobacion!C548","v":"Otros impuestos específicos sobre la producción y consumo de servicios"},{"$f":"BalanceComprobacion!D548","v":0},{"$f":"BalanceComprobacion!E548","v":103995},{"$f":"BalanceComprobacion!F548","v":5850372.8600000003},{"$f":"BalanceComprobacion!G548","v":5746377.8600000003}]
[{"$f":"IFERROR(IF(B503<>0,Data!$B$2,\"\"),\"\")","v":"15603"},{"$f":"BalanceComprobacion!A549","v":3.1},{"$f":"BalanceComprobacion!B549","v":"4.1.3.02.02.99.1."},{"$f":"BalanceComprobacion!C549","v":"Otros impuestos específicos sobre la producción y consumo de servicios"},{"$f":"BalanceComprobacion!D549","v":0},{"$f":"BalanceComprobacion!E549","v":103995},{"$f":"BalanceComprobacion!F549","v":5850372.8600000003},{"$f":"BalanceComprobacion!G549","v":5746377.8600000003}]
[{"$f":"IFERROR(IF(B504<>0,Data!$B$2,\"\"),\"\")","v":"15603"},{"$f":"BalanceComprobacion!A550","v":3.1},{"$f":"BalanceComprobacion!B550","v":"4.1.3.02.02.99.1.99999"},{"$f":"BalanceComprobacion!C550","v":"Otros impuestos específicos sobre la producción y consumo de servicios"},{"$f":"BalanceComprobacion!D550","v":0},{"$f":"BalanceComprobacion!E550","v":103995},{"$f":"BalanceComprobacion!F550","v":5850372.8600000003},{"$f":"BalanceComprobacion!G550","v":5746377.8600000003}]
[{"$f":"IFERROR(IF(B505<>0,Data!$B$2,\"\"),\"\")","v":"15603"},{"$f":"BalanceComprobacion!A551","v":3.1},{"$f":"BalanceComprobacion!B551","v":"4.1.3.99."},{"$f":"BalanceComprobacion!C551","v":"Otros impuestos sobre bienes y servicios"},{"$f":"BalanceComprobacion!D551","v":0},{"$f":"BalanceComprobacion!E551","v":0},{"$f":"BalanceComprobacion!F551","v":3250000},{"$f":"BalanceComprobacion!G551","v":3250000}]
[{"$f":"IFERROR(IF(B506<>0,Data!$B$2,\"\"),\"\")","v":"15603"},{"$f":"BalanceComprobacion!A552","v":3.1},{"$f":"BalanceComprobacion!B552","v":"4.1.3.99.01."},{"$f":"BalanceComprobacion!C552","v":"Licencias profesionales, comerciales y otros permisos"},{"$f":"BalanceComprobacion!D552","v":0},{"$f":"BalanceComprobacion!E552","v":0},{"$f":"BalanceComprobacion!F552","v":3250000},{"$f":"BalanceComprobacion!G552","v":3250000}]
[{"$f":"IFERROR(IF(B507<>0,Data!$B$2,\"\"),\"\")","v":"15603"},{"$f":"BalanceComprobacion!A553","v":3.1},{"$f":"BalanceComprobacion!B553","v":"4.1.3.99.01.02."},{"$f":"BalanceComprobacion!C553","v":"Multas por licencias profesionales, comerciales y otros permisos"},{"$f":"BalanceComprobacion!D553","v":0},{"$f":"BalanceComprobacion!E553","v":0},{"$f":"BalanceComprobacion!F553","v":3250000},{"$f":"BalanceComprobacion!G553","v":3250000}]
[{"$f":"IFERROR(IF(B508<>0,Data!$B$2,\"\"),\"\")","v":"15603"},{"$f":"BalanceComprobacion!A554","v":3.1},{"$f":"BalanceComprobacion!B554","v":"4.1.3.99.01.02.0."},{"$f":"BalanceComprobacion!C554","v":"Multas por licencias profesionales, comerciales y otros permisos"},{"$f":"BalanceComprobacion!D554","v":0},{"$f":"BalanceComprobacion!E554","v":0},{"$f":"BalanceComprobacion!F554","v":3250000},{"$f":"BalanceComprobacion!G554","v":3250000}]
[{"$f":"IFERROR(IF(B509<>0,Data!$B$2,\"\"),\"\")","v":"15603"},{"$f":"BalanceComprobacion!A555","v":3.1},{"$f":"BalanceComprobacion!B555","v":"4.1.3.99.01.02.0.99999"},{"$f":"BalanceComprobacion!C555","v":"Multas por licencias profesionales, comerciales y otros permisos"},{"$f":"BalanceComprobacion!D555","v":0},{"$f":"BalanceComprobacion!E555","v":0},{"$f":"BalanceComprobacion!F555","v":3250000},{"$f":"BalanceComprobacion!G555","v":3250000}]
[{"$f":"IFERROR(IF(B510<>0,Data!$B$2,\"\"),\"\")","v":"15603"},{"$f":"BalanceComprobacion!A556","v":3.1},{"$f":"BalanceComprobacion!B556","v":"4.4."},{"$f":"BalanceComprobacion!C556","v":"Ingresos y resultados positivos por ventas"},{"$f":"BalanceComprobacion!D556","v":0},{"$f":"BalanceComprobacion!E556","v":3462064.98},{"$f":"BalanceComprobacion!F556","v":344801337.18000001},{"$f":"BalanceComprobacion!G556","v":341339272.19999999}]
[{"$f":"IFERROR(IF(B511<>0,Data!$B$2,\"\"),\"\")","v":"15603"},{"$f":"BalanceComprobacion!A557","v":3.1},{"$f":"BalanceComprobacion!B557","v":"4.4.1."},{"$f":"BalanceComprobacion!C557","v":"Ventas de bienes y servicios"},{"$f":"BalanceComprobacion!D557","v":0},{"$f":"BalanceComprobacion!E557","v":3462064.98},{"$f":"BalanceComprobacion!F557","v":344472403.85000002},{"$f":"BalanceComprobacion!G557","v":341010338.87}]
[{"$f":"IFERROR(IF(B512<>0,Data!$B$2,\"\"),\"\")","v":"15603"},{"$f":"BalanceComprobacion!A558","v":3.1},{"$f":"BalanceComprobacion!B558","v":"4.4.1.02."},{"$f":"BalanceComprobacion!C558","v":"Ventas de servicios"},{"$f":"BalanceComprobacion!D558","v":0},{"$f":"BalanceComprobacion!E558","v":3462064.98},{"$f":"BalanceComprobacion!F558","v":344472403.85000002},{"$f":"BalanceComprobacion!G558","v":341010338.87}]
[{"$f":"IFERROR(IF(B513<>0,Data!$B$2,\"\"),\"\")","v":"15603"},{"$f":"BalanceComprobacion!A559","v":3.1},{"$f":"BalanceComprobacion!B559","v":"4.4.1.02.04."},{"$f":"BalanceComprobacion!C559","v":"Servicios comunitarios"},{"$f":"BalanceComprobacion!D559","v":0},{"$f":"BalanceComprobacion!E559","v":3462064.98},{"$f":"BalanceComprobacion!F559","v":314007104.98000002},{"$f":"BalanceComprobacion!G559","v":310545040}]
[{"$f":"IFERROR(IF(B514<>0,Data!$B$2,\"\"),\"\")","v":"15603"},{"$f":"BalanceComprobacion!A560","v":3.1},{"$f":"BalanceComprobacion!B560","v":"4.4.1.02.04.03."},{"$f":"BalanceComprobacion!C560","v":"Servicios de cementerio"},{"$f":"BalanceComprobacion!D560","v":0},{"$f":"BalanceComprobacion!E560","v":67400},{"$f":"BalanceComprobacion!F560","v":18259328.329999998},{"$f":"BalanceComprobacion!G560","v":18191928.329999998}]
[{"$f":"IFERROR(IF(B515<>0,Data!$B$2,\"\"),\"\")","v":"15603"},{"$f":"BalanceComprobacion!A561","v":3.1},{"$f":"BalanceComprobacion!B561","v":"4.4.1.02.04.03.0."},{"$f":"BalanceComprobacion!C561","v":"Servicios de cementerio"},{"$f":"BalanceComprobacion!D561","v":0},{"$f":"BalanceComprobacion!E561","v":67400},{"$f":"BalanceComprobacion!F561","v":18259328.329999998},{"$f":"BalanceComprobacion!G561","v":18191928.329999998}]
[{"$f":"IFERROR(IF(B516<>0,Data!$B$2,\"\"),\"\")","v":"15603"},{"$f":"BalanceComprobacion!A562","v":3.1},{"$f":"BalanceComprobacion!B562","v":"4.4.1.02.04.03.0.99999"},{"$f":"BalanceComprobacion!C562","v":"Servicios de cementerio"},{"$f":"BalanceComprobacion!D562","v":0},{"$f":"BalanceComprobacion!E562","v":67400},{"$f":"BalanceComprobacion!F562","v":18259328.329999998},{"$f":"BalanceComprobacion!G562","v":18191928.329999998}]
[{"$f":"IFERROR(IF(B517<>0,Data!$B$2,\"\"),\"\")","v":"15603"},{"$f":"BalanceComprobacion!A563","v":3.1},{"$f":"BalanceComprobacion!B563","v":"4.4.1.02.04.04."},{"$f":"BalanceComprobacion!C563","v":"Servicios de saneamiento ambiental"},{"$f":"BalanceComprobacion!D563","v":0},{"$f":"BalanceComprobacion!E563","v":3394664.98},{"$f":"BalanceComprobacion!F563","v":295747776.64999998},{"$f":"BalanceComprobacion!G563","v":292353111.67000002}]
[{"$f":"IFERROR(IF(B518<>0,Data!$B$2,\"\"),\"\")","v":"15603"},{"$f":"BalanceComprobacion!A564","v":3.1},{"$f":"BalanceComprobacion!B564","v":"4.4.1.02.04.04.0."},{"$f":"BalanceComprobacion!C564","v":"Servicios de saneamiento ambiental"},{"$f":"BalanceComprobacion!D564","v":0},{"$f":"BalanceComprobacion!E564","v":3394664.98},{"$f":"BalanceComprobacion!F564","v":295747776.64999998},{"$f":"BalanceComprobacion!G564","v":292353111.67000002}]
[{"$f":"IFERROR(IF(B519<>0,Data!$B$2,\"\"),\"\")","v":"15603"},{"$f":"BalanceComprobacion!A565","v":3.1},{"$f":"BalanceComprobacion!B565","v":"4.4.1.02.04.04.0.99999"},{"$f":"BalanceComprobacion!C565","v":"Servicios de saneamiento ambiental"},{"$f":"BalanceComprobacion!D565","v":0},{"$f":"BalanceComprobacion!E565","v":3394664.98},{"$f":"BalanceComprobacion!F565","v":295747776.64999998},{"$f":"BalanceComprobacion!G565","v":292353111.67000002}]
[{"$f":"IFERROR(IF(B520<>0,Data!$B$2,\"\"),\"\")","v":"15603"},{"$f":"BalanceComprobacion!A566","v":3.1},{"$f":"BalanceComprobacion!B566","v":"4.4.1.02.99."},{"$f":"BalanceComprobacion!C566","v":"Otras ventas de servicios"},{"$f":"BalanceComprobacion!D566","v":0},{"$f":"BalanceComprobacion!E566","v":0},{"$f":"BalanceComprobacion!F566","v":30465298.870000001},{"$f":"BalanceComprobacion!G566","v":30465298.870000001}]
[{"$f":"IFERROR(IF(B521<>0,Data!$B$2,\"\"),\"\")","v":"15603"},{"$f":"BalanceComprobacion!A567","v":3.1},{"$f":"BalanceComprobacion!B567","v":"4.4.1.02.99.99."},{"$f":"BalanceComprobacion!C567","v":"Otras ventas de servicios varios"},{"$f":"BalanceComprobacion!D567","v":0},{"$f":"BalanceComprobacion!E567","v":0},{"$f":"BalanceComprobacion!F567","v":30465298.870000001},{"$f":"BalanceComprobacion!G567","v":30465298.870000001}]
[{"$f":"IFERROR(IF(B522<>0,Data!$B$2,\"\"),\"\")","v":"15603"},{"$f":"BalanceComprobacion!A568","v":3.1},{"$f":"BalanceComprobacion!B568","v":"4.4.1.02.99.99.0."},{"$f":"BalanceComprobacion!C568","v":"Otras ventas de servicios varios"},{"$f":"BalanceComprobacion!D568","v":0},{"$f":"BalanceComprobacion!E568","v":0},{"$f":"BalanceComprobacion!F568","v":30465298.870000001},{"$f":"BalanceComprobacion!G568","v":30465298.870000001}]
[{"$f":"IFERROR(IF(B523<>0,Data!$B$2,\"\"),\"\")","v":"15603"},{"$f":"BalanceComprobacion!A569","v":3.1},{"$f":"BalanceComprobacion!B569","v":"4.4.1.02.99.99.0.99999"},{"$f":"BalanceComprobacion!C569","v":"Otras ventas de servicios varios"},{"$f":"BalanceComprobacion!D569","v":0},{"$f":"BalanceComprobacion!E569","v":0},{"$f":"BalanceComprobacion!F569","v":30465298.870000001},{"$f":"BalanceComprobacion!G569","v":30465298.870000001}]
[{"$f":"IFERROR(IF(B524<>0,Data!$B$2,\"\"),\"\")","v":"15603"},{"$f":"BalanceComprobacion!A570","v":3.1},{"$f":"BalanceComprobacion!B570","v":"4.4.2."},{"$f":"BalanceComprobacion!C570","v":"Derechos administrativos"},{"$f":"BalanceComprobacion!D570","v":0},{"$f":"BalanceComprobacion!E570","v":0},{"$f":"BalanceComprobacion!F570","v":328933.33},{"$f":"BalanceComprobacion!G570","v":328933.33}]
[{"$f":"IFERROR(IF(B525<>0,Data!$B$2,\"\"),\"\")","v":"15603"},{"$f":"BalanceComprobacion!A571","v":3.1},{"$f":"BalanceComprobacion!B571","v":"4.4.2.01."},{"$f":"BalanceComprobacion!C571","v":"Derechos administrativos a los servicios de transporte"},{"$f":"BalanceComprobacion!D571","v":0},{"$f":"BalanceComprobacion!E571","v":0},{"$f":"BalanceComprobacion!F571","v":200000},{"$f":"BalanceComprobacion!G571","v":200000}]
[{"$f":"IFERROR(IF(B526<>0,Data!$B$2,\"\"),\"\")","v":"15603"},{"$f":"BalanceComprobacion!A572","v":3.1},{"$f":"BalanceComprobacion!B572","v":"4.4.2.01.01."},{"$f":"BalanceComprobacion!C572","v":"Derechos administrativos a los servicios de transporte por carretera"},{"$f":"BalanceComprobacion!D572","v":0},{"$f":"BalanceComprobacion!E572","v":0},{"$f":"BalanceComprobacion!F572","v":200000},{"$f":"BalanceComprobacion!G572","v":200000}]
[{"$f":"IFERROR(IF(B527<>0,Data!$B$2,\"\"),\"\")","v":"15603"},{"$f":"BalanceComprobacion!A573","v":3.1},{"$f":"BalanceComprobacion!B573","v":"4.4.2.01.01.00."},{"$f":"BalanceComprobacion!C573","v":"Derechos administrativos a los servicios de transporte por carretera"},{"$f":"BalanceComprobacion!D573","v":0},{"$f":"BalanceComprobacion!E573","v":0},{"$f":"BalanceComprobacion!F573","v":200000},{"$f":"BalanceComprobacion!G573","v":200000}]
[{"$f":"IFERROR(IF(B528<>0,Data!$B$2,\"\"),\"\")","v":"15603"},{"$f":"BalanceComprobacion!A574","v":3.1},{"$f":"BalanceComprobacion!B574","v":"4.4.2.01.01.00.0."},{"$f":"BalanceComprobacion!C574","v":"Derechos administrativos a los servicios de transporte por carretera"},{"$f":"BalanceComprobacion!D574","v":0},{"$f":"BalanceComprobacion!E574","v":0},{"$f":"BalanceComprobacion!F574","v":200000},{"$f":"BalanceComprobacion!G574","v":200000}]
[{"$f":"IFERROR(IF(B529<>0,Data!$B$2,\"\"),\"\")","v":"15603"},{"$f":"BalanceComprobacion!A575","v":3.1},{"$f":"BalanceComprobacion!B575","v":"4.4.2.01.01.00.0.99999"},{"$f":"BalanceComprobacion!C575","v":"Derechos administrativos a los servicios de transporte por carretera"},{"$f":"BalanceComprobacion!D575","v":0},{"$f":"BalanceComprobacion!E575","v":0},{"$f":"BalanceComprobacion!F575","v":200000},{"$f":"BalanceComprobacion!G575","v":200000}]
[{"$f":"IFERROR(IF(B530<>0,Data!$B$2,\"\"),\"\")","v":"15603"},{"$f":"BalanceComprobacion!A576","v":3.1},{"$f":"BalanceComprobacion!B576","v":"4.4.2.99."},{"$f":"BalanceComprobacion!C576","v":"Otros derechos administrativos"},{"$f":"BalanceComprobacion!D576","v":0},{"$f":"BalanceComprobacion!E576","v":0},{"$f":"BalanceComprobacion!F576","v":128933.33},{"$f":"BalanceComprobacion!G576","v":128933.33}]
[{"$f":"IFERROR(IF(B531<>0,Data!$B$2,\"\"),\"\")","v":"15603"},{"$f":"BalanceComprobacion!A577","v":3.1},{"$f":"BalanceComprobacion!B577","v":"4.4.2.99.99."},{"$f":"BalanceComprobacion!C577","v":"Otros derechos administrativos varios"},{"$f":"BalanceComprobacion!D577","v":0},{"$f":"BalanceComprobacion!E577","v":0},{"$f":"BalanceComprobacion!F577","v":128933.33},{"$f":"BalanceComprobacion!G577","v":128933.33}]
[{"$f":"IFERROR(IF(B532<>0,Data!$B$2,\"\"),\"\")","v":"15603"},{"$f":"BalanceComprobacion!A578","v":3.1},{"$f":"BalanceComprobacion!B578","v":"4.4.2.99.99.00."},{"$f":"BalanceComprobacion!C578","v":"Otros derechos administrativos varios"},{"$f":"BalanceComprobacion!D578","v":0},{"$f":"BalanceComprobacion!E578","v":0},{"$f":"BalanceComprobacion!F578","v":128933.33},{"$f":"BalanceComprobacion!G578","v":128933.33}]
[{"$f":"IFERROR(IF(B533<>0,Data!$B$2,\"\"),\"\")","v":"15603"},{"$f":"BalanceComprobacion!A579","v":3.1},{"$f":"BalanceComprobacion!B579","v":"4.4.2.99.99.00.0."},{"$f":"BalanceComprobacion!C579","v":"Otros derechos administrativos varios"},{"$f":"BalanceComprobacion!D579","v":0},{"$f":"BalanceComprobacion!E579","v":0},{"$f":"BalanceComprobacion!F579","v":128933.33},{"$f":"BalanceComprobacion!G579","v":128933.33}]
[{"$f":"IFERROR(IF(B534<>0,Data!$B$2,\"\"),\"\")","v":"15603"},{"$f":"BalanceComprobacion!A580","v":3.1},{"$f":"BalanceComprobacion!B580","v":"4.4.2.99.99.00.0.99999"},{"$f":"BalanceComprobacion!C580","v":"Otros derechos administrativos varios"},{"$f":"BalanceComprobacion!D580","v":0},{"$f":"BalanceComprobacion!E580","v":0},{"$f":"BalanceComprobacion!F580","v":128933.33},{"$f":"BalanceComprobacion!G580","v":128933.33}]
[{"$f":"IFERROR(IF(B535<>0,Data!$B$2,\"\"),\"\")","v":"15603"},{"$f":"BalanceComprobacion!A581","v":3.1},{"$f":"BalanceComprobacion!B581","v":"4.5."},{"$f":"BalanceComprobacion!C581","v":"Ingresos de la propiedad"},{"$f":"BalanceComprobacion!D581","v":0},{"$f":"BalanceComprobacion!E581","v":0},{"$f":"BalanceComprobacion!F581","v":27071573.91},{"$f":"BalanceComprobacion!G581","v":27071573.91}]
[{"$f":"IFERROR(IF(B536<>0,Data!$B$2,\"\"),\"\")","v":"15603"},{"$f":"BalanceComprobacion!A582","v":3.1},{"$f":"BalanceComprobacion!B582","v":"4.5.1."},{"$f":"BalanceComprobacion!C582","v":"Rentas de inversiones y de colocación de efectivo"},{"$f":"BalanceComprobacion!D582","v":0},{"$f":"BalanceComprobacion!E582","v":0},{"$f":"BalanceComprobacion!F582","v":9118183.0099999998},{"$f":"BalanceComprobacion!G582","v":9118183.0099999998}]
[{"$f":"IFERROR(IF(B537<>0,Data!$B$2,\"\"),\"\")","v":"15603"},{"$f":"BalanceComprobacion!A583","v":3.1},{"$f":"BalanceComprobacion!B583","v":"4.5.1.01."},{"$f":"BalanceComprobacion!C583","v":"Intereses por equivalentes de efectivo"},{"$f":"BalanceComprobacion!D583","v":0},{"$f":"BalanceComprobacion!E583","v":0},{"$f":"BalanceComprobacion!F583","v":1286412.2},{"$f":"BalanceComprobacion!G583","v":1286412.2}]
[{"$f":"IFERROR(IF(B538<>0,Data!$B$2,\"\"),\"\")","v":"15603"},{"$f":"BalanceComprobacion!A584","v":3.1},{"$f":"BalanceComprobacion!B584","v":"4.5.1.01.02."},{"$f":"BalanceComprobacion!C584","v":"Intereses por otros equivalentes de efectivo"},{"$f":"BalanceComprobacion!D584","v":0},{"$f":"BalanceComprobacion!E584","v":0},{"$f":"BalanceComprobacion!F584","v":1286412.2},{"$f":"BalanceComprobacion!G584","v":1286412.2}]
[{"$f":"IFERROR(IF(B539<>0,Data!$B$2,\"\"),\"\")","v":"15603"},{"$f":"BalanceComprobacion!A585","v":3.1},{"$f":"BalanceComprobacion!B585","v":"4.5.1.01.02.02."},{"$f":"BalanceComprobacion!C585","v":"Intereses por otros equivalentes de efectivo en el sector público interno"},{"$f":"BalanceComprobacion!D585","v":0},{"$f":"BalanceComprobacion!E585","v":0},{"$f":"BalanceComprobacion!F585","v":1286412.2},{"$f":"BalanceComprobacion!G585","v":1286412.2}]
[{"$f":"IFERROR(IF(B540<>0,Data!$B$2,\"\"),\"\")","v":"15603"},{"$f":"BalanceComprobacion!A586","v":3.1},{"$f":"BalanceComprobacion!B586","v":"4.5.1.01.02.02.0."},{"$f":"BalanceComprobacion!C586","v":"Intereses por otros equivalentes de efectivo en el sector público interno"},{"$f":"BalanceComprobacion!D586","v":0},{"$f":"BalanceComprobacion!E586","v":0},{"$f":"BalanceComprobacion!F586","v":1286412.2},{"$f":"BalanceComprobacion!G586","v":1286412.2}]
[{"$f":"IFERROR(IF(B541<>0,Data!$B$2,\"\"),\"\")","v":"15603"},{"$f":"BalanceComprobacion!A587","v":3.1},{"$f":"BalanceComprobacion!B587","v":"4.5.1.01.02.02.0.21101"},{"$f":"BalanceComprobacion!C587","v":"BANCO DE COSTA RICA (BCR)"},{"$f":"BalanceComprobacion!D587","v":0},{"$f":"BalanceComprobacion!E587","v":0},{"$f":"BalanceComprobacion!F587","v":23.31},{"$f":"BalanceComprobacion!G587","v":23.31}]
[{"$f":"IFERROR(IF(B542<>0,Data!$B$2,\"\"),\"\")","v":"15603"},{"$f":"BalanceComprobacion!A588","v":3.1},{"$f":"BalanceComprobacion!B588","v":"4.5.1.01.02.02.0.21103"},{"$f":"BalanceComprobacion!C588","v":"BANCO NACIONAL DE COSTA RICA (BNCR)"},{"$f":"BalanceComprobacion!D588","v":0},{"$f":"BalanceComprobacion!E588","v":0},{"$f":"BalanceComprobacion!F588","v":1286388.8899999999},{"$f":"BalanceComprobacion!G588","v":1286388.8899999999}]
[{"$f":"IFERROR(IF(B543<>0,Data!$B$2,\"\"),\"\")","v":"15603"},{"$f":"BalanceComprobacion!A589","v":3.1},{"$f":"BalanceComprobacion!B589","v":"4.5.1.98."},{"$f":"BalanceComprobacion!C589","v":"Resultados positivos de otras inversiones"},{"$f":"BalanceComprobacion!D589","v":0},{"$f":"BalanceComprobacion!E589","v":0},{"$f":"BalanceComprobacion!F589","v":7831770.8099999996},{"$f":"BalanceComprobacion!G589","v":7831770.8099999996}]
[{"$f":"IFERROR(IF(B544<>0,Data!$B$2,\"\"),\"\")","v":"15603"},{"$f":"BalanceComprobacion!A590","v":3.1},{"$f":"BalanceComprobacion!B590","v":"4.5.1.98.99."},{"$f":"BalanceComprobacion!C590","v":"Intereses por inversiones varias"},{"$f":"BalanceComprobacion!D590","v":0},{"$f":"BalanceComprobacion!E590","v":0},{"$f":"BalanceComprobacion!F590","v":7831770.8099999996},{"$f":"BalanceComprobacion!G590","v":7831770.8099999996}]
[{"$f":"IFERROR(IF(B545<>0,Data!$B$2,\"\"),\"\")","v":"15603"},{"$f":"BalanceComprobacion!A591","v":3.1},{"$f":"BalanceComprobacion!B591","v":"4.5.1.98.99.02."},{"$f":"BalanceComprobacion!C591","v":"Intereses por inversiones varias en el sector público interno"},{"$f":"BalanceComprobacion!D591","v":0},{"$f":"BalanceComprobacion!E591","v":0},{"$f":"BalanceComprobacion!F591","v":7831770.8099999996},{"$f":"BalanceComprobacion!G591","v":7831770.8099999996}]
[{"$f":"IFERROR(IF(B546<>0,Data!$B$2,\"\"),\"\")","v":"15603"},{"$f":"BalanceComprobacion!A592","v":3.1},{"$f":"BalanceComprobacion!B592","v":"4.5.1.98.99.02.0."},{"$f":"BalanceComprobacion!C592","v":"Intereses por inversiones varias en el sector público interno"},{"$f":"BalanceComprobacion!D592","v":0},{"$f":"BalanceComprobacion!E592","v":0},{"$f":"BalanceComprobacion!F592","v":7831770.8099999996},{"$f":"BalanceComprobacion!G592","v":7831770.8099999996}]
[{"$f":"IFERROR(IF(B547<>0,Data!$B$2,\"\"),\"\")","v":"15603"},{"$f":"BalanceComprobacion!A593","v":3.1},{"$f":"BalanceComprobacion!B593","v":"4.5.1.98.99.02.0.99999"},{"$f":"BalanceComprobacion!C593","v":"Intereses por inversiones varias en el sector público interno"},{"$f":"BalanceComprobacion!D593","v":0},{"$f":"BalanceComprobacion!E593","v":0},{"$f":"BalanceComprobacion!F593","v":7831770.8099999996},{"$f":"BalanceComprobacion!G593","v":7831770.8099999996}]
[{"$f":"IFERROR(IF(B548<>0,Data!$B$2,\"\"),\"\")","v":"15603"},{"$f":"BalanceComprobacion!A594","v":3.1},{"$f":"BalanceComprobacion!B594","v":"4.5.2."},{"$f":"BalanceComprobacion!C594","v":"Alquileres y derechos sobre bienes"},{"$f":"BalanceComprobacion!D594","v":0},{"$f":"BalanceComprobacion!E594","v":0},{"$f":"BalanceComprobacion!F594","v":17953390.899999999},{"$f":"BalanceComprobacion!G594","v":17953390.899999999}]
[{"$f":"IFERROR(IF(B549<>0,Data!$B$2,\"\"),\"\")","v":"15603"},{"$f":"BalanceComprobacion!A595","v":3.1},{"$f":"BalanceComprobacion!B595","v":"4.5.2.01."},{"$f":"BalanceComprobacion!C595","v":"Alquileres"},{"$f":"BalanceComprobacion!D595","v":0},{"$f":"BalanceComprobacion!E595","v":0},{"$f":"BalanceComprobacion!F595","v":17953390.899999999},{"$f":"BalanceComprobacion!G595","v":17953390.899999999}]
[{"$f":"IFERROR(IF(B550<>0,Data!$B$2,\"\"),\"\")","v":"15603"},{"$f":"BalanceComprobacion!A596","v":3.1},{"$f":"BalanceComprobacion!B596","v":"4.5.2.01.02."},{"$f":"BalanceComprobacion!C596","v":"Alquileres de edificios"},{"$f":"BalanceComprobacion!D596","v":0},{"$f":"BalanceComprobacion!E596","v":0},{"$f":"BalanceComprobacion!F596","v":17953390.899999999},{"$f":"BalanceComprobacion!G596","v":17953390.899999999}]
[{"$f":"IFERROR(IF(B551<>0,Data!$B$2,\"\"),\"\")","v":"15603"},{"$f":"BalanceComprobacion!A597","v":3.1},{"$f":"BalanceComprobacion!B597","v":"4.5.2.01.02.00."},{"$f":"BalanceComprobacion!C597","v":"Alquileres de edificios"},{"$f":"BalanceComprobacion!D597","v":0},{"$f":"BalanceComprobacion!E597","v":0},{"$f":"BalanceComprobacion!F597","v":17953390.899999999},{"$f":"BalanceComprobacion!G597","v":17953390.899999999}]
[{"$f":"IFERROR(IF(B552<>0,Data!$B$2,\"\"),\"\")","v":"15603"},{"$f":"BalanceComprobacion!A598","v":3.1},{"$f":"BalanceComprobacion!B598","v":"4.5.2.01.02.00.0."},{"$f":"BalanceComprobacion!C598","v":"Alquileres de edificios"},{"$f":"BalanceComprobacion!D598","v":0},{"$f":"BalanceComprobacion!E598","v":0},{"$f":"BalanceComprobacion!F598","v":17953390.899999999},{"$f":"BalanceComprobacion!G598","v":17953390.899999999}]
[{"$f":"IFERROR(IF(B553<>0,Data!$B$2,\"\"),\"\")","v":"15603"},{"$f":"BalanceComprobacion!A599","v":3.1},{"$f":"BalanceComprobacion!B599","v":"4.5.2.01.02.00.0.99999"},{"$f":"BalanceComprobacion!C599","v":"Alquileres de edificios"},{"$f":"BalanceComprobacion!D599","v":0},{"$f":"BalanceComprobacion!E599","v":0},{"$f":"BalanceComprobacion!F599","v":17953390.899999999},{"$f":"BalanceComprobacion!G599","v":17953390.899999999}]
[{"$f":"IFERROR(IF(B554<>0,Data!$B$2,\"\"),\"\")","v":"15603"},{"$f":"BalanceComprobacion!A600","v":3.1},{"$f":"BalanceComprobacion!B600","v":"4.6."},{"$f":"BalanceComprobacion!C600","v":"Transferencias"},{"$f":"BalanceComprobacion!D600","v":0},{"$f":"BalanceComprobacion!E600","v":0},{"$f":"BalanceComprobacion!F600","v":3784139549.0700002},{"$f":"BalanceComprobacion!G600","v":3784139549.0700002}]
[{"$f":"IFERROR(IF(B555<>0,Data!$B$2,\"\"),\"\")","v":"15603"},{"$f":"BalanceComprobacion!A601","v":3.1},{"$f":"BalanceComprobacion!B601","v":"4.6.1."},{"$f":"BalanceComprobacion!C601","v":"Transferencias corrientes"},{"$f":"BalanceComprobacion!D601","v":0},{"$f":"BalanceComprobacion!E601","v":0},{"$f":"BalanceComprobacion!F601","v":11322830.07},{"$f":"BalanceComprobacion!G601","v":11322830.07}]
[{"$f":"IFERROR(IF(B556<>0,Data!$B$2,\"\"),\"\")","v":"15603"},{"$f":"BalanceComprobacion!A602","v":3.1},{"$f":"BalanceComprobacion!B602","v":"4.6.1.02."},{"$f":"BalanceComprobacion!C602","v":"Transferencias corrientes del sector público interno"},{"$f":"BalanceComprobacion!D602","v":0},{"$f":"BalanceComprobacion!E602","v":0},{"$f":"BalanceComprobacion!F602","v":11322830.07},{"$f":"BalanceComprobacion!G602","v":11322830.07}]
[{"$f":"IFERROR(IF(B557<>0,Data!$B$2,\"\"),\"\")","v":"15603"},{"$f":"BalanceComprobacion!A603","v":3.1},{"$f":"BalanceComprobacion!B603","v":"4.6.1.02.03."},{"$f":"BalanceComprobacion!C603","v":"Transferencias corrientes de Instituciones Descentralizadas no Empresariales"},{"$f":"BalanceComprobacion!D603","v":0},{"$f":"BalanceComprobacion!E603","v":0},{"$f":"BalanceComprobacion!F603","v":11322830.07},{"$f":"BalanceComprobacion!G603","v":11322830.07}]
[{"$f":"IFERROR(IF(B558<>0,Data!$B$2,\"\"),\"\")","v":"15603"},{"$f":"BalanceComprobacion!A604","v":3.1},{"$f":"BalanceComprobacion!B604","v":"4.6.1.02.03.06."},{"$f":"BalanceComprobacion!C604","v":"Transferencias corrientes de  Instituciones Descentralizadas no Empresariales"},{"$f":"BalanceComprobacion!D604","v":0},{"$f":"BalanceComprobacion!E604","v":0},{"$f":"BalanceComprobacion!F604","v":11322830.07},{"$f":"BalanceComprobacion!G604","v":11322830.07}]
[{"$f":"IFERROR(IF(B559<>0,Data!$B$2,\"\"),\"\")","v":"15603"},{"$f":"BalanceComprobacion!A605","v":3.1},{"$f":"BalanceComprobacion!B605","v":"4.6.1.02.03.06.0."},{"$f":"BalanceComprobacion!C605","v":"Transferencias corrientes de  Instituciones Descentralizadas no Empresariales"},{"$f":"BalanceComprobacion!D605","v":0},{"$f":"BalanceComprobacion!E605","v":0},{"$f":"BalanceComprobacion!F605","v":11322830.07},{"$f":"BalanceComprobacion!G605","v":11322830.07}]
[{"$f":"IFERROR(IF(B560<>0,Data!$B$2,\"\"),\"\")","v":"15603"},{"$f":"BalanceComprobacion!A606","v":3.1},{"$f":"BalanceComprobacion!B606","v":"4.6.1.02.03.06.0.14226"},{"$f":"BalanceComprobacion!C606","v":"Transferencias corrientes de  Instituciones Descentralizadas no Empresariales (Aporte IFAM Licores Nacionales y Ext)"},{"$f":"BalanceComprobacion!D606","v":0},{"$f":"BalanceComprobacion!E606","v":0},{"$f":"BalanceComprobacion!F606","v":11322830.07},{"$f":"BalanceComprobacion!G606","v":11322830.07}]
[{"$f":"IFERROR(IF(B561<>0,Data!$B$2,\"\"),\"\")","v":"15603"},{"$f":"BalanceComprobacion!A607","v":3.1},{"$f":"BalanceComprobacion!B607","v":"4.6.2."},{"$f":"BalanceComprobacion!C607","v":"Transferencias de capital"},{"$f":"BalanceComprobacion!D607","v":0},{"$f":"BalanceComprobacion!E607","v":0},{"$f":"BalanceComprobacion!F607","v":3772816719},{"$f":"BalanceComprobacion!G607","v":3772816719}]
[{"$f":"IFERROR(IF(B562<>0,Data!$B$2,\"\"),\"\")","v":"15603"},{"$f":"BalanceComprobacion!A608","v":3.1},{"$f":"BalanceComprobacion!B608","v":"4.6.2.02."},{"$f":"BalanceComprobacion!C608","v":"Transferencias de capital del sector público interno"},{"$f":"BalanceComprobacion!D608","v":0},{"$f":"BalanceComprobacion!E608","v":0},{"$f":"BalanceComprobacion!F608","v":3772816719},{"$f":"BalanceComprobacion!G608","v":3772816719}]
[{"$f":"IFERROR(IF(B563<>0,Data!$B$2,\"\"),\"\")","v":"15603"},{"$f":"BalanceComprobacion!A609","v":3.1},{"$f":"BalanceComprobacion!B609","v":"4.6.2.02.01."},{"$f":"BalanceComprobacion!C609","v":"Transferencias de capital del Gobierno Central"},{"$f":"BalanceComprobacion!D609","v":0},{"$f":"BalanceComprobacion!E609","v":0},{"$f":"BalanceComprobacion!F609","v":3772816719},{"$f":"BalanceComprobacion!G609","v":3772816719}]
[{"$f":"IFERROR(IF(B564<>0,Data!$B$2,\"\"),\"\")","v":"15603"},{"$f":"BalanceComprobacion!A610","v":3.1},{"$f":"BalanceComprobacion!B610","v":"4.6.2.02.01.06."},{"$f":"BalanceComprobacion!C610","v":"Transferencias de capital del Gobierno Central"},{"$f":"BalanceComprobacion!D610","v":0},{"$f":"BalanceComprobacion!E610","v":0},{"$f":"BalanceComprobacion!F610","v":3772816719},{"$f":"BalanceComprobacion!G610","v":3772816719}]
[{"$f":"IFERROR(IF(B565<>0,Data!$B$2,\"\"),\"\")","v":"15603"},{"$f":"BalanceComprobacion!A611","v":3.1},{"$f":"BalanceComprobacion!B611","v":"4.6.2.02.01.06.0."},{"$f":"BalanceComprobacion!C611","v":"Transferencias de capital del Gobierno Central"},{"$f":"BalanceComprobacion!D611","v":0},{"$f":"BalanceComprobacion!E611","v":0},{"$f":"BalanceComprobacion!F611","v":3772816719},{"$f":"BalanceComprobacion!G611","v":3772816719}]
[{"$f":"IFERROR(IF(B566<>0,Data!$B$2,\"\"),\"\")","v":"15603"},{"$f":"BalanceComprobacion!A612","v":3.1},{"$f":"BalanceComprobacion!B612","v":"4.6.2.02.01.06.0.11206"},{"$f":"BalanceComprobacion!C612","v":"Transferencias de capital del Gobierno Central"},{"$f":"BalanceComprobacion!D612","v":0},{"$f":"BalanceComprobacion!E612","v":0},{"$f":"BalanceComprobacion!F612","v":3772816719},{"$f":"BalanceComprobacion!G612","v":3772816719}]
[{"$f":"IFERROR(IF(B567<>0,Data!$B$2,\"\"),\"\")","v":"15603"},{"$f":"BalanceComprobacion!A613","v":3.1},{"$f":"BalanceComprobacion!B613","v":"4.9."},{"$f":"BalanceComprobacion!C613","v":"Otros ingresos"},{"$f":"BalanceComprobacion!D613","v":0},{"$f":"BalanceComprobacion!E613","v":0},{"$f":"BalanceComprobacion!F613","v":127100.75},{"$f":"BalanceComprobacion!G613","v":127100.75}]
[{"$f":"IFERROR(IF(B568<>0,Data!$B$2,\"\"),\"\")","v":"15603"},{"$f":"BalanceComprobacion!A614","v":3.1},{"$f":"BalanceComprobacion!B614","v":"4.9.9."},{"$f":"BalanceComprobacion!C614","v":"Otros ingresos y resultados positivos"},{"$f":"BalanceComprobacion!D614","v":0},{"$f":"BalanceComprobacion!E614","v":0},{"$f":"BalanceComprobacion!F614","v":127100.75},{"$f":"BalanceComprobacion!G614","v":127100.75}]
[{"$f":"IFERROR(IF(B569<>0,Data!$B$2,\"\"),\"\")","v":"15603"},{"$f":"BalanceComprobacion!A615","v":3.1},{"$f":"BalanceComprobacion!B615","v":"4.9.9.99."},{"$f":"BalanceComprobacion!C615","v":"Ingresos y resultados positivos varios"},{"$f":"BalanceComprobacion!D615","v":0},{"$f":"BalanceComprobacion!E615","v":0},{"$f":"BalanceComprobacion!F615","v":127100.75},{"$f":"BalanceComprobacion!G615","v":127100.75}]
[{"$f":"IFERROR(IF(B570<>0,Data!$B$2,\"\"),\"\")","v":"15603"},{"$f":"BalanceComprobacion!A616","v":3.1},{"$f":"BalanceComprobacion!B616","v":"4.9.9.99.99."},{"$f":"BalanceComprobacion!C616","v":"Otros resultados positivos"},{"$f":"BalanceComprobacion!D616","v":0},{"$f":"BalanceComprobacion!E616","v":0},{"$f":"BalanceComprobacion!F616","v":127100.75},{"$f":"BalanceComprobacion!G616","v":127100.75}]
[{"$f":"IFERROR(IF(B571<>0,Data!$B$2,\"\"),\"\")","v":"15603"},{"$f":"BalanceComprobacion!A617","v":3.1},{"$f":"BalanceComprobacion!B617","v":"4.9.9.99.99.00."},{"$f":"BalanceComprobacion!C617","v":"Otros resultados positivos"},{"$f":"BalanceComprobacion!D617","v":0},{"$f":"BalanceComprobacion!E617","v":0},{"$f":"BalanceComprobacion!F617","v":127100.75},{"$f":"BalanceComprobacion!G617","v":127100.75}]
[{"$f":"IFERROR(IF(B572<>0,Data!$B$2,\"\"),\"\")","v":"15603"},{"$f":"BalanceComprobacion!A618","v":3.1},{"$f":"BalanceComprobacion!B618","v":"4.9.9.99.99.00.0."},{"$f":"BalanceComprobacion!C618","v":"Otros resultados positivos"},{"$f":"BalanceComprobacion!D618","v":0},{"$f":"BalanceComprobacion!E618","v":0},{"$f":"BalanceComprobacion!F618","v":127100.75},{"$f":"BalanceComprobacion!G618","v":127100.75}]
[{"$f":"IFERROR(IF(B573<>0,Data!$B$2,\"\"),\"\")","v":"15603"},{"$f":"BalanceComprobacion!A619","v":3.1},{"$f":"BalanceComprobacion!B619","v":"4.9.9.99.99.00.0.99999"},{"$f":"BalanceComprobacion!C619","v":"Otros resultados positivos"},{"$f":"BalanceComprobacion!D619","v":0},{"$f":"BalanceComprobacion!E619","v":0},{"$f":"BalanceComprobacion!F619","v":127100.75},{"$f":"BalanceComprobacion!G619","v":127100.75}]
[{"$f":"IFERROR(IF(B574<>0,Data!$B$2,\"\"),\"\")","v":"15603"},{"$f":"BalanceComprobacion!A620","v":3.1},{"$f":"BalanceComprobacion!B620","v":"5."},{"$f":"BalanceComprobacion!C620","v":"GASTOS"},{"$f":"BalanceComprobacion!D620","v":0},{"$f":"BalanceComprobacion!E620","v":2243425511.6199999},{"$f":"BalanceComprobacion!F620","v":28074608.780000001},{"$f":"BalanceComprobacion!G620","v":2215350902.8400002}]
[{"$f":"IFERROR(IF(B575<>0,Data!$B$2,\"\"),\"\")","v":"15603"},{"$f":"BalanceComprobacion!A621","v":3.1},{"$f":"BalanceComprobacion!B621","v":"5.1."},{"$f":"BalanceComprobacion!C621","v":"Gastos de funcionamiento"},{"$f":"BalanceComprobacion!D621","v":0},{"$f":"BalanceComprobacion!E621","v":2082254655.3599999},{"$f":"BalanceComprobacion!F621","v":25485924.210000001},{"$f":"BalanceComprobacion!G621","v":2056768731.1500001}]
[{"$f":"IFERROR(IF(B576<>0,Data!$B$2,\"\"),\"\")","v":"15603"},{"$f":"BalanceComprobacion!A622","v":3.1},{"$f":"BalanceComprobacion!B622","v":"5.1.1."},{"$f":"BalanceComprobacion!C622","v":"Gastos en personal"},{"$f":"BalanceComprobacion!D622","v":0},{"$f":"BalanceComprobacion!E622","v":608065984.32000005},{"$f":"BalanceComprobacion!F622","v":0},{"$f":"BalanceComprobacion!G622","v":608065984.32000005}]
[{"$f":"IFERROR(IF(B577<>0,Data!$B$2,\"\"),\"\")","v":"15603"},{"$f":"BalanceComprobacion!A623","v":3.1},{"$f":"BalanceComprobacion!B623","v":"5.1.1.01."},{"$f":"BalanceComprobacion!C623","v":"Remuneraciones Básicas"},{"$f":"BalanceComprobacion!D623","v":0},{"$f":"BalanceComprobacion!E623","v":310467059.41000003},{"$f":"BalanceComprobacion!F623","v":0},{"$f":"BalanceComprobacion!G623","v":310467059.41000003}]
[{"$f":"IFERROR(IF(B578<>0,Data!$B$2,\"\"),\"\")","v":"15603"},{"$f":"BalanceComprobacion!A624","v":3.1},{"$f":"BalanceComprobacion!B624","v":"5.1.1.01.01."},{"$f":"BalanceComprobacion!C624","v":"Sueldos para cargos fijos"},{"$f":"BalanceComprobacion!D624","v":0},{"$f":"BalanceComprobacion!E624","v":278377808.70999998},{"$f":"BalanceComprobacion!F624","v":0},{"$f":"BalanceComprobacion!G624","v":278377808.70999998}]
[{"$f":"IFERROR(IF(B579<>0,Data!$B$2,\"\"),\"\")","v":"15603"},{"$f":"BalanceComprobacion!A625","v":3.1},{"$f":"BalanceComprobacion!B625","v":"5.1.1.01.01.00."},{"$f":"BalanceComprobacion!C625","v":"Sueldos para cargos fijos"},{"$f":"BalanceComprobacion!D625","v":0},{"$f":"BalanceComprobacion!E625","v":278377808.70999998},{"$f":"BalanceComprobacion!F625","v":0},{"$f":"BalanceComprobacion!G625","v":278377808.70999998}]
[{"$f":"IFERROR(IF(B580<>0,Data!$B$2,\"\"),\"\")","v":"15603"},{"$f":"BalanceComprobacion!A626","v":3.1},{"$f":"BalanceComprobacion!B626","v":"5.1.1.01.01.00.0."},{"$f":"BalanceComprobacion!C626","v":"Sueldos para cargos fijos"},{"$f":"BalanceComprobacion!D626","v":0},{"$f":"BalanceComprobacion!E626","v":278377808.70999998},{"$f":"BalanceComprobacion!F626","v":0},{"$f":"BalanceComprobacion!G626","v":278377808.70999998}]
[{"$f":"IFERROR(IF(B581<>0,Data!$B$2,\"\"),\"\")","v":"15603"},{"$f":"BalanceComprobacion!A627","v":3.1},{"$f":"BalanceComprobacion!B627","v":"5.1.1.01.01.00.0.99999"},{"$f":"BalanceComprobacion!C627","v":"Sueldos para cargos fijos"},{"$f":"BalanceComprobacion!D627","v":0},{"$f":"BalanceComprobacion!E627","v":278377808.70999998},{"$f":"BalanceComprobacion!F627","v":0},{"$f":"BalanceComprobacion!G627","v":278377808.70999998}]
[{"$f":"IFERROR(IF(B582<>0,Data!$B$2,\"\"),\"\")","v":"15603"},{"$f":"BalanceComprobacion!A628","v":3.1},{"$f":"BalanceComprobacion!B628","v":"5.1.1.01.02."},{"$f":"BalanceComprobacion!C628","v":"Jornales"},{"$f":"BalanceComprobacion!D628","v":0},{"$f":"BalanceComprobacion!E628","v":15806093.32},{"$f":"BalanceComprobacion!F628","v":0},{"$f":"BalanceComprobacion!G628","v":15806093.32}]
[{"$f":"IFERROR(IF(B583<>0,Data!$B$2,\"\"),\"\")","v":"15603"},{"$f":"BalanceComprobacion!A629","v":3.1},{"$f":"BalanceComprobacion!B629","v":"5.1.1.01.02.00."},{"$f":"BalanceComprobacion!C629","v":"Jornales"},{"$f":"BalanceComprobacion!D629","v":0},{"$f":"BalanceComprobacion!E629","v":15806093.32},{"$f":"BalanceComprobacion!F629","v":0},{"$f":"BalanceComprobacion!G629","v":15806093.32}]
[{"$f":"IFERROR(IF(B584<>0,Data!$B$2,\"\"),\"\")","v":"15603"},{"$f":"BalanceComprobacion!A630","v":3.1},{"$f":"BalanceComprobacion!B630","v":"5.1.1.01.02.00.0."},{"$f":"BalanceComprobacion!C630","v":"Jornales"},{"$f":"BalanceComprobacion!D630","v":0},{"$f":"BalanceComprobacion!E630","v":15806093.32},{"$f":"BalanceComprobacion!F630","v":0},{"$f":"BalanceComprobacion!G630","v":15806093.32}]
[{"$f":"IFERROR(IF(B585<>0,Data!$B$2,\"\"),\"\")","v":"15603"},{"$f":"BalanceComprobacion!A631","v":3.1},{"$f":"BalanceComprobacion!B631","v":"5.1.1.01.02.00.0.99999"},{"$f":"BalanceComprobacion!C631","v":"Jornales"},{"$f":"BalanceComprobacion!D631","v":0},{"$f":"BalanceComprobacion!E631","v":15806093.32},{"$f":"BalanceComprobacion!F631","v":0},{"$f":"BalanceComprobacion!G631","v":15806093.32}]
[{"$f":"IFERROR(IF(B586<>0,Data!$B$2,\"\"),\"\")","v":"15603"},{"$f":"BalanceComprobacion!A632","v":3.1},{"$f":"BalanceComprobacion!B632","v":"5.1.1.01.03."},{"$f":"BalanceComprobacion!C632","v":"Servicios especiales"},{"$f":"BalanceComprobacion!D632","v":0},{"$f":"BalanceComprobacion!E632","v":9877550.0600000005},{"$f":"BalanceComprobacion!F632","v":0},{"$f":"BalanceComprobacion!G632","v":9877550.0600000005}]
[{"$f":"IFERROR(IF(B587<>0,Data!$B$2,\"\"),\"\")","v":"15603"},{"$f":"BalanceComprobacion!A633","v":3.1},{"$f":"BalanceComprobacion!B633","v":"5.1.1.01.03.00."},{"$f":"BalanceComprobacion!C633","v":"Servicios especiales"},{"$f":"BalanceComprobacion!D633","v":0},{"$f":"BalanceComprobacion!E633","v":9877550.0600000005},{"$f":"BalanceComprobacion!F633","v":0},{"$f":"BalanceComprobacion!G633","v":9877550.0600000005}]
[{"$f":"IFERROR(IF(B588<>0,Data!$B$2,\"\"),\"\")","v":"15603"},{"$f":"BalanceComprobacion!A634","v":3.1},{"$f":"BalanceComprobacion!B634","v":"5.1.1.01.03.00.0."},{"$f":"BalanceComprobacion!C634","v":"Servicios especiales"},{"$f":"BalanceComprobacion!D634","v":0},{"$f":"BalanceComprobacion!E634","v":9877550.0600000005},{"$f":"BalanceComprobacion!F634","v":0},{"$f":"BalanceComprobacion!G634","v":9877550.0600000005}]
[{"$f":"IFERROR(IF(B589<>0,Data!$B$2,\"\"),\"\")","v":"15603"},{"$f":"BalanceComprobacion!A635","v":3.1},{"$f":"BalanceComprobacion!B635","v":"5.1.1.01.03.00.0.99999"},{"$f":"BalanceComprobacion!C635","v":"Servicios especiales"},{"$f":"BalanceComprobacion!D635","v":0},{"$f":"BalanceComprobacion!E635","v":9877550.0600000005},{"$f":"BalanceComprobacion!F635","v":0},{"$f":"BalanceComprobacion!G635","v":9877550.0600000005}]
[{"$f":"IFERROR(IF(B590<>0,Data!$B$2,\"\"),\"\")","v":"15603"},{"$f":"BalanceComprobacion!A636","v":3.1},{"$f":"BalanceComprobacion!B636","v":"5.1.1.01.05."},{"$f":"BalanceComprobacion!C636","v":"Suplencias"},{"$f":"BalanceComprobacion!D636","v":0},{"$f":"BalanceComprobacion!E636","v":6405607.3200000003},{"$f":"BalanceComprobacion!F636","v":0},{"$f":"BalanceComprobacion!G636","v":6405607.3200000003}]
[{"$f":"IFERROR(IF(B591<>0,Data!$B$2,\"\"),\"\")","v":"15603"},{"$f":"BalanceComprobacion!A637","v":3.1},{"$f":"BalanceComprobacion!B637","v":"5.1.1.01.05.00."},{"$f":"BalanceComprobacion!C637","v":"Suplencias"},{"$f":"BalanceComprobacion!D637","v":0},{"$f":"BalanceComprobacion!E637","v":6405607.3200000003},{"$f":"BalanceComprobacion!F637","v":0},{"$f":"BalanceComprobacion!G637","v":6405607.3200000003}]
[{"$f":"IFERROR(IF(B592<>0,Data!$B$2,\"\"),\"\")","v":"15603"},{"$f":"BalanceComprobacion!A638","v":3.1},{"$f":"BalanceComprobacion!B638","v":"5.1.1.01.05.00.0."},{"$f":"BalanceComprobacion!C638","v":"Suplencias"},{"$f":"BalanceComprobacion!D638","v":0},{"$f":"BalanceComprobacion!E638","v":6405607.3200000003},{"$f":"BalanceComprobacion!F638","v":0},{"$f":"BalanceComprobacion!G638","v":6405607.3200000003}]
[{"$f":"IFERROR(IF(B593<>0,Data!$B$2,\"\"),\"\")","v":"15603"},{"$f":"BalanceComprobacion!A639","v":3.1},{"$f":"BalanceComprobacion!B639","v":"5.1.1.01.05.00.0.99999"},{"$f":"BalanceComprobacion!C639","v":"Suplencias"},{"$f":"BalanceComprobacion!D639","v":0},{"$f":"BalanceComprobacion!E639","v":6405607.3200000003},{"$f":"BalanceComprobacion!F639","v":0},{"$f":"BalanceComprobacion!G639","v":6405607.3200000003}]
[{"$f":"IFERROR(IF(B594<>0,Data!$B$2,\"\"),\"\")","v":"15603"},{"$f":"BalanceComprobacion!A640","v":3.1},{"$f":"BalanceComprobacion!B640","v":"5.1.1.02."},{"$f":"BalanceComprobacion!C640","v":"Remuneraciones eventuales"},{"$f":"BalanceComprobacion!D640","v":0},{"$f":"BalanceComprobacion!E640","v":43416426.93},{"$f":"BalanceComprobacion!F640","v":0},{"$f":"BalanceComprobacion!G640","v":43416426.93}]
[{"$f":"IFERROR(IF(B595<>0,Data!$B$2,\"\"),\"\")","v":"15603"},{"$f":"BalanceComprobacion!A641","v":3.1},{"$f":"BalanceComprobacion!B641","v":"5.1.1.02.01."},{"$f":"BalanceComprobacion!C641","v":"Tiempo extraordinario"},{"$f":"BalanceComprobacion!D641","v":0},{"$f":"BalanceComprobacion!E641","v":35183254.289999999},{"$f":"BalanceComprobacion!F641","v":0},{"$f":"BalanceComprobacion!G641","v":35183254.289999999}]
[{"$f":"IFERROR(IF(B596<>0,Data!$B$2,\"\"),\"\")","v":"15603"},{"$f":"BalanceComprobacion!A642","v":3.1},{"$f":"BalanceComprobacion!B642","v":"5.1.1.02.01.00."},{"$f":"BalanceComprobacion!C642","v":"Tiempo extraordinario"},{"$f":"BalanceComprobacion!D642","v":0},{"$f":"BalanceComprobacion!E642","v":35183254.289999999},{"$f":"BalanceComprobacion!F642","v":0},{"$f":"BalanceComprobacion!G642","v":35183254.289999999}]
[{"$f":"IFERROR(IF(B597<>0,Data!$B$2,\"\"),\"\")","v":"15603"},{"$f":"BalanceComprobacion!A643","v":3.1},{"$f":"BalanceComprobacion!B643","v":"5.1.1.02.01.00.0."},{"$f":"BalanceComprobacion!C643","v":"Tiempo extraordinario"},{"$f":"BalanceComprobacion!D643","v":0},{"$f":"BalanceComprobacion!E643","v":35183254.289999999},{"$f":"BalanceComprobacion!F643","v":0},{"$f":"BalanceComprobacion!G643","v":35183254.289999999}]
[{"$f":"IFERROR(IF(B598<>0,Data!$B$2,\"\"),\"\")","v":"15603"},{"$f":"BalanceComprobacion!A644","v":3.1},{"$f":"BalanceComprobacion!B644","v":"5.1.1.02.01.00.0.99999"},{"$f":"BalanceComprobacion!C644","v":"Tiempo extraordinario"},{"$f":"BalanceComprobacion!D644","v":0},{"$f":"BalanceComprobacion!E644","v":35183254.289999999},{"$f":"BalanceComprobacion!F644","v":0},{"$f":"BalanceComprobacion!G644","v":35183254.289999999}]
[{"$f":"IFERROR(IF(B599<>0,Data!$B$2,\"\"),\"\")","v":"15603"},{"$f":"BalanceComprobacion!A645","v":3.1},{"$f":"BalanceComprobacion!B645","v":"5.1.1.02.05."},{"$f":"BalanceComprobacion!C645","v":"Dietas"},{"$f":"BalanceComprobacion!D645","v":0},{"$f":"BalanceComprobacion!E645","v":8233172.6399999997},{"$f":"BalanceComprobacion!F645","v":0},{"$f":"BalanceComprobacion!G645","v":8233172.6399999997}]
[{"$f":"IFERROR(IF(B600<>0,Data!$B$2,\"\"),\"\")","v":"15603"},{"$f":"BalanceComprobacion!A646","v":3.1},{"$f":"BalanceComprobacion!B646","v":"5.1.1.02.05.00."},{"$f":"BalanceComprobacion!C646","v":"Dietas"},{"$f":"BalanceComprobacion!D646","v":0},{"$f":"BalanceComprobacion!E646","v":8233172.6399999997},{"$f":"BalanceComprobacion!F646","v":0},{"$f":"BalanceComprobacion!G646","v":8233172.6399999997}]
[{"$f":"IFERROR(IF(B601<>0,Data!$B$2,\"\"),\"\")","v":"15603"},{"$f":"BalanceComprobacion!A647","v":3.1},{"$f":"BalanceComprobacion!B647","v":"5.1.1.02.05.00.0."},{"$f":"BalanceComprobacion!C647","v":"Dietas"},{"$f":"BalanceComprobacion!D647","v":0},{"$f":"BalanceComprobacion!E647","v":8233172.6399999997},{"$f":"BalanceComprobacion!F647","v":0},{"$f":"BalanceComprobacion!G647","v":8233172.6399999997}]
[{"$f":"IFERROR(IF(B602<>0,Data!$B$2,\"\"),\"\")","v":"15603"},{"$f":"BalanceComprobacion!A648","v":3.1},{"$f":"BalanceComprobacion!B648","v":"5.1.1.02.05.00.0.99999"},{"$f":"BalanceComprobacion!C648","v":"Dietas"},{"$f":"BalanceComprobacion!D648","v":0},{"$f":"BalanceComprobacion!E648","v":8233172.6399999997},{"$f":"BalanceComprobacion!F648","v":0},{"$f":"BalanceComprobacion!G648","v":8233172.6399999997}]
[{"$f":"IFERROR(IF(B603<>0,Data!$B$2,\"\"),\"\")","v":"15603"},{"$f":"BalanceComprobacion!A649","v":3.1},{"$f":"BalanceComprobacion!B649","v":"5.1.1.03."},{"$f":"BalanceComprobacion!C649","v":"Incentivos salariales"},{"$f":"BalanceComprobacion!D649","v":0},{"$f":"BalanceComprobacion!E649","v":133731045.58},{"$f":"BalanceComprobacion!F649","v":0},{"$f":"BalanceComprobacion!G649","v":133731045.58}]
[{"$f":"IFERROR(IF(B604<>0,Data!$B$2,\"\"),\"\")","v":"15603"},{"$f":"BalanceComprobacion!A650","v":3.1},{"$f":"BalanceComprobacion!B650","v":"5.1.1.03.01."},{"$f":"BalanceComprobacion!C650","v":"Retribución por años servidos"},{"$f":"BalanceComprobacion!D650","v":0},{"$f":"BalanceComprobacion!E650","v":67814298.060000002},{"$f":"BalanceComprobacion!F650","v":0},{"$f":"BalanceComprobacion!G650","v":67814298.060000002}]
[{"$f":"IFERROR(IF(B605<>0,Data!$B$2,\"\"),\"\")","v":"15603"},{"$f":"BalanceComprobacion!A651","v":3.1},{"$f":"BalanceComprobacion!B651","v":"5.1.1.03.01.00."},{"$f":"BalanceComprobacion!C651","v":"Hora"},{"$f":"BalanceComprobacion!D651","v":0},{"$f":"BalanceComprobacion!E651","v":67814298.060000002},{"$f":"BalanceComprobacion!F651","v":0},{"$f":"BalanceComprobacion!G651","v":67814298.060000002}]
[{"$f":"IFERROR(IF(B606<>0,Data!$B$2,\"\"),\"\")","v":"15603"},{"$f":"BalanceComprobacion!A652","v":3.1},{"$f":"BalanceComprobacion!B652","v":"5.1.1.03.01.00.0."},{"$f":"BalanceComprobacion!C652","v":"Diario"},{"$f":"BalanceComprobacion!D652","v":0},{"$f":"BalanceComprobacion!E652","v":67814298.060000002},{"$f":"BalanceComprobacion!F652","v":0},{"$f":"BalanceComprobacion!G652","v":67814298.060000002}]
[{"$f":"IFERROR(IF(B607<>0,Data!$B$2,\"\"),\"\")","v":"15603"},{"$f":"BalanceComprobacion!A653","v":3.1},{"$f":"BalanceComprobacion!B653","v":"5.1.1.03.01.00.0.99999"},{"$f":"BalanceComprobacion!C653","v":"Semanal"},{"$f":"BalanceComprobacion!D653","v":0},{"$f":"BalanceComprobacion!E653","v":67814298.060000002},{"$f":"BalanceComprobacion!F653","v":0},{"$f":"BalanceComprobacion!G653","v":67814298.060000002}]
[{"$f":"IFERROR(IF(B608<>0,Data!$B$2,\"\"),\"\")","v":"15603"},{"$f":"BalanceComprobacion!A654","v":3.1},{"$f":"BalanceComprobacion!B654","v":"5.1.1.03.02."},{"$f":"BalanceComprobacion!C654","v":"Restricción al ejercicio liberal de la profesión"},{"$f":"BalanceComprobacion!D654","v":0},{"$f":"BalanceComprobacion!E654","v":29491888.640000001},{"$f":"BalanceComprobacion!F654","v":0},{"$f":"BalanceComprobacion!G654","v":29491888.640000001}]
[{"$f":"IFERROR(IF(B609<>0,Data!$B$2,\"\"),\"\")","v":"15603"},{"$f":"BalanceComprobacion!A655","v":3.1},{"$f":"BalanceComprobacion!B655","v":"5.1.1.03.02.01."},{"$f":"BalanceComprobacion!C655","v":"Dedicacion exclusiva"},{"$f":"BalanceComprobacion!D655","v":0},{"$f":"BalanceComprobacion!E655","v":29491888.640000001},{"$f":"BalanceComprobacion!F655","v":0},{"$f":"BalanceComprobacion!G655","v":29491888.640000001}]
[{"$f":"IFERROR(IF(B610<>0,Data!$B$2,\"\"),\"\")","v":"15603"},{"$f":"BalanceComprobacion!A656","v":3.1},{"$f":"BalanceComprobacion!B656","v":"5.1.1.03.02.01.0."},{"$f":"BalanceComprobacion!C656","v":"Dedicacion exclusiva"},{"$f":"BalanceComprobacion!D656","v":0},{"$f":"BalanceComprobacion!E656","v":29491888.640000001},{"$f":"BalanceComprobacion!F656","v":0},{"$f":"BalanceComprobacion!G656","v":29491888.640000001}]
[{"$f":"IFERROR(IF(B611<>0,Data!$B$2,\"\"),\"\")","v":"15603"},{"$f":"BalanceComprobacion!A657","v":3.1},{"$f":"BalanceComprobacion!B657","v":"5.1.1.03.02.01.0.99999"},{"$f":"BalanceComprobacion!C657","v":"Dedicacion exclusiva"},{"$f":"BalanceComprobacion!D657","v":0},{"$f":"BalanceComprobacion!E657","v":29491888.640000001},{"$f":"BalanceComprobacion!F657","v":0},{"$f":"BalanceComprobacion!G657","v":29491888.640000001}]
[{"$f":"IFERROR(IF(B612<>0,Data!$B$2,\"\"),\"\")","v":"15603"},{"$f":"BalanceComprobacion!A658","v":3.1},{"$f":"BalanceComprobacion!B658","v":"5.1.1.03.03."},{"$f":"BalanceComprobacion!C658","v":"Decimotercer mes"},{"$f":"BalanceComprobacion!D658","v":0},{"$f":"BalanceComprobacion!E658","v":36424858.880000003},{"$f":"BalanceComprobacion!F658","v":0},{"$f":"BalanceComprobacion!G658","v":36424858.880000003}]
[{"$f":"IFERROR(IF(B613<>0,Data!$B$2,\"\"),\"\")","v":"15603"},{"$f":"BalanceComprobacion!A659","v":3.1},{"$f":"BalanceComprobacion!B659","v":"5.1.1.03.03.00."},{"$f":"BalanceComprobacion!C659","v":"Bi-Semanal"},{"$f":"BalanceComprobacion!D659","v":0},{"$f":"BalanceComprobacion!E659","v":36424858.880000003},{"$f":"BalanceComprobacion!F659","v":0},{"$f":"BalanceComprobacion!G659","v":36424858.880000003}]
[{"$f":"IFERROR(IF(B614<>0,Data!$B$2,\"\"),\"\")","v":"15603"},{"$f":"BalanceComprobacion!A660","v":3.1},{"$f":"BalanceComprobacion!B660","v":"5.1.1.03.03.00.0."},{"$f":"BalanceComprobacion!C660","v":"Mensual"},{"$f":"BalanceComprobacion!D660","v":0},{"$f":"BalanceComprobacion!E660","v":36424858.880000003},{"$f":"BalanceComprobacion!F660","v":0},{"$f":"BalanceComprobacion!G660","v":36424858.880000003}]
[{"$f":"IFERROR(IF(B615<>0,Data!$B$2,\"\"),\"\")","v":"15603"},{"$f":"BalanceComprobacion!A661","v":3.1},{"$f":"BalanceComprobacion!B661","v":"5.1.1.03.03.00.0.99999"},{"$f":"BalanceComprobacion!C661","v":"Quincenal"},{"$f":"BalanceComprobacion!D661","v":0},{"$f":"BalanceComprobacion!E661","v":36424858.880000003},{"$f":"BalanceComprobacion!F661","v":0},{"$f":"BalanceComprobacion!G661","v":36424858.880000003}]
[{"$f":"IFERROR(IF(B616<>0,Data!$B$2,\"\"),\"\")","v":"15603"},{"$f":"BalanceComprobacion!A662","v":3.1},{"$f":"BalanceComprobacion!B662","v":"5.1.1.04."},{"$f":"BalanceComprobacion!C662","v":"Contribuciones patronales al desarrollo y la seguridad social"},{"$f":"BalanceComprobacion!D662","v":0},{"$f":"BalanceComprobacion!E662","v":100470286.04000001},{"$f":"BalanceComprobacion!F662","v":0},{"$f":"BalanceComprobacion!G662","v":100470286.04000001}]
[{"$f":"IFERROR(IF(B617<>0,Data!$B$2,\"\"),\"\")","v":"15603"},{"$f":"BalanceComprobacion!A663","v":3.1},{"$f":"BalanceComprobacion!B663","v":"5.1.1.04.01."},{"$f":"BalanceComprobacion!C663","v":"Contribución patronal al Seguro de Salud de la Caja Costarricense del Seguro Social"},{"$f":"BalanceComprobacion!D663","v":0},{"$f":"BalanceComprobacion!E663","v":100320951.54000001},{"$f":"BalanceComprobacion!F663","v":0},{"$f":"BalanceComprobacion!G663","v":100320951.54000001}]
[{"$f":"IFERROR(IF(B618<>0,Data!$B$2,\"\"),\"\")","v":"15603"},{"$f":"BalanceComprobacion!A664","v":3.1},{"$f":"BalanceComprobacion!B664","v":"5.1.1.04.01.00."},{"$f":"BalanceComprobacion!C664","v":"Contribución patronal al Seguro de Salud de la Caja Costarricense del Seguro Social"},{"$f":"BalanceComprobacion!D664","v":0},{"$f":"BalanceComprobacion!E664","v":100320951.54000001},{"$f":"BalanceComprobacion!F664","v":0},{"$f":"BalanceComprobacion!G664","v":100320951.54000001}]
[{"$f":"IFERROR(IF(B619<>0,Data!$B$2,\"\"),\"\")","v":"15603"},{"$f":"BalanceComprobacion!A665","v":3.1},{"$f":"BalanceComprobacion!B665","v":"5.1.1.04.01.00.0."},{"$f":"BalanceComprobacion!C665","v":"Contribución patronal al Seguro de Salud de la Caja Costarricense del Seguro Social"},{"$f":"BalanceComprobacion!D665","v":0},{"$f":"BalanceComprobacion!E665","v":100320951.54000001},{"$f":"BalanceComprobacion!F665","v":0},{"$f":"BalanceComprobacion!G665","v":100320951.54000001}]
[{"$f":"IFERROR(IF(B620<>0,Data!$B$2,\"\"),\"\")","v":"15603"},{"$f":"BalanceComprobacion!A666","v":3.1},{"$f":"BalanceComprobacion!B666","v":"5.1.1.04.01.00.0.14120"},{"$f":"BalanceComprobacion!C666","v":"Contribución Patronal al Seguro de Salud de la Caja"},{"$f":"BalanceComprobacion!D666","v":0},{"$f":"BalanceComprobacion!E666","v":100320951.54000001},{"$f":"BalanceComprobacion!F666","v":0},{"$f":"BalanceComprobacion!G666","v":100320951.54000001}]
[{"$f":"IFERROR(IF(B621<>0,Data!$B$2,\"\"),\"\")","v":"15603"},{"$f":"BalanceComprobacion!A667","v":3.1},{"$f":"BalanceComprobacion!B667","v":"5.1.1.04.05."},{"$f":"BalanceComprobacion!C667","v":"Contribución patronal al Banco popular y de Desarrollo Comunal"},{"$f":"BalanceComprobacion!D667","v":0},{"$f":"BalanceComprobacion!E667","v":149334.5},{"$f":"BalanceComprobacion!F667","v":0},{"$f":"BalanceComprobacion!G667","v":149334.5}]
[{"$f":"IFERROR(IF(B622<>0,Data!$B$2,\"\"),\"\")","v":"15603"},{"$f":"BalanceComprobacion!A668","v":3.1},{"$f":"BalanceComprobacion!B668","v":"5.1.1.04.05.00."},{"$f":"BalanceComprobacion!C668","v":"Contribución patronal al Banco popular y de Desarrollo Comunal"},{"$f":"BalanceComprobacion!D668","v":0},{"$f":"BalanceComprobacion!E668","v":149334.5},{"$f":"BalanceComprobacion!F668","v":0},{"$f":"BalanceComprobacion!G668","v":149334.5}]
[{"$f":"IFERROR(IF(B623<>0,Data!$B$2,\"\"),\"\")","v":"15603"},{"$f":"BalanceComprobacion!A669","v":3.1},{"$f":"BalanceComprobacion!B669","v":"5.1.1.04.05.00.0."},{"$f":"BalanceComprobacion!C669","v":"Contribución patronal al Banco popular y de Desarrollo Comunal"},{"$f":"BalanceComprobacion!D669","v":0},{"$f":"BalanceComprobacion!E669","v":149334.5},{"$f":"BalanceComprobacion!F669","v":0},{"$f":"BalanceComprobacion!G669","v":149334.5}]
[{"$f":"IFERROR(IF(B624<>0,Data!$B$2,\"\"),\"\")","v":"15603"},{"$f":"BalanceComprobacion!A670","v":3.1},{"$f":"BalanceComprobacion!B670","v":"5.1.1.04.05.00.0.31104"},{"$f":"BalanceComprobacion!C670","v":"Contribución Patronal al Banco Popular y de Desarrollo"},{"$f":"BalanceComprobacion!D670","v":0},{"$f":"BalanceComprobacion!E670","v":149334.5},{"$f":"BalanceComprobacion!F670","v":0},{"$f":"BalanceComprobacion!G670","v":149334.5}]
[{"$f":"IFERROR(IF(B625<>0,Data!$B$2,\"\"),\"\")","v":"15603"},{"$f":"BalanceComprobacion!A671","v":3.1},{"$f":"BalanceComprobacion!B671","v":"5.1.1.05."},{"$f":"BalanceComprobacion!C671","v":"Contribuciones patronales a fondos de pensiones y a otros fondos de capitalización"},{"$f":"BalanceComprobacion!D671","v":0},{"$f":"BalanceComprobacion!E671","v":2962796.36},{"$f":"BalanceComprobacion!F671","v":0},{"$f":"BalanceComprobacion!G671","v":2962796.36}]
[{"$f":"IFERROR(IF(B626<>0,Data!$B$2,\"\"),\"\")","v":"15603"},{"$f":"BalanceComprobacion!A672","v":3.1},{"$f":"BalanceComprobacion!B672","v":"5.1.1.05.01."},{"$f":"BalanceComprobacion!C672","v":"Contribución patronal al Seguro de Pensiones de la Caja Costarricense del Seguro Social"},{"$f":"BalanceComprobacion!D672","v":0},{"$f":"BalanceComprobacion!E672","v":1618785.93},{"$f":"BalanceComprobacion!F672","v":0},{"$f":"BalanceComprobacion!G672","v":1618785.93}]
[{"$f":"IFERROR(IF(B627<>0,Data!$B$2,\"\"),\"\")","v":"15603"},{"$f":"BalanceComprobacion!A673","v":3.1},{"$f":"BalanceComprobacion!B673","v":"5.1.1.05.01.00."},{"$f":"BalanceComprobacion!C673","v":"Contribución patronal al Seguro de Pensiones de la Caja Costarricense del Seguro Social"},{"$f":"BalanceComprobacion!D673","v":0},{"$f":"BalanceComprobacion!E673","v":1618785.93},{"$f":"BalanceComprobacion!F673","v":0},{"$f":"BalanceComprobacion!G673","v":1618785.93}]
[{"$f":"IFERROR(IF(B628<>0,Data!$B$2,\"\"),\"\")","v":"15603"},{"$f":"BalanceComprobacion!A674","v":3.1},{"$f":"BalanceComprobacion!B674","v":"5.1.1.05.01.00.0."},{"$f":"BalanceComprobacion!C674","v":"Contribución patronal al Seguro de Pensiones de la Caja Costarricense del Seguro Social"},{"$f":"BalanceComprobacion!D674","v":0},{"$f":"BalanceComprobacion!E674","v":1618785.93},{"$f":"BalanceComprobacion!F674","v":0},{"$f":"BalanceComprobacion!G674","v":1618785.93}]
[{"$f":"IFERROR(IF(B629<>0,Data!$B$2,\"\"),\"\")","v":"15603"},{"$f":"BalanceComprobacion!A675","v":3.1},{"$f":"BalanceComprobacion!B675","v":"5.1.1.05.01.00.0.14120"},{"$f":"BalanceComprobacion!C675","v":"Contribución Patronal al Seguro de Pensiones de la Caja"},{"$f":"BalanceComprobacion!D675","v":0},{"$f":"BalanceComprobacion!E675","v":1618785.93},{"$f":"BalanceComprobacion!F675","v":0},{"$f":"BalanceComprobacion!G675","v":1618785.93}]
[{"$f":"IFERROR(IF(B630<>0,Data!$B$2,\"\"),\"\")","v":"15603"},{"$f":"BalanceComprobacion!A676","v":3.1},{"$f":"BalanceComprobacion!B676","v":"5.1.1.05.02."},{"$f":"BalanceComprobacion!C676","v":"Aporte patronal al Régimen Obligatorio de Pensiones Complementarias"},{"$f":"BalanceComprobacion!D676","v":0},{"$f":"BalanceComprobacion!E676","v":896006.96},{"$f":"BalanceComprobacion!F676","v":0},{"$f":"BalanceComprobacion!G676","v":896006.96}]
[{"$f":"IFERROR(IF(B631<>0,Data!$B$2,\"\"),\"\")","v":"15603"},{"$f":"BalanceComprobacion!A677","v":3.1},{"$f":"BalanceComprobacion!B677","v":"5.1.1.05.02.00."},{"$f":"BalanceComprobacion!C677","v":"Aporte patronal al Régimen Obligatorio de Pensiones Complementarias"},{"$f":"BalanceComprobacion!D677","v":0},{"$f":"BalanceComprobacion!E677","v":896006.96},{"$f":"BalanceComprobacion!F677","v":0},{"$f":"BalanceComprobacion!G677","v":896006.96}]
[{"$f":"IFERROR(IF(B632<>0,Data!$B$2,\"\"),\"\")","v":"15603"},{"$f":"BalanceComprobacion!A678","v":3.1},{"$f":"BalanceComprobacion!B678","v":"5.1.1.05.02.00.0."},{"$f":"BalanceComprobacion!C678","v":"Aporte patronal al Régimen Obligatorio de Pensiones Complementarias"},{"$f":"BalanceComprobacion!D678","v":0},{"$f":"BalanceComprobacion!E678","v":896006.96},{"$f":"BalanceComprobacion!F678","v":0},{"$f":"BalanceComprobacion!G678","v":896006.96}]
[{"$f":"IFERROR(IF(B633<>0,Data!$B$2,\"\"),\"\")","v":"15603"},{"$f":"BalanceComprobacion!A679","v":3.1},{"$f":"BalanceComprobacion!B679","v":"5.1.1.05.02.00.0.99999"},{"$f":"BalanceComprobacion!C679","v":"Aporte patronal al Régimen Obligatorio de Pensiones Complementarias"},{"$f":"BalanceComprobacion!D679","v":0},{"$f":"BalanceComprobacion!E679","v":896006.96},{"$f":"BalanceComprobacion!F679","v":0},{"$f":"BalanceComprobacion!G679","v":896006.96}]
[{"$f":"IFERROR(IF(B634<>0,Data!$B$2,\"\"),\"\")","v":"15603"},{"$f":"BalanceComprobacion!A680","v":3.1},{"$f":"BalanceComprobacion!B680","v":"5.1.1.05.03."},{"$f":"BalanceComprobacion!C680","v":"Aporte patronal al Fondo de Capitalización Laboral"},{"$f":"BalanceComprobacion!D680","v":0},{"$f":"BalanceComprobacion!E680","v":448003.47},{"$f":"BalanceComprobacion!F680","v":0},{"$f":"BalanceComprobacion!G680","v":448003.47}]
[{"$f":"IFERROR(IF(B635<>0,Data!$B$2,\"\"),\"\")","v":"15603"},{"$f":"BalanceComprobacion!A681","v":3.1},{"$f":"BalanceComprobacion!B681","v":"5.1.1.05.03.00."},{"$f":"BalanceComprobacion!C681","v":"Aporte patronal al Fondo de Capitalización Laboral"},{"$f":"BalanceComprobacion!D681","v":0},{"$f":"BalanceComprobacion!E681","v":448003.47},{"$f":"BalanceComprobacion!F681","v":0},{"$f":"BalanceComprobacion!G681","v":448003.47}]
[{"$f":"IFERROR(IF(B636<>0,Data!$B$2,\"\"),\"\")","v":"15603"},{"$f":"BalanceComprobacion!A682","v":3.1},{"$f":"BalanceComprobacion!B682","v":"5.1.1.05.03.00.0."},{"$f":"BalanceComprobacion!C682","v":"Aporte patronal al Fondo de Capitalización Laboral"},{"$f":"BalanceComprobacion!D682","v":0},{"$f":"BalanceComprobacion!E682","v":448003.47},{"$f":"BalanceComprobacion!F682","v":0},{"$f":"BalanceComprobacion!G682","v":448003.47}]
[{"$f":"IFERROR(IF(B637<>0,Data!$B$2,\"\"),\"\")","v":"15603"},{"$f":"BalanceComprobacion!A683","v":3.1},{"$f":"BalanceComprobacion!B683","v":"5.1.1.05.03.00.0.14120"},{"$f":"BalanceComprobacion!C683","v":"Aporte Patronal al Fondo de Capitalización Laboral"},{"$f":"BalanceComprobacion!D683","v":0},{"$f":"BalanceComprobacion!E683","v":448003.47},{"$f":"BalanceComprobacion!F683","v":0},{"$f":"BalanceComprobacion!G683","v":448003.47}]
[{"$f":"IFERROR(IF(B638<>0,Data!$B$2,\"\"),\"\")","v":"15603"},{"$f":"BalanceComprobacion!A684","v":3.1},{"$f":"BalanceComprobacion!B684","v":"5.1.1.06."},{"$f":"BalanceComprobacion!C684","v":"Asistencia social y beneficios al personal"},{"$f":"BalanceComprobacion!D684","v":0},{"$f":"BalanceComprobacion!E684","v":17018370},{"$f":"BalanceComprobacion!F684","v":0},{"$f":"BalanceComprobacion!G684","v":17018370}]
[{"$f":"IFERROR(IF(B639<>0,Data!$B$2,\"\"),\"\")","v":"15603"},{"$f":"BalanceComprobacion!A685","v":3.1},{"$f":"BalanceComprobacion!B685","v":"5.1.1.06.08."},{"$f":"BalanceComprobacion!C685","v":"Indemnizaciones al personal"},{"$f":"BalanceComprobacion!D685","v":0},{"$f":"BalanceComprobacion!E685","v":17018370},{"$f":"BalanceComprobacion!F685","v":0},{"$f":"BalanceComprobacion!G685","v":17018370}]
[{"$f":"IFERROR(IF(B640<>0,Data!$B$2,\"\"),\"\")","v":"15603"},{"$f":"BalanceComprobacion!A686","v":3.1},{"$f":"BalanceComprobacion!B686","v":"5.1.1.06.08.00."},{"$f":"BalanceComprobacion!C686","v":"Indemnizaciones al personal"},{"$f":"BalanceComprobacion!D686","v":0},{"$f":"BalanceComprobacion!E686","v":17018370},{"$f":"BalanceComprobacion!F686","v":0},{"$f":"BalanceComprobacion!G686","v":17018370}]
[{"$f":"IFERROR(IF(B641<>0,Data!$B$2,\"\"),\"\")","v":"15603"},{"$f":"BalanceComprobacion!A687","v":3.1},{"$f":"BalanceComprobacion!B687","v":"5.1.1.06.08.00.0."},{"$f":"BalanceComprobacion!C687","v":"Indemnizaciones al personal"},{"$f":"BalanceComprobacion!D687","v":0},{"$f":"BalanceComprobacion!E687","v":17018370},{"$f":"BalanceComprobacion!F687","v":0},{"$f":"BalanceComprobacion!G687","v":17018370}]
[{"$f":"IFERROR(IF(B642<>0,Data!$B$2,\"\"),\"\")","v":"15603"},{"$f":"BalanceComprobacion!A688","v":3.1},{"$f":"BalanceComprobacion!B688","v":"5.1.1.06.08.00.0.99999"},{"$f":"BalanceComprobacion!C688","v":"Indemnizaciones al personal"},{"$f":"BalanceComprobacion!D688","v":0},{"$f":"BalanceComprobacion!E688","v":17018370},{"$f":"BalanceComprobacion!F688","v":0},{"$f":"BalanceComprobacion!G688","v":17018370}]
[{"$f":"IFERROR(IF(B643<>0,Data!$B$2,\"\"),\"\")","v":"15603"},{"$f":"BalanceComprobacion!A689","v":3.1},{"$f":"BalanceComprobacion!B689","v":"5.1.2."},{"$f":"BalanceComprobacion!C689","v":"Servicios"},{"$f":"BalanceComprobacion!D689","v":0},{"$f":"BalanceComprobacion!E689","v":1118682937.1500001},{"$f":"BalanceComprobacion!F689","v":280249.31},{"$f":"BalanceComprobacion!G689","v":1118402687.8399999}]
[{"$f":"IFERROR(IF(B644<>0,Data!$B$2,\"\"),\"\")","v":"15603"},{"$f":"BalanceComprobacion!A690","v":3.1},{"$f":"BalanceComprobacion!B690","v":"5.1.2.01."},{"$f":"BalanceComprobacion!C690","v":"Alquileres y derechos sobre bienes"},{"$f":"BalanceComprobacion!D690","v":0},{"$f":"BalanceComprobacion!E690","v":78112638.629999995},{"$f":"BalanceComprobacion!F690","v":0},{"$f":"BalanceComprobacion!G690","v":78112638.629999995}]
[{"$f":"IFERROR(IF(B645<>0,Data!$B$2,\"\"),\"\")","v":"15603"},{"$f":"BalanceComprobacion!A691","v":3.1},{"$f":"BalanceComprobacion!B691","v":"5.1.2.01.01."},{"$f":"BalanceComprobacion!C691","v":"Alquiler de terrenos, edificios y locales"},{"$f":"BalanceComprobacion!D691","v":0},{"$f":"BalanceComprobacion!E691","v":6000000},{"$f":"BalanceComprobacion!F691","v":0},{"$f":"BalanceComprobacion!G691","v":6000000}]
[{"$f":"IFERROR(IF(B646<>0,Data!$B$2,\"\"),\"\")","v":"15603"},{"$f":"BalanceComprobacion!A692","v":3.1},{"$f":"BalanceComprobacion!B692","v":"5.1.2.01.01.00."},{"$f":"BalanceComprobacion!C692","v":"Alquiler de terrenos, edificios y locales"},{"$f":"BalanceComprobacion!D692","v":0},{"$f":"BalanceComprobacion!E692","v":6000000},{"$f":"BalanceComprobacion!F692","v":0},{"$f":"BalanceComprobacion!G692","v":6000000}]
[{"$f":"IFERROR(IF(B647<>0,Data!$B$2,\"\"),\"\")","v":"15603"},{"$f":"BalanceComprobacion!A693","v":3.1},{"$f":"BalanceComprobacion!B693","v":"5.1.2.01.01.00.0."},{"$f":"BalanceComprobacion!C693","v":"Alquiler de terrenos, edificios y locales"},{"$f":"BalanceComprobacion!D693","v":0},{"$f":"BalanceComprobacion!E693","v":6000000},{"$f":"BalanceComprobacion!F693","v":0},{"$f":"BalanceComprobacion!G693","v":6000000}]
[{"$f":"IFERROR(IF(B648<>0,Data!$B$2,\"\"),\"\")","v":"15603"},{"$f":"BalanceComprobacion!A694","v":3.1},{"$f":"BalanceComprobacion!B694","v":"5.1.2.01.01.00.0.99999"},{"$f":"BalanceComprobacion!C694","v":"Alquiler de terrenos, edificios y locales"},{"$f":"BalanceComprobacion!D694","v":0},{"$f":"BalanceComprobacion!E694","v":6000000},{"$f":"BalanceComprobacion!F694","v":0},{"$f":"BalanceComprobacion!G694","v":6000000}]
[{"$f":"IFERROR(IF(B649<>0,Data!$B$2,\"\"),\"\")","v":"15603"},{"$f":"BalanceComprobacion!A695","v":3.1},{"$f":"BalanceComprobacion!B695","v":"5.1.2.01.02."},{"$f":"BalanceComprobacion!C695","v":"Alquiler de maquinarias, equipos y mobiliario"},{"$f":"BalanceComprobacion!D695","v":0},{"$f":"BalanceComprobacion!E695","v":70424440.799999997},{"$f":"BalanceComprobacion!F695","v":0},{"$f":"BalanceComprobacion!G695","v":70424440.799999997}]
[{"$f":"IFERROR(IF(B650<>0,Data!$B$2,\"\"),\"\")","v":"15603"},{"$f":"BalanceComprobacion!A696","v":3.1},{"$f":"BalanceComprobacion!B696","v":"5.1.2.01.02.00."},{"$f":"BalanceComprobacion!C696","v":"Alquiler de maquinarias, equipos y mobiliario"},{"$f":"BalanceComprobacion!D696","v":0},{"$f":"BalanceComprobacion!E696","v":70424440.799999997},{"$f":"BalanceComprobacion!F696","v":0},{"$f":"BalanceComprobacion!G696","v":70424440.799999997}]
[{"$f":"IFERROR(IF(B651<>0,Data!$B$2,\"\"),\"\")","v":"15603"},{"$f":"BalanceComprobacion!A697","v":3.1},{"$f":"BalanceComprobacion!B697","v":"5.1.2.01.02.00.0."},{"$f":"BalanceComprobacion!C697","v":"Alquiler de maquinarias, equipos y mobiliario"},{"$f":"BalanceComprobacion!D697","v":0},{"$f":"BalanceComprobacion!E697","v":70424440.799999997},{"$f":"BalanceComprobacion!F697","v":0},{"$f":"BalanceComprobacion!G697","v":70424440.799999997}]
[{"$f":"IFERROR(IF(B652<>0,Data!$B$2,\"\"),\"\")","v":"15603"},{"$f":"BalanceComprobacion!A698","v":3.1},{"$f":"BalanceComprobacion!B698","v":"5.1.2.01.02.00.0.99999"},{"$f":"BalanceComprobacion!C698","v":"Alquiler de maquinarias, equipos y mobiliario"},{"$f":"BalanceComprobacion!D698","v":0},{"$f":"BalanceComprobacion!E698","v":70424440.799999997},{"$f":"BalanceComprobacion!F698","v":0},{"$f":"BalanceComprobacion!G698","v":70424440.799999997}]
[{"$f":"IFERROR(IF(B653<>0,Data!$B$2,\"\"),\"\")","v":"15603"},{"$f":"BalanceComprobacion!A699","v":3.1},{"$f":"BalanceComprobacion!B699","v":"5.1.2.01.05."},{"$f":"BalanceComprobacion!C699","v":"Derechos o regalías sobre bienes intangibles"},{"$f":"BalanceComprobacion!D699","v":0},{"$f":"BalanceComprobacion!E699","v":1688197.83},{"$f":"BalanceComprobacion!F699","v":0},{"$f":"BalanceComprobacion!G699","v":1688197.83}]
[{"$f":"IFERROR(IF(B654<>0,Data!$B$2,\"\"),\"\")","v":"15603"},{"$f":"BalanceComprobacion!A700","v":3.1},{"$f":"BalanceComprobacion!B700","v":"5.1.2.01.05.00."},{"$f":"BalanceComprobacion!C700","v":"Derechos o regalías sobre bienes intangibles"},{"$f":"BalanceComprobacion!D700","v":0},{"$f":"BalanceComprobacion!E700","v":1688197.83},{"$f":"BalanceComprobacion!F700","v":0},{"$f":"BalanceComprobacion!G700","v":1688197.83}]
[{"$f":"IFERROR(IF(B655<>0,Data!$B$2,\"\"),\"\")","v":"15603"},{"$f":"BalanceComprobacion!A701","v":3.1},{"$f":"BalanceComprobacion!B701","v":"5.1.2.01.05.00.0."},{"$f":"BalanceComprobacion!C701","v":"Derechos o regalías sobre bienes intangibles"},{"$f":"BalanceComprobacion!D701","v":0},{"$f":"BalanceComprobacion!E701","v":1688197.83},{"$f":"BalanceComprobacion!F701","v":0},{"$f":"BalanceComprobacion!G701","v":1688197.83}]
[{"$f":"IFERROR(IF(B656<>0,Data!$B$2,\"\"),\"\")","v":"15603"},{"$f":"BalanceComprobacion!A702","v":3.1},{"$f":"BalanceComprobacion!B702","v":"5.1.2.01.05.00.0.99999"},{"$f":"BalanceComprobacion!C702","v":"Derechos o regalías sobre bienes intangibles"},{"$f":"BalanceComprobacion!D702","v":0},{"$f":"BalanceComprobacion!E702","v":1688197.83},{"$f":"BalanceComprobacion!F702","v":0},{"$f":"BalanceComprobacion!G702","v":1688197.83}]
[{"$f":"IFERROR(IF(B657<>0,Data!$B$2,\"\"),\"\")","v":"15603"},{"$f":"BalanceComprobacion!A703","v":3.1},{"$f":"BalanceComprobacion!B703","v":"5.1.2.02."},{"$f":"BalanceComprobacion!C703","v":"Servicios básicos"},{"$f":"BalanceComprobacion!D703","v":0},{"$f":"BalanceComprobacion!E703","v":63745969.530000001},{"$f":"BalanceComprobacion!F703","v":0},{"$f":"BalanceComprobacion!G703","v":63745969.530000001}]
[{"$f":"IFERROR(IF(B658<>0,Data!$B$2,\"\"),\"\")","v":"15603"},{"$f":"BalanceComprobacion!A704","v":3.1},{"$f":"BalanceComprobacion!B704","v":"5.1.2.02.01."},{"$f":"BalanceComprobacion!C704","v":"Agua y alcantarillado"},{"$f":"BalanceComprobacion!D704","v":0},{"$f":"BalanceComprobacion!E704","v":4533772},{"$f":"BalanceComprobacion!F704","v":0},{"$f":"BalanceComprobacion!G704","v":4533772}]
[{"$f":"IFERROR(IF(B659<>0,Data!$B$2,\"\"),\"\")","v":"15603"},{"$f":"BalanceComprobacion!A705","v":3.1},{"$f":"BalanceComprobacion!B705","v":"5.1.2.02.01.00."},{"$f":"BalanceComprobacion!C705","v":"Agua y alcantarillado"},{"$f":"BalanceComprobacion!D705","v":0},{"$f":"BalanceComprobacion!E705","v":4533772},{"$f":"BalanceComprobacion!F705","v":0},{"$f":"BalanceComprobacion!G705","v":4533772}]
[{"$f":"IFERROR(IF(B660<>0,Data!$B$2,\"\"),\"\")","v":"15603"},{"$f":"BalanceComprobacion!A706","v":3.1},{"$f":"BalanceComprobacion!B706","v":"5.1.2.02.01.00.0."},{"$f":"BalanceComprobacion!C706","v":"Agua y alcantarillado"},{"$f":"BalanceComprobacion!D706","v":0},{"$f":"BalanceComprobacion!E706","v":4533772},{"$f":"BalanceComprobacion!F706","v":0},{"$f":"BalanceComprobacion!G706","v":4533772}]
[{"$f":"IFERROR(IF(B661<>0,Data!$B$2,\"\"),\"\")","v":"15603"},{"$f":"BalanceComprobacion!A707","v":3.1},{"$f":"BalanceComprobacion!B707","v":"5.1.2.02.01.00.0.99999"},{"$f":"BalanceComprobacion!C707","v":"Agua y alcantarillado"},{"$f":"BalanceComprobacion!D707","v":0},{"$f":"BalanceComprobacion!E707","v":4533772},{"$f":"BalanceComprobacion!F707","v":0},{"$f":"BalanceComprobacion!G707","v":4533772}]
[{"$f":"IFERROR(IF(B662<>0,Data!$B$2,\"\"),\"\")","v":"15603"},{"$f":"BalanceComprobacion!A708","v":3.1},{"$f":"BalanceComprobacion!B708","v":"5.1.2.02.02."},{"$f":"BalanceComprobacion!C708","v":"Energía eléctrica"},{"$f":"BalanceComprobacion!D708","v":0},{"$f":"BalanceComprobacion!E708","v":8503515},{"$f":"BalanceComprobacion!F708","v":0},{"$f":"BalanceComprobacion!G708","v":8503515}]
[{"$f":"IFERROR(IF(B663<>0,Data!$B$2,\"\"),\"\")","v":"15603"},{"$f":"BalanceComprobacion!A709","v":3.1},{"$f":"BalanceComprobacion!B709","v":"5.1.2.02.02.00."},{"$f":"BalanceComprobacion!C709","v":"Energía eléctrica"},{"$f":"BalanceComprobacion!D709","v":0},{"$f":"BalanceComprobacion!E709","v":8503515},{"$f":"BalanceComprobacion!F709","v":0},{"$f":"BalanceComprobacion!G709","v":8503515}]
[{"$f":"IFERROR(IF(B664<>0,Data!$B$2,\"\"),\"\")","v":"15603"},{"$f":"BalanceComprobacion!A710","v":3.1},{"$f":"BalanceComprobacion!B710","v":"5.1.2.02.02.00.0."},{"$f":"BalanceComprobacion!C710","v":"Energía eléctrica"},{"$f":"BalanceComprobacion!D710","v":0},{"$f":"BalanceComprobacion!E710","v":8503515},{"$f":"BalanceComprobacion!F710","v":0},{"$f":"BalanceComprobacion!G710","v":8503515}]
[{"$f":"IFERROR(IF(B665<>0,Data!$B$2,\"\"),\"\")","v":"15603"},{"$f":"BalanceComprobacion!A711","v":3.1},{"$f":"BalanceComprobacion!B711","v":"5.1.2.02.02.00.0.99999"},{"$f":"BalanceComprobacion!C711","v":"Energía eléctrica"},{"$f":"BalanceComprobacion!D711","v":0},{"$f":"BalanceComprobacion!E711","v":8503515},{"$f":"BalanceComprobacion!F711","v":0},{"$f":"BalanceComprobacion!G711","v":8503515}]
[{"$f":"IFERROR(IF(B666<>0,Data!$B$2,\"\"),\"\")","v":"15603"},{"$f":"BalanceComprobacion!A712","v":3.1},{"$f":"BalanceComprobacion!B712","v":"5.1.2.02.04."},{"$f":"BalanceComprobacion!C712","v":"Servicios de telecomunicaciones"},{"$f":"BalanceComprobacion!D712","v":0},{"$f":"BalanceComprobacion!E712","v":1193072.23},{"$f":"BalanceComprobacion!F712","v":0},{"$f":"BalanceComprobacion!G712","v":1193072.23}]
[{"$f":"IFERROR(IF(B667<>0,Data!$B$2,\"\"),\"\")","v":"15603"},{"$f":"BalanceComprobacion!A713","v":3.1},{"$f":"BalanceComprobacion!B713","v":"5.1.2.02.04.00."},{"$f":"BalanceComprobacion!C713","v":"Servicios de telecomunicaciones"},{"$f":"BalanceComprobacion!D713","v":0},{"$f":"BalanceComprobacion!E713","v":1193072.23},{"$f":"BalanceComprobacion!F713","v":0},{"$f":"BalanceComprobacion!G713","v":1193072.23}]
[{"$f":"IFERROR(IF(B668<>0,Data!$B$2,\"\"),\"\")","v":"15603"},{"$f":"BalanceComprobacion!A714","v":3.1},{"$f":"BalanceComprobacion!B714","v":"5.1.2.02.04.00.0."},{"$f":"BalanceComprobacion!C714","v":"Servicios de telecomunicaciones"},{"$f":"BalanceComprobacion!D714","v":0},{"$f":"BalanceComprobacion!E714","v":1193072.23},{"$f":"BalanceComprobacion!F714","v":0},{"$f":"BalanceComprobacion!G714","v":1193072.23}]
[{"$f":"IFERROR(IF(B669<>0,Data!$B$2,\"\"),\"\")","v":"15603"},{"$f":"BalanceComprobacion!A715","v":3.1},{"$f":"BalanceComprobacion!B715","v":"5.1.2.02.04.00.0.99999"},{"$f":"BalanceComprobacion!C715","v":"Servicios de telecomunicaciones"},{"$f":"BalanceComprobacion!D715","v":0},{"$f":"BalanceComprobacion!E715","v":1193072.23},{"$f":"BalanceComprobacion!F715","v":0},{"$f":"BalanceComprobacion!G715","v":1193072.23}]
[{"$f":"IFERROR(IF(B670<>0,Data!$B$2,\"\"),\"\")","v":"15603"},{"$f":"BalanceComprobacion!A716","v":3.1},{"$f":"BalanceComprobacion!B716","v":"5.1.2.02.99."},{"$f":"BalanceComprobacion!C716","v":"Otros servicios básicos"},{"$f":"BalanceComprobacion!D716","v":0},{"$f":"BalanceComprobacion!E716","v":49515610.299999997},{"$f":"BalanceComprobacion!F716","v":0},{"$f":"BalanceComprobacion!G716","v":49515610.299999997}]
[{"$f":"IFERROR(IF(B671<>0,Data!$B$2,\"\"),\"\")","v":"15603"},{"$f":"BalanceComprobacion!A717","v":3.1},{"$f":"BalanceComprobacion!B717","v":"5.1.2.02.99.00."},{"$f":"BalanceComprobacion!C717","v":"Otros servicios básicos"},{"$f":"BalanceComprobacion!D717","v":0},{"$f":"BalanceComprobacion!E717","v":49515610.299999997},{"$f":"BalanceComprobacion!F717","v":0},{"$f":"BalanceComprobacion!G717","v":49515610.299999997}]
[{"$f":"IFERROR(IF(B672<>0,Data!$B$2,\"\"),\"\")","v":"15603"},{"$f":"BalanceComprobacion!A718","v":3.1},{"$f":"BalanceComprobacion!B718","v":"5.1.2.02.99.00.0."},{"$f":"BalanceComprobacion!C718","v":"Otros servicios básicos"},{"$f":"BalanceComprobacion!D718","v":0},{"$f":"BalanceComprobacion!E718","v":49515610.299999997},{"$f":"BalanceComprobacion!F718","v":0},{"$f":"BalanceComprobacion!G718","v":49515610.299999997}]
[{"$f":"IFERROR(IF(B673<>0,Data!$B$2,\"\"),\"\")","v":"15603"},{"$f":"BalanceComprobacion!A719","v":3.1},{"$f":"BalanceComprobacion!B719","v":"5.1.2.02.99.00.0.99999"},{"$f":"BalanceComprobacion!C719","v":"Otros servicios básicos"},{"$f":"BalanceComprobacion!D719","v":0},{"$f":"BalanceComprobacion!E719","v":49515610.299999997},{"$f":"BalanceComprobacion!F719","v":0},{"$f":"BalanceComprobacion!G719","v":49515610.299999997}]
[{"$f":"IFERROR(IF(B674<>0,Data!$B$2,\"\"),\"\")","v":"15603"},{"$f":"BalanceComprobacion!A720","v":3.1},{"$f":"BalanceComprobacion!B720","v":"5.1.2.03."},{"$f":"BalanceComprobacion!C720","v":"Servicios comerciales y financieros"},{"$f":"BalanceComprobacion!D720","v":0},{"$f":"BalanceComprobacion!E720","v":13514436.93},{"$f":"BalanceComprobacion!F720","v":0},{"$f":"BalanceComprobacion!G720","v":13514436.93}]
[{"$f":"IFERROR(IF(B675<>0,Data!$B$2,\"\"),\"\")","v":"15603"},{"$f":"BalanceComprobacion!A721","v":3.1},{"$f":"BalanceComprobacion!B721","v":"5.1.2.03.01."},{"$f":"BalanceComprobacion!C721","v":"Servicios de información"},{"$f":"BalanceComprobacion!D721","v":0},{"$f":"BalanceComprobacion!E721","v":457776},{"$f":"BalanceComprobacion!F721","v":0},{"$f":"BalanceComprobacion!G721","v":457776}]
[{"$f":"IFERROR(IF(B676<>0,Data!$B$2,\"\"),\"\")","v":"15603"},{"$f":"BalanceComprobacion!A722","v":3.1},{"$f":"BalanceComprobacion!B722","v":"5.1.2.03.01.00."},{"$f":"BalanceComprobacion!C722","v":"Servicios de información"},{"$f":"BalanceComprobacion!D722","v":0},{"$f":"BalanceComprobacion!E722","v":457776},{"$f":"BalanceComprobacion!F722","v":0},{"$f":"BalanceComprobacion!G722","v":457776}]
[{"$f":"IFERROR(IF(B677<>0,Data!$B$2,\"\"),\"\")","v":"15603"},{"$f":"BalanceComprobacion!A723","v":3.1},{"$f":"BalanceComprobacion!B723","v":"5.1.2.03.01.00.0."},{"$f":"BalanceComprobacion!C723","v":"Servicios de información"},{"$f":"BalanceComprobacion!D723","v":0},{"$f":"BalanceComprobacion!E723","v":457776},{"$f":"BalanceComprobacion!F723","v":0},{"$f":"BalanceComprobacion!G723","v":457776}]
[{"$f":"IFERROR(IF(B678<>0,Data!$B$2,\"\"),\"\")","v":"15603"},{"$f":"BalanceComprobacion!A724","v":3.1},{"$f":"BalanceComprobacion!B724","v":"5.1.2.03.01.00.0.99999"},{"$f":"BalanceComprobacion!C724","v":"Servicios de información"},{"$f":"BalanceComprobacion!D724","v":0},{"$f":"BalanceComprobacion!E724","v":457776},{"$f":"BalanceComprobacion!F724","v":0},{"$f":"BalanceComprobacion!G724","v":457776}]
[{"$f":"IFERROR(IF(B679<>0,Data!$B$2,\"\"),\"\")","v":"15603"},{"$f":"BalanceComprobacion!A725","v":3.1},{"$f":"BalanceComprobacion!B725","v":"5.1.2.03.06."},{"$f":"BalanceComprobacion!C725","v":"Comisiones y gastos por servicios financieros y comerciales"},{"$f":"BalanceComprobacion!D725","v":0},{"$f":"BalanceComprobacion!E725","v":12906924.93},{"$f":"BalanceComprobacion!F725","v":0},{"$f":"BalanceComprobacion!G725","v":12906924.93}]
[{"$f":"IFERROR(IF(B680<>0,Data!$B$2,\"\"),\"\")","v":"15603"},{"$f":"BalanceComprobacion!A726","v":3.1},{"$f":"BalanceComprobacion!B726","v":"5.1.2.03.06.00."},{"$f":"BalanceComprobacion!C726","v":"Comisiones y gastos por servicios financieros y comerciales"},{"$f":"BalanceComprobacion!D726","v":0},{"$f":"BalanceComprobacion!E726","v":12906924.93},{"$f":"BalanceComprobacion!F726","v":0},{"$f":"BalanceComprobacion!G726","v":12906924.93}]
[{"$f":"IFERROR(IF(B681<>0,Data!$B$2,\"\"),\"\")","v":"15603"},{"$f":"BalanceComprobacion!A727","v":3.1},{"$f":"BalanceComprobacion!B727","v":"5.1.2.03.06.00.0."},{"$f":"BalanceComprobacion!C727","v":"Comisiones y gastos por servicios financieros y comerciales"},{"$f":"BalanceComprobacion!D727","v":0},{"$f":"BalanceComprobacion!E727","v":12906924.93},{"$f":"BalanceComprobacion!F727","v":0},{"$f":"BalanceComprobacion!G727","v":12906924.93}]
[{"$f":"IFERROR(IF(B682<>0,Data!$B$2,\"\"),\"\")","v":"15603"},{"$f":"BalanceComprobacion!A728","v":3.1},{"$f":"BalanceComprobacion!B728","v":"5.1.2.03.06.00.0.99999"},{"$f":"BalanceComprobacion!C728","v":"Comisiones y gastos por servicios financieros y comerciales"},{"$f":"BalanceComprobacion!D728","v":0},{"$f":"BalanceComprobacion!E728","v":12906924.93},{"$f":"BalanceComprobacion!F728","v":0},{"$f":"BalanceComprobacion!G728","v":12906924.93}]
[{"$f":"IFERROR(IF(B683<>0,Data!$B$2,\"\"),\"\")","v":"15603"},{"$f":"BalanceComprobacion!A729","v":3.1},{"$f":"BalanceComprobacion!B729","v":"5.1.2.03.07."},{"$f":"BalanceComprobacion!C729","v":"Servicios de transferencia electrónica de información"},{"$f":"BalanceComprobacion!D729","v":0},{"$f":"BalanceComprobacion!E729","v":149736},{"$f":"BalanceComprobacion!F729","v":0},{"$f":"BalanceComprobacion!G729","v":149736}]
[{"$f":"IFERROR(IF(B684<>0,Data!$B$2,\"\"),\"\")","v":"15603"},{"$f":"BalanceComprobacion!A730","v":3.1},{"$f":"BalanceComprobacion!B730","v":"5.1.2.03.07.00."},{"$f":"BalanceComprobacion!C730","v":"Servicios de transferencia electrónica de información"},{"$f":"BalanceComprobacion!D730","v":0},{"$f":"BalanceComprobacion!E730","v":149736},{"$f":"BalanceComprobacion!F730","v":0},{"$f":"BalanceComprobacion!G730","v":149736}]
[{"$f":"IFERROR(IF(B685<>0,Data!$B$2,\"\"),\"\")","v":"15603"},{"$f":"BalanceComprobacion!A731","v":3.1},{"$f":"BalanceComprobacion!B731","v":"5.1.2.03.07.00.0."},{"$f":"BalanceComprobacion!C731","v":"Servicios de transferencia electrónica de información"},{"$f":"BalanceComprobacion!D731","v":0},{"$f":"BalanceComprobacion!E731","v":149736},{"$f":"BalanceComprobacion!F731","v":0},{"$f":"BalanceComprobacion!G731","v":149736}]
[{"$f":"IFERROR(IF(B686<>0,Data!$B$2,\"\"),\"\")","v":"15603"},{"$f":"BalanceComprobacion!A732","v":3.1},{"$f":"BalanceComprobacion!B732","v":"5.1.2.03.07.00.0.99999"},{"$f":"BalanceComprobacion!C732","v":"Servicios de transferencia electrónica de información"},{"$f":"BalanceComprobacion!D732","v":0},{"$f":"BalanceComprobacion!E732","v":149736},{"$f":"BalanceComprobacion!F732","v":0},{"$f":"BalanceComprobacion!G732","v":149736}]
[{"$f":"IFERROR(IF(B687<>0,Data!$B$2,\"\"),\"\")","v":"15603"},{"$f":"BalanceComprobacion!A733","v":3.1},{"$f":"BalanceComprobacion!B733","v":"5.1.2.04."},{"$f":"BalanceComprobacion!C733","v":"Servicios de gestión y apoyo"},{"$f":"BalanceComprobacion!D733","v":0},{"$f":"BalanceComprobacion!E733","v":55043998.210000001},{"$f":"BalanceComprobacion!F733","v":11890},{"$f":"BalanceComprobacion!G733","v":55032108.210000001}]
[{"$f":"IFERROR(IF(B688<>0,Data!$B$2,\"\"),\"\")","v":"15603"},{"$f":"BalanceComprobacion!A734","v":3.1},{"$f":"BalanceComprobacion!B734","v":"5.1.2.04.03."},{"$f":"BalanceComprobacion!C734","v":"Servicios de ingeniería"},{"$f":"BalanceComprobacion!D734","v":0},{"$f":"BalanceComprobacion!E734","v":4998299},{"$f":"BalanceComprobacion!F734","v":0},{"$f":"BalanceComprobacion!G734","v":4998299}]
[{"$f":"IFERROR(IF(B689<>0,Data!$B$2,\"\"),\"\")","v":"15603"},{"$f":"BalanceComprobacion!A735","v":3.1},{"$f":"BalanceComprobacion!B735","v":"5.1.2.04.03.00."},{"$f":"BalanceComprobacion!C735","v":"Servicios de ingeniería"},{"$f":"BalanceComprobacion!D735","v":0},{"$f":"BalanceComprobacion!E735","v":4998299},{"$f":"BalanceComprobacion!F735","v":0},{"$f":"BalanceComprobacion!G735","v":4998299}]
[{"$f":"IFERROR(IF(B690<>0,Data!$B$2,\"\"),\"\")","v":"15603"},{"$f":"BalanceComprobacion!A736","v":3.1},{"$f":"BalanceComprobacion!B736","v":"5.1.2.04.03.00.0."},{"$f":"BalanceComprobacion!C736","v":"Servicios de ingeniería"},{"$f":"BalanceComprobacion!D736","v":0},{"$f":"BalanceComprobacion!E736","v":4998299},{"$f":"BalanceComprobacion!F736","v":0},{"$f":"BalanceComprobacion!G736","v":4998299}]
[{"$f":"IFERROR(IF(B691<>0,Data!$B$2,\"\"),\"\")","v":"15603"},{"$f":"BalanceComprobacion!A737","v":3.1},{"$f":"BalanceComprobacion!B737","v":"5.1.2.04.03.00.0.99999"},{"$f":"BalanceComprobacion!C737","v":"Servicios de ingeniería"},{"$f":"BalanceComprobacion!D737","v":0},{"$f":"BalanceComprobacion!E737","v":4998299},{"$f":"BalanceComprobacion!F737","v":0},{"$f":"BalanceComprobacion!G737","v":4998299}]
[{"$f":"IFERROR(IF(B692<>0,Data!$B$2,\"\"),\"\")","v":"15603"},{"$f":"BalanceComprobacion!A738","v":3.1},{"$f":"BalanceComprobacion!B738","v":"5.1.2.04.04."},{"$f":"BalanceComprobacion!C738","v":"Servicios en ciencias económicas y sociales"},{"$f":"BalanceComprobacion!D738","v":0},{"$f":"BalanceComprobacion!E738","v":5042100},{"$f":"BalanceComprobacion!F738","v":0},{"$f":"BalanceComprobacion!G738","v":5042100}]
[{"$f":"IFERROR(IF(B693<>0,Data!$B$2,\"\"),\"\")","v":"15603"},{"$f":"BalanceComprobacion!A739","v":3.1},{"$f":"BalanceComprobacion!B739","v":"5.1.2.04.04.00."},{"$f":"BalanceComprobacion!C739","v":"Servicios en ciencias económicas y sociales"},{"$f":"BalanceComprobacion!D739","v":0},{"$f":"BalanceComprobacion!E739","v":5042100},{"$f":"BalanceComprobacion!F739","v":0},{"$f":"BalanceComprobacion!G739","v":5042100}]
[{"$f":"IFERROR(IF(B694<>0,Data!$B$2,\"\"),\"\")","v":"15603"},{"$f":"BalanceComprobacion!A740","v":3.1},{"$f":"BalanceComprobacion!B740","v":"5.1.2.04.04.00.0."},{"$f":"BalanceComprobacion!C740","v":"Servicios en ciencias económicas y sociales"},{"$f":"BalanceComprobacion!D740","v":0},{"$f":"BalanceComprobacion!E740","v":5042100},{"$f":"BalanceComprobacion!F740","v":0},{"$f":"BalanceComprobacion!G740","v":5042100}]
[{"$f":"IFERROR(IF(B695<>0,Data!$B$2,\"\"),\"\")","v":"15603"},{"$f":"BalanceComprobacion!A741","v":3.1},{"$f":"BalanceComprobacion!B741","v":"5.1.2.04.04.00.0.99999"},{"$f":"BalanceComprobacion!C741","v":"Servicios en ciencias económicas y sociales"},{"$f":"BalanceComprobacion!D741","v":0},{"$f":"BalanceComprobacion!E741","v":5042100},{"$f":"BalanceComprobacion!F741","v":0},{"$f":"BalanceComprobacion!G741","v":5042100}]
[{"$f":"IFERROR(IF(B696<>0,Data!$B$2,\"\"),\"\")","v":"15603"},{"$f":"BalanceComprobacion!A742","v":3.1},{"$f":"BalanceComprobacion!B742","v":"5.1.2.04.06."},{"$f":"BalanceComprobacion!C742","v":"Servicios generales"},{"$f":"BalanceComprobacion!D742","v":0},{"$f":"BalanceComprobacion!E742","v":31311191.850000001},{"$f":"BalanceComprobacion!F742","v":0},{"$f":"BalanceComprobacion!G742","v":31311191.850000001}]
[{"$f":"IFERROR(IF(B697<>0,Data!$B$2,\"\"),\"\")","v":"15603"},{"$f":"BalanceComprobacion!A743","v":3.1},{"$f":"BalanceComprobacion!B743","v":"5.1.2.04.06.00."},{"$f":"BalanceComprobacion!C743","v":"Servicios generales"},{"$f":"BalanceComprobacion!D743","v":0},{"$f":"BalanceComprobacion!E743","v":31311191.850000001},{"$f":"BalanceComprobacion!F743","v":0},{"$f":"BalanceComprobacion!G743","v":31311191.850000001}]
[{"$f":"IFERROR(IF(B698<>0,Data!$B$2,\"\"),\"\")","v":"15603"},{"$f":"BalanceComprobacion!A744","v":3.1},{"$f":"BalanceComprobacion!B744","v":"5.1.2.04.06.00.0."},{"$f":"BalanceComprobacion!C744","v":"Servicios generales"},{"$f":"BalanceComprobacion!D744","v":0},{"$f":"BalanceComprobacion!E744","v":31311191.850000001},{"$f":"BalanceComprobacion!F744","v":0},{"$f":"BalanceComprobacion!G744","v":31311191.850000001}]
[{"$f":"IFERROR(IF(B699<>0,Data!$B$2,\"\"),\"\")","v":"15603"},{"$f":"BalanceComprobacion!A745","v":3.1},{"$f":"BalanceComprobacion!B745","v":"5.1.2.04.06.00.0.99999"},{"$f":"BalanceComprobacion!C745","v":"Servicios generales"},{"$f":"BalanceComprobacion!D745","v":0},{"$f":"BalanceComprobacion!E745","v":31311191.850000001},{"$f":"BalanceComprobacion!F745","v":0},{"$f":"BalanceComprobacion!G745","v":31311191.850000001}]
[{"$f":"IFERROR(IF(B700<>0,Data!$B$2,\"\"),\"\")","v":"15603"},{"$f":"BalanceComprobacion!A746","v":3.1},{"$f":"BalanceComprobacion!B746","v":"5.1.2.04.99."},{"$f":"BalanceComprobacion!C746","v":"Otros servicios de gestión y apoyo"},{"$f":"BalanceComprobacion!D746","v":0},{"$f":"BalanceComprobacion!E746","v":13692407.359999999},{"$f":"BalanceComprobacion!F746","v":11890},{"$f":"BalanceComprobacion!G746","v":13680517.359999999}]
[{"$f":"IFERROR(IF(B701<>0,Data!$B$2,\"\"),\"\")","v":"15603"},{"$f":"BalanceComprobacion!A747","v":3.1},{"$f":"BalanceComprobacion!B747","v":"5.1.2.04.99.00."},{"$f":"BalanceComprobacion!C747","v":"Otros servicios de gestión y apoyo"},{"$f":"BalanceComprobacion!D747","v":0},{"$f":"BalanceComprobacion!E747","v":13692407.359999999},{"$f":"BalanceComprobacion!F747","v":11890},{"$f":"BalanceComprobacion!G747","v":13680517.359999999}]
[{"$f":"IFERROR(IF(B702<>0,Data!$B$2,\"\"),\"\")","v":"15603"},{"$f":"BalanceComprobacion!A748","v":3.1},{"$f":"BalanceComprobacion!B748","v":"5.1.2.04.99.00.0."},{"$f":"BalanceComprobacion!C748","v":"Otros servicios de gestión y apoyo"},{"$f":"BalanceComprobacion!D748","v":0},{"$f":"BalanceComprobacion!E748","v":13692407.359999999},{"$f":"BalanceComprobacion!F748","v":11890},{"$f":"BalanceComprobacion!G748","v":13680517.359999999}]
[{"$f":"IFERROR(IF(B703<>0,Data!$B$2,\"\"),\"\")","v":"15603"},{"$f":"BalanceComprobacion!A749","v":3.1},{"$f":"BalanceComprobacion!B749","v":"5.1.2.04.99.00.0.99999"},{"$f":"BalanceComprobacion!C749","v":"Otros servicios de gestión y apoyo"},{"$f":"BalanceComprobacion!D749","v":0},{"$f":"BalanceComprobacion!E749","v":13692407.359999999},{"$f":"BalanceComprobacion!F749","v":11890},{"$f":"BalanceComprobacion!G749","v":13680517.359999999}]
[{"$f":"IFERROR(IF(B704<>0,Data!$B$2,\"\"),\"\")","v":"15603"},{"$f":"BalanceComprobacion!A750","v":3.1},{"$f":"BalanceComprobacion!B750","v":"5.1.2.05."},{"$f":"BalanceComprobacion!C750","v":"Gastos de viaje y transporte"},{"$f":"BalanceComprobacion!D750","v":0},{"$f":"BalanceComprobacion!E750","v":3858320},{"$f":"BalanceComprobacion!F750","v":268359.31},{"$f":"BalanceComprobacion!G750","v":3589960.69}]
[{"$f":"IFERROR(IF(B705<>0,Data!$B$2,\"\"),\"\")","v":"15603"},{"$f":"BalanceComprobacion!A751","v":3.1},{"$f":"BalanceComprobacion!B751","v":"5.1.2.05.01."},{"$f":"BalanceComprobacion!C751","v":"Transporte dentro del país"},{"$f":"BalanceComprobacion!D751","v":0},{"$f":"BalanceComprobacion!E751","v":26720},{"$f":"BalanceComprobacion!F751","v":0},{"$f":"BalanceComprobacion!G751","v":26720}]
[{"$f":"IFERROR(IF(B706<>0,Data!$B$2,\"\"),\"\")","v":"15603"},{"$f":"BalanceComprobacion!A752","v":3.1},{"$f":"BalanceComprobacion!B752","v":"5.1.2.05.01.00."},{"$f":"BalanceComprobacion!C752","v":"Transporte dentro del país"},{"$f":"BalanceComprobacion!D752","v":0},{"$f":"BalanceComprobacion!E752","v":26720},{"$f":"BalanceComprobacion!F752","v":0},{"$f":"BalanceComprobacion!G752","v":26720}]
[{"$f":"IFERROR(IF(B707<>0,Data!$B$2,\"\"),\"\")","v":"15603"},{"$f":"BalanceComprobacion!A753","v":3.1},{"$f":"BalanceComprobacion!B753","v":"5.1.2.05.01.00.0."},{"$f":"BalanceComprobacion!C753","v":"Transporte dentro del país"},{"$f":"BalanceComprobacion!D753","v":0},{"$f":"BalanceComprobacion!E753","v":26720},{"$f":"BalanceComprobacion!F753","v":0},{"$f":"BalanceComprobacion!G753","v":26720}]
[{"$f":"IFERROR(IF(B708<>0,Data!$B$2,\"\"),\"\")","v":"15603"},{"$f":"BalanceComprobacion!A754","v":3.1},{"$f":"BalanceComprobacion!B754","v":"5.1.2.05.01.00.0.99999"},{"$f":"BalanceComprobacion!C754","v":"Transporte dentro del país"},{"$f":"BalanceComprobacion!D754","v":0},{"$f":"BalanceComprobacion!E754","v":26720},{"$f":"BalanceComprobacion!F754","v":0},{"$f":"BalanceComprobacion!G754","v":26720}]
[{"$f":"IFERROR(IF(B709<>0,Data!$B$2,\"\"),\"\")","v":"15603"},{"$f":"BalanceComprobacion!A755","v":3.1},{"$f":"BalanceComprobacion!B755","v":"5.1.2.05.02."},{"$f":"BalanceComprobacion!C755","v":"Viáticos dentro del país"},{"$f":"BalanceComprobacion!D755","v":0},{"$f":"BalanceComprobacion!E755","v":3831600},{"$f":"BalanceComprobacion!F755","v":268359.31},{"$f":"BalanceComprobacion!G755","v":3563240.69}]
[{"$f":"IFERROR(IF(B710<>0,Data!$B$2,\"\"),\"\")","v":"15603"},{"$f":"BalanceComprobacion!A756","v":3.1},{"$f":"BalanceComprobacion!B756","v":"5.1.2.05.02.00."},{"$f":"BalanceComprobacion!C756","v":"Viáticos dentro del país"},{"$f":"BalanceComprobacion!D756","v":0},{"$f":"BalanceComprobacion!E756","v":3831600},{"$f":"BalanceComprobacion!F756","v":268359.31},{"$f":"BalanceComprobacion!G756","v":3563240.69}]
[{"$f":"IFERROR(IF(B711<>0,Data!$B$2,\"\"),\"\")","v":"15603"},{"$f":"BalanceComprobacion!A757","v":3.1},{"$f":"BalanceComprobacion!B757","v":"5.1.2.05.02.00.0."},{"$f":"BalanceComprobacion!C757","v":"Viáticos dentro del país"},{"$f":"BalanceComprobacion!D757","v":0},{"$f":"BalanceComprobacion!E757","v":3831600},{"$f":"BalanceComprobacion!F757","v":268359.31},{"$f":"BalanceComprobacion!G757","v":3563240.69}]
[{"$f":"IFERROR(IF(B712<>0,Data!$B$2,\"\"),\"\")","v":"15603"},{"$f":"BalanceComprobacion!A758","v":3.1},{"$f":"BalanceComprobacion!B758","v":"5.1.2.05.02.00.0.99999"},{"$f":"BalanceComprobacion!C758","v":"Viáticos dentro del país"},{"$f":"BalanceComprobacion!D758","v":0},{"$f":"BalanceComprobacion!E758","v":3831600},{"$f":"BalanceComprobacion!F758","v":268359.31},{"$f":"BalanceComprobacion!G758","v":3563240.69}]
[{"$f":"IFERROR(IF(B713<>0,Data!$B$2,\"\"),\"\")","v":"15603"},{"$f":"BalanceComprobacion!A759","v":3.1},{"$f":"BalanceComprobacion!B759","v":"5.1.2.06."},{"$f":"BalanceComprobacion!C759","v":"Seguros, reaseguros y otras obligaciones"},{"$f":"BalanceComprobacion!D759","v":0},{"$f":"BalanceComprobacion!E759","v":28208536.43},{"$f":"BalanceComprobacion!F759","v":0},{"$f":"BalanceComprobacion!G759","v":28208536.43}]
[{"$f":"IFERROR(IF(B714<>0,Data!$B$2,\"\"),\"\")","v":"15603"},{"$f":"BalanceComprobacion!A760","v":3.1},{"$f":"BalanceComprobacion!B760","v":"5.1.2.06.01."},{"$f":"BalanceComprobacion!C760","v":"Seguros"},{"$f":"BalanceComprobacion!D760","v":0},{"$f":"BalanceComprobacion!E760","v":28208536.43},{"$f":"BalanceComprobacion!F760","v":0},{"$f":"BalanceComprobacion!G760","v":28208536.43}]
[{"$f":"IFERROR(IF(B715<>0,Data!$B$2,\"\"),\"\")","v":"15603"},{"$f":"BalanceComprobacion!A761","v":3.1},{"$f":"BalanceComprobacion!B761","v":"5.1.2.06.01.01."},{"$f":"BalanceComprobacion!C761","v":"Seguros contra riesgos de trabajo"},{"$f":"BalanceComprobacion!D761","v":0},{"$f":"BalanceComprobacion!E761","v":6212022.75},{"$f":"BalanceComprobacion!F761","v":0},{"$f":"BalanceComprobacion!G761","v":6212022.75}]
[{"$f":"IFERROR(IF(B716<>0,Data!$B$2,\"\"),\"\")","v":"15603"},{"$f":"BalanceComprobacion!A762","v":3.1},{"$f":"BalanceComprobacion!B762","v":"5.1.2.06.01.01.0."},{"$f":"BalanceComprobacion!C762","v":"Seguros contra riesgos de trabajo"},{"$f":"BalanceComprobacion!D762","v":0},{"$f":"BalanceComprobacion!E762","v":6212022.75},{"$f":"BalanceComprobacion!F762","v":0},{"$f":"BalanceComprobacion!G762","v":6212022.75}]
[{"$f":"IFERROR(IF(B717<>0,Data!$B$2,\"\"),\"\")","v":"15603"},{"$f":"BalanceComprobacion!A763","v":3.1},{"$f":"BalanceComprobacion!B763","v":"5.1.2.06.01.01.0.99999"},{"$f":"BalanceComprobacion!C763","v":"Seguros contra riesgos de trabajo"},{"$f":"BalanceComprobacion!D763","v":0},{"$f":"BalanceComprobacion!E763","v":6212022.75},{"$f":"BalanceComprobacion!F763","v":0},{"$f":"BalanceComprobacion!G763","v":6212022.75}]
[{"$f":"IFERROR(IF(B718<>0,Data!$B$2,\"\"),\"\")","v":"15603"},{"$f":"BalanceComprobacion!A764","v":3.1},{"$f":"BalanceComprobacion!B764","v":"5.1.2.06.01.04."},{"$f":"BalanceComprobacion!C764","v":"Seguros voluntarios de automóviles"},{"$f":"BalanceComprobacion!D764","v":0},{"$f":"BalanceComprobacion!E764","v":21996513.68},{"$f":"BalanceComprobacion!F764","v":0},{"$f":"BalanceComprobacion!G764","v":21996513.68}]
[{"$f":"IFERROR(IF(B719<>0,Data!$B$2,\"\"),\"\")","v":"15603"},{"$f":"BalanceComprobacion!A765","v":3.1},{"$f":"BalanceComprobacion!B765","v":"5.1.2.06.01.04.0."},{"$f":"BalanceComprobacion!C765","v":"Seguros voluntarios de automóviles"},{"$f":"BalanceComprobacion!D765","v":0},{"$f":"BalanceComprobacion!E765","v":21996513.68},{"$f":"BalanceComprobacion!F765","v":0},{"$f":"BalanceComprobacion!G765","v":21996513.68}]
[{"$f":"IFERROR(IF(B720<>0,Data!$B$2,\"\"),\"\")","v":"15603"},{"$f":"BalanceComprobacion!A766","v":3.1},{"$f":"BalanceComprobacion!B766","v":"5.1.2.06.01.04.0.99999"},{"$f":"BalanceComprobacion!C766","v":"Seguros voluntarios de automóviles"},{"$f":"BalanceComprobacion!D766","v":0},{"$f":"BalanceComprobacion!E766","v":21996513.68},{"$f":"BalanceComprobacion!F766","v":0},{"$f":"BalanceComprobacion!G766","v":21996513.68}]
[{"$f":"IFERROR(IF(B721<>0,Data!$B$2,\"\"),\"\")","v":"15603"},{"$f":"BalanceComprobacion!A767","v":3.1},{"$f":"BalanceComprobacion!B767","v":"5.1.2.07."},{"$f":"BalanceComprobacion!C767","v":"Capacitación y protocolo"},{"$f":"BalanceComprobacion!D767","v":0},{"$f":"BalanceComprobacion!E767","v":10860000},{"$f":"BalanceComprobacion!F767","v":0},{"$f":"BalanceComprobacion!G767","v":10860000}]
[{"$f":"IFERROR(IF(B722<>0,Data!$B$2,\"\"),\"\")","v":"15603"},{"$f":"BalanceComprobacion!A768","v":3.1},{"$f":"BalanceComprobacion!B768","v":"5.1.2.07.01."},{"$f":"BalanceComprobacion!C768","v":"Actividades de capacitación"},{"$f":"BalanceComprobacion!D768","v":0},{"$f":"BalanceComprobacion!E768","v":4860000},{"$f":"BalanceComprobacion!F768","v":0},{"$f":"BalanceComprobacion!G768","v":4860000}]
[{"$f":"IFERROR(IF(B723<>0,Data!$B$2,\"\"),\"\")","v":"15603"},{"$f":"BalanceComprobacion!A769","v":3.1},{"$f":"BalanceComprobacion!B769","v":"5.1.2.07.01.00."},{"$f":"BalanceComprobacion!C769","v":"Actividades de capacitación"},{"$f":"BalanceComprobacion!D769","v":0},{"$f":"BalanceComprobacion!E769","v":4860000},{"$f":"BalanceComprobacion!F769","v":0},{"$f":"BalanceComprobacion!G769","v":4860000}]
[{"$f":"IFERROR(IF(B724<>0,Data!$B$2,\"\"),\"\")","v":"15603"},{"$f":"BalanceComprobacion!A770","v":3.1},{"$f":"BalanceComprobacion!B770","v":"5.1.2.07.01.00.0."},{"$f":"BalanceComprobacion!C770","v":"Actividades de capacitación"},{"$f":"BalanceComprobacion!D770","v":0},{"$f":"BalanceComprobacion!E770","v":4860000},{"$f":"BalanceComprobacion!F770","v":0},{"$f":"BalanceComprobacion!G770","v":4860000}]
[{"$f":"IFERROR(IF(B725<>0,Data!$B$2,\"\"),\"\")","v":"15603"},{"$f":"BalanceComprobacion!A771","v":3.1},{"$f":"BalanceComprobacion!B771","v":"5.1.2.07.01.00.0.99999"},{"$f":"BalanceComprobacion!C771","v":"Actividades de capacitación"},{"$f":"BalanceComprobacion!D771","v":0},{"$f":"BalanceComprobacion!E771","v":4860000},{"$f":"BalanceComprobacion!F771","v":0},{"$f":"BalanceComprobacion!G771","v":4860000}]
[{"$f":"IFERROR(IF(B726<>0,Data!$B$2,\"\"),\"\")","v":"15603"},{"$f":"BalanceComprobacion!A772","v":3.1},{"$f":"BalanceComprobacion!B772","v":"5.1.2.07.02."},{"$f":"BalanceComprobacion!C772","v":"Actividades protocolarias y sociales"},{"$f":"BalanceComprobacion!D772","v":0},{"$f":"BalanceComprobacion!E772","v":6000000},{"$f":"BalanceComprobacion!F772","v":0},{"$f":"BalanceComprobacion!G772","v":6000000}]
[{"$f":"IFERROR(IF(B727<>0,Data!$B$2,\"\"),\"\")","v":"15603"},{"$f":"BalanceComprobacion!A773","v":3.1},{"$f":"BalanceComprobacion!B773","v":"5.1.2.07.02.00."},{"$f":"BalanceComprobacion!C773","v":"Actividades protocolarias y sociales"},{"$f":"BalanceComprobacion!D773","v":0},{"$f":"BalanceComprobacion!E773","v":6000000},{"$f":"BalanceComprobacion!F773","v":0},{"$f":"BalanceComprobacion!G773","v":6000000}]
[{"$f":"IFERROR(IF(B728<>0,Data!$B$2,\"\"),\"\")","v":"15603"},{"$f":"BalanceComprobacion!A774","v":3.1},{"$f":"BalanceComprobacion!B774","v":"5.1.2.07.02.00.0."},{"$f":"BalanceComprobacion!C774","v":"Actividades protocolarias y sociales"},{"$f":"BalanceComprobacion!D774","v":0},{"$f":"BalanceComprobacion!E774","v":6000000},{"$f":"BalanceComprobacion!F774","v":0},{"$f":"BalanceComprobacion!G774","v":6000000}]
[{"$f":"IFERROR(IF(B729<>0,Data!$B$2,\"\"),\"\")","v":"15603"},{"$f":"BalanceComprobacion!A775","v":3.1},{"$f":"BalanceComprobacion!B775","v":"5.1.2.07.02.00.0.99999"},{"$f":"BalanceComprobacion!C775","v":"Actividades protocolarias y sociales"},{"$f":"BalanceComprobacion!D775","v":0},{"$f":"BalanceComprobacion!E775","v":6000000},{"$f":"BalanceComprobacion!F775","v":0},{"$f":"BalanceComprobacion!G775","v":6000000}]
[{"$f":"IFERROR(IF(B730<>0,Data!$B$2,\"\"),\"\")","v":"15603"},{"$f":"BalanceComprobacion!A776","v":3.1},{"$f":"BalanceComprobacion!B776","v":"5.1.2.08."},{"$f":"BalanceComprobacion!C776","v":"Mantenimiento y reparaciones"},{"$f":"BalanceComprobacion!D776","v":0},{"$f":"BalanceComprobacion!E776","v":865339037.41999996},{"$f":"BalanceComprobacion!F776","v":0},{"$f":"BalanceComprobacion!G776","v":865339037.41999996}]
[{"$f":"IFERROR(IF(B731<>0,Data!$B$2,\"\"),\"\")","v":"15603"},{"$f":"BalanceComprobacion!A777","v":3.1},{"$f":"BalanceComprobacion!B777","v":"5.1.2.08.01."},{"$f":"BalanceComprobacion!C777","v":"Mantenimiento de terrenos y edificios"},{"$f":"BalanceComprobacion!D777","v":0},{"$f":"BalanceComprobacion!E777","v":17760122.5},{"$f":"BalanceComprobacion!F777","v":0},{"$f":"BalanceComprobacion!G777","v":17760122.5}]
[{"$f":"IFERROR(IF(B732<>0,Data!$B$2,\"\"),\"\")","v":"15603"},{"$f":"BalanceComprobacion!A778","v":3.1},{"$f":"BalanceComprobacion!B778","v":"5.1.2.08.01.99."},{"$f":"BalanceComprobacion!C778","v":"Mantenimiento de edificios varios"},{"$f":"BalanceComprobacion!D778","v":0},{"$f":"BalanceComprobacion!E778","v":17760122.5},{"$f":"BalanceComprobacion!F778","v":0},{"$f":"BalanceComprobacion!G778","v":17760122.5}]
[{"$f":"IFERROR(IF(B733<>0,Data!$B$2,\"\"),\"\")","v":"15603"},{"$f":"BalanceComprobacion!A779","v":3.1},{"$f":"BalanceComprobacion!B779","v":"5.1.2.08.01.99.0."},{"$f":"BalanceComprobacion!C779","v":"Mantenimiento de edificios varios"},{"$f":"BalanceComprobacion!D779","v":0},{"$f":"BalanceComprobacion!E779","v":17760122.5},{"$f":"BalanceComprobacion!F779","v":0},{"$f":"BalanceComprobacion!G779","v":17760122.5}]
[{"$f":"IFERROR(IF(B734<>0,Data!$B$2,\"\"),\"\")","v":"15603"},{"$f":"BalanceComprobacion!A780","v":3.1},{"$f":"BalanceComprobacion!B780","v":"5.1.2.08.01.99.0.99999"},{"$f":"BalanceComprobacion!C780","v":"Mantenimiento de edificios varios"},{"$f":"BalanceComprobacion!D780","v":0},{"$f":"BalanceComprobacion!E780","v":17760122.5},{"$f":"BalanceComprobacion!F780","v":0},{"$f":"BalanceComprobacion!G780","v":17760122.5}]
[{"$f":"IFERROR(IF(B735<>0,Data!$B$2,\"\"),\"\")","v":"15603"},{"$f":"BalanceComprobacion!A781","v":3.1},{"$f":"BalanceComprobacion!B781","v":"5.1.2.08.02."},{"$f":"BalanceComprobacion!C781","v":"Mantenimiento y reparación de maquinaria y equipos para la producción"},{"$f":"BalanceComprobacion!D781","v":0},{"$f":"BalanceComprobacion!E781","v":11117621.800000001},{"$f":"BalanceComprobacion!F781","v":0},{"$f":"BalanceComprobacion!G781","v":11117621.800000001}]
[{"$f":"IFERROR(IF(B736<>0,Data!$B$2,\"\"),\"\")","v":"15603"},{"$f":"BalanceComprobacion!A782","v":3.1},{"$f":"BalanceComprobacion!B782","v":"5.1.2.08.02.00."},{"$f":"BalanceComprobacion!C782","v":"Mantenimiento y reparación de maquinaria y equipos para la producción"},{"$f":"BalanceComprobacion!D782","v":0},{"$f":"BalanceComprobacion!E782","v":11117621.800000001},{"$f":"BalanceComprobacion!F782","v":0},{"$f":"BalanceComprobacion!G782","v":11117621.800000001}]
[{"$f":"IFERROR(IF(B737<>0,Data!$B$2,\"\"),\"\")","v":"15603"},{"$f":"BalanceComprobacion!A783","v":3.1},{"$f":"BalanceComprobacion!B783","v":"5.1.2.08.02.00.0."},{"$f":"BalanceComprobacion!C783","v":"Mantenimiento y reparación de maquinaria y equipos para la producción"},{"$f":"BalanceComprobacion!D783","v":0},{"$f":"BalanceComprobacion!E783","v":11117621.800000001},{"$f":"BalanceComprobacion!F783","v":0},{"$f":"BalanceComprobacion!G783","v":11117621.800000001}]
[{"$f":"IFERROR(IF(B738<>0,Data!$B$2,\"\"),\"\")","v":"15603"},{"$f":"BalanceComprobacion!A784","v":3.1},{"$f":"BalanceComprobacion!B784","v":"5.1.2.08.02.00.0.99999"},{"$f":"BalanceComprobacion!C784","v":"Mantenimiento y reparación de maquinaria y equipos para la producción"},{"$f":"BalanceComprobacion!D784","v":0},{"$f":"BalanceComprobacion!E784","v":11117621.800000001},{"$f":"BalanceComprobacion!F784","v":0},{"$f":"BalanceComprobacion!G784","v":11117621.800000001}]
[{"$f":"IFERROR(IF(B739<>0,Data!$B$2,\"\"),\"\")","v":"15603"},{"$f":"BalanceComprobacion!A785","v":3.1},{"$f":"BalanceComprobacion!B785","v":"5.1.2.08.03."},{"$f":"BalanceComprobacion!C785","v":"Mantenimiento y reparación de equipos de transporte, tracción y elevación"},{"$f":"BalanceComprobacion!D785","v":0},{"$f":"BalanceComprobacion!E785","v":9270681.5199999996},{"$f":"BalanceComprobacion!F785","v":0},{"$f":"BalanceComprobacion!G785","v":9270681.5199999996}]
[{"$f":"IFERROR(IF(B740<>0,Data!$B$2,\"\"),\"\")","v":"15603"},{"$f":"BalanceComprobacion!A786","v":3.1},{"$f":"BalanceComprobacion!B786","v":"5.1.2.08.03.00."},{"$f":"BalanceComprobacion!C786","v":"Mantenimiento y reparación de equipos de transporte, tracción y elevación"},{"$f":"BalanceComprobacion!D786","v":0},{"$f":"BalanceComprobacion!E786","v":9270681.5199999996},{"$f":"BalanceComprobacion!F786","v":0},{"$f":"BalanceComprobacion!G786","v":9270681.5199999996}]
[{"$f":"IFERROR(IF(B741<>0,Data!$B$2,\"\"),\"\")","v":"15603"},{"$f":"BalanceComprobacion!A787","v":3.1},{"$f":"BalanceComprobacion!B787","v":"5.1.2.08.03.00.0."},{"$f":"BalanceComprobacion!C787","v":"Mantenimiento y reparación de equipos de transporte, tracción y elevación"},{"$f":"BalanceComprobacion!D787","v":0},{"$f":"BalanceComprobacion!E787","v":9270681.5199999996},{"$f":"BalanceComprobacion!F787","v":0},{"$f":"BalanceComprobacion!G787","v":9270681.5199999996}]
[{"$f":"IFERROR(IF(B742<>0,Data!$B$2,\"\"),\"\")","v":"15603"},{"$f":"BalanceComprobacion!A788","v":3.1},{"$f":"BalanceComprobacion!B788","v":"5.1.2.08.03.00.0.99999"},{"$f":"BalanceComprobacion!C788","v":"Mantenimiento y reparación de equipos de transporte, tracción y elevación"},{"$f":"BalanceComprobacion!D788","v":0},{"$f":"BalanceComprobacion!E788","v":9270681.5199999996},{"$f":"BalanceComprobacion!F788","v":0},{"$f":"BalanceComprobacion!G788","v":9270681.5199999996}]
[{"$f":"IFERROR(IF(B743<>0,Data!$B$2,\"\"),\"\")","v":"15603"},{"$f":"BalanceComprobacion!A789","v":3.1},{"$f":"BalanceComprobacion!B789","v":"5.1.2.08.05."},{"$f":"BalanceComprobacion!C789","v":"Mantenimiento y reparación de equipos y mobiliario de oficina"},{"$f":"BalanceComprobacion!D789","v":0},{"$f":"BalanceComprobacion!E789","v":280999.96999999997},{"$f":"BalanceComprobacion!F789","v":0},{"$f":"BalanceComprobacion!G789","v":280999.96999999997}]
[{"$f":"IFERROR(IF(B744<>0,Data!$B$2,\"\"),\"\")","v":"15603"},{"$f":"BalanceComprobacion!A790","v":3.1},{"$f":"BalanceComprobacion!B790","v":"5.1.2.08.05.00."},{"$f":"BalanceComprobacion!C790","v":"Mantenimiento y reparación de equipos y mobiliario de oficina"},{"$f":"BalanceComprobacion!D790","v":0},{"$f":"BalanceComprobacion!E790","v":280999.96999999997},{"$f":"BalanceComprobacion!F790","v":0},{"$f":"BalanceComprobacion!G790","v":280999.96999999997}]
[{"$f":"IFERROR(IF(B745<>0,Data!$B$2,\"\"),\"\")","v":"15603"},{"$f":"BalanceComprobacion!A791","v":3.1},{"$f":"BalanceComprobacion!B791","v":"5.1.2.08.05.00.0."},{"$f":"BalanceComprobacion!C791","v":"Mantenimiento y reparación de equipos y mobiliario de oficina"},{"$f":"BalanceComprobacion!D791","v":0},{"$f":"BalanceComprobacion!E791","v":280999.96999999997},{"$f":"BalanceComprobacion!F791","v":0},{"$f":"BalanceComprobacion!G791","v":280999.96999999997}]
[{"$f":"IFERROR(IF(B746<>0,Data!$B$2,\"\"),\"\")","v":"15603"},{"$f":"BalanceComprobacion!A792","v":3.1},{"$f":"BalanceComprobacion!B792","v":"5.1.2.08.05.00.0.99999"},{"$f":"BalanceComprobacion!C792","v":"Mantenimiento y reparación de equipos y mobiliario de oficina"},{"$f":"BalanceComprobacion!D792","v":0},{"$f":"BalanceComprobacion!E792","v":280999.96999999997},{"$f":"BalanceComprobacion!F792","v":0},{"$f":"BalanceComprobacion!G792","v":280999.96999999997}]
[{"$f":"IFERROR(IF(B747<>0,Data!$B$2,\"\"),\"\")","v":"15603"},{"$f":"BalanceComprobacion!A793","v":3.1},{"$f":"BalanceComprobacion!B793","v":"5.1.2.08.10."},{"$f":"BalanceComprobacion!C793","v":"Mantenimiento y reparación de bienes de infraestructura y de beneficio y uso público"},{"$f":"BalanceComprobacion!D793","v":0},{"$f":"BalanceComprobacion!E793","v":826909611.63},{"$f":"BalanceComprobacion!F793","v":0},{"$f":"BalanceComprobacion!G793","v":826909611.63}]
[{"$f":"IFERROR(IF(B748<>0,Data!$B$2,\"\"),\"\")","v":"15603"},{"$f":"BalanceComprobacion!A794","v":3.1},{"$f":"BalanceComprobacion!B794","v":"5.1.2.08.10.00."},{"$f":"BalanceComprobacion!C794","v":"Mantenimiento y reparación de bienes de infraestructura y de beneficio y uso público"},{"$f":"BalanceComprobacion!D794","v":0},{"$f":"BalanceComprobacion!E794","v":826909611.63},{"$f":"BalanceComprobacion!F794","v":0},{"$f":"BalanceComprobacion!G794","v":826909611.63}]
[{"$f":"IFERROR(IF(B749<>0,Data!$B$2,\"\"),\"\")","v":"15603"},{"$f":"BalanceComprobacion!A795","v":3.1},{"$f":"BalanceComprobacion!B795","v":"5.1.2.08.10.00.0."},{"$f":"BalanceComprobacion!C795","v":"Mantenimiento y reparación de bienes de infraestructura y de beneficio y uso público"},{"$f":"BalanceComprobacion!D795","v":0},{"$f":"BalanceComprobacion!E795","v":826909611.63},{"$f":"BalanceComprobacion!F795","v":0},{"$f":"BalanceComprobacion!G795","v":826909611.63}]
[{"$f":"IFERROR(IF(B750<>0,Data!$B$2,\"\"),\"\")","v":"15603"},{"$f":"BalanceComprobacion!A796","v":3.1},{"$f":"BalanceComprobacion!B796","v":"5.1.2.08.10.00.0.99999"},{"$f":"BalanceComprobacion!C796","v":"Mantenimiento y reparación de bienes de infraestructura y de beneficio y uso público"},{"$f":"BalanceComprobacion!D796","v":0},{"$f":"BalanceComprobacion!E796","v":826909611.63},{"$f":"BalanceComprobacion!F796","v":0},{"$f":"BalanceComprobacion!G796","v":826909611.63}]
[{"$f":"IFERROR(IF(B751<>0,Data!$B$2,\"\"),\"\")","v":"15603"},{"$f":"BalanceComprobacion!A797","v":3.1},{"$f":"BalanceComprobacion!B797","v":"5.1.3."},{"$f":"BalanceComprobacion!C797","v":"Materiales y suministros consumidos"},{"$f":"BalanceComprobacion!D797","v":0},{"$f":"BalanceComprobacion!E797","v":270386601.55000001},{"$f":"BalanceComprobacion!F797","v":25154551.84},{"$f":"BalanceComprobacion!G797","v":245232049.71000001}]
[{"$f":"IFERROR(IF(B752<>0,Data!$B$2,\"\"),\"\")","v":"15603"},{"$f":"BalanceComprobacion!A798","v":3.1},{"$f":"BalanceComprobacion!B798","v":"5.1.3.01."},{"$f":"BalanceComprobacion!C798","v":"Productos químicos y conexos"},{"$f":"BalanceComprobacion!D798","v":0},{"$f":"BalanceComprobacion!E798","v":76894056.920000002},{"$f":"BalanceComprobacion!F798","v":1475642.7},{"$f":"BalanceComprobacion!G798","v":75418414.219999999}]
[{"$f":"IFERROR(IF(B753<>0,Data!$B$2,\"\"),\"\")","v":"15603"},{"$f":"BalanceComprobacion!A799","v":3.1},{"$f":"BalanceComprobacion!B799","v":"5.1.3.01.01."},{"$f":"BalanceComprobacion!C799","v":"Combustibles y lubricantes"},{"$f":"BalanceComprobacion!D799","v":0},{"$f":"BalanceComprobacion!E799","v":73118074.730000004},{"$f":"BalanceComprobacion!F799","v":0},{"$f":"BalanceComprobacion!G799","v":73118074.730000004}]
[{"$f":"IFERROR(IF(B754<>0,Data!$B$2,\"\"),\"\")","v":"15603"},{"$f":"BalanceComprobacion!A800","v":3.1},{"$f":"BalanceComprobacion!B800","v":"5.1.3.01.01.00."},{"$f":"BalanceComprobacion!C800","v":"Combustibles y lubricantes"},{"$f":"BalanceComprobacion!D800","v":0},{"$f":"BalanceComprobacion!E800","v":73118074.730000004},{"$f":"BalanceComprobacion!F800","v":0},{"$f":"BalanceComprobacion!G800","v":73118074.730000004}]
[{"$f":"IFERROR(IF(B755<>0,Data!$B$2,\"\"),\"\")","v":"15603"},{"$f":"BalanceComprobacion!A801","v":3.1},{"$f":"BalanceComprobacion!B801","v":"5.1.3.01.01.00.0."},{"$f":"BalanceComprobacion!C801","v":"Combustibles y lubricantes"},{"$f":"BalanceComprobacion!D801","v":0},{"$f":"BalanceComprobacion!E801","v":73118074.730000004},{"$f":"BalanceComprobacion!F801","v":0},{"$f":"BalanceComprobacion!G801","v":73118074.730000004}]
[{"$f":"IFERROR(IF(B756<>0,Data!$B$2,\"\"),\"\")","v":"15603"},{"$f":"BalanceComprobacion!A802","v":3.1},{"$f":"BalanceComprobacion!B802","v":"5.1.3.01.01.00.0.99999"},{"$f":"BalanceComprobacion!C802","v":"Combustibles y lubricantes"},{"$f":"BalanceComprobacion!D802","v":0},{"$f":"BalanceComprobacion!E802","v":73118074.730000004},{"$f":"BalanceComprobacion!F802","v":0},{"$f":"BalanceComprobacion!G802","v":73118074.730000004}]
[{"$f":"IFERROR(IF(B757<>0,Data!$B$2,\"\"),\"\")","v":"15603"},{"$f":"BalanceComprobacion!A803","v":3.1},{"$f":"BalanceComprobacion!B803","v":"5.1.3.01.02."},{"$f":"BalanceComprobacion!C803","v":"Productos farmacéuticos y medicinales"},{"$f":"BalanceComprobacion!D803","v":0},{"$f":"BalanceComprobacion!E803","v":1507742.84},{"$f":"BalanceComprobacion!F803","v":675000},{"$f":"BalanceComprobacion!G803","v":832742.84}]
[{"$f":"IFERROR(IF(B758<>0,Data!$B$2,\"\"),\"\")","v":"15603"},{"$f":"BalanceComprobacion!A804","v":3.1},{"$f":"BalanceComprobacion!B804","v":"5.1.3.01.02.00."},{"$f":"BalanceComprobacion!C804","v":"Productos farmacéuticos y medicinales"},{"$f":"BalanceComprobacion!D804","v":0},{"$f":"BalanceComprobacion!E804","v":1507742.84},{"$f":"BalanceComprobacion!F804","v":675000},{"$f":"BalanceComprobacion!G804","v":832742.84}]
[{"$f":"IFERROR(IF(B759<>0,Data!$B$2,\"\"),\"\")","v":"15603"},{"$f":"BalanceComprobacion!A805","v":3.1},{"$f":"BalanceComprobacion!B805","v":"5.1.3.01.02.00.0."},{"$f":"BalanceComprobacion!C805","v":"Productos farmacéuticos y medicinales"},{"$f":"BalanceComprobacion!D805","v":0},{"$f":"BalanceComprobacion!E805","v":1507742.84},{"$f":"BalanceComprobacion!F805","v":675000},{"$f":"BalanceComprobacion!G805","v":832742.84}]
[{"$f":"IFERROR(IF(B760<>0,Data!$B$2,\"\"),\"\")","v":"15603"},{"$f":"BalanceComprobacion!A806","v":3.1},{"$f":"BalanceComprobacion!B806","v":"5.1.3.01.02.00.0.99999"},{"$f":"BalanceComprobacion!C806","v":"Productos farmacéuticos y medicinales"},{"$f":"BalanceComprobacion!D806","v":0},{"$f":"BalanceComprobacion!E806","v":1507742.84},{"$f":"BalanceComprobacion!F806","v":675000},{"$f":"BalanceComprobacion!G806","v":832742.84}]
[{"$f":"IFERROR(IF(B761<>0,Data!$B$2,\"\"),\"\")","v":"15603"},{"$f":"BalanceComprobacion!A807","v":3.1},{"$f":"BalanceComprobacion!B807","v":"5.1.3.01.04."},{"$f":"BalanceComprobacion!C807","v":"Tintas, pinturas y diluyentes"},{"$f":"BalanceComprobacion!D807","v":0},{"$f":"BalanceComprobacion!E807","v":1641115.35},{"$f":"BalanceComprobacion!F807","v":767042.7},{"$f":"BalanceComprobacion!G807","v":874072.65}]
[{"$f":"IFERROR(IF(B762<>0,Data!$B$2,\"\"),\"\")","v":"15603"},{"$f":"BalanceComprobacion!A808","v":3.1},{"$f":"BalanceComprobacion!B808","v":"5.1.3.01.04.00."},{"$f":"BalanceComprobacion!C808","v":"Tintas, pinturas y diluyentes"},{"$f":"BalanceComprobacion!D808","v":0},{"$f":"BalanceComprobacion!E808","v":1641115.35},{"$f":"BalanceComprobacion!F808","v":767042.7},{"$f":"BalanceComprobacion!G808","v":874072.65}]
[{"$f":"IFERROR(IF(B763<>0,Data!$B$2,\"\"),\"\")","v":"15603"},{"$f":"BalanceComprobacion!A809","v":3.1},{"$f":"BalanceComprobacion!B809","v":"5.1.3.01.04.00.0."},{"$f":"BalanceComprobacion!C809","v":"Tintas, pinturas y diluyentes"},{"$f":"BalanceComprobacion!D809","v":0},{"$f":"BalanceComprobacion!E809","v":1641115.35},{"$f":"BalanceComprobacion!F809","v":767042.7},{"$f":"BalanceComprobacion!G809","v":874072.65}]
[{"$f":"IFERROR(IF(B764<>0,Data!$B$2,\"\"),\"\")","v":"15603"},{"$f":"BalanceComprobacion!A810","v":3.1},{"$f":"BalanceComprobacion!B810","v":"5.1.3.01.04.00.0.99999"},{"$f":"BalanceComprobacion!C810","v":"Tintas, pinturas y diluyentes"},{"$f":"BalanceComprobacion!D810","v":0},{"$f":"BalanceComprobacion!E810","v":1641115.35},{"$f":"BalanceComprobacion!F810","v":767042.7},{"$f":"BalanceComprobacion!G810","v":874072.65}]
[{"$f":"IFERROR(IF(B765<>0,Data!$B$2,\"\"),\"\")","v":"15603"},{"$f":"BalanceComprobacion!A811","v":3.1},{"$f":"BalanceComprobacion!B811","v":"5.1.3.01.99."},{"$f":"BalanceComprobacion!C811","v":"Otros productos químicos y conexos"},{"$f":"BalanceComprobacion!D811","v":0},{"$f":"BalanceComprobacion!E811","v":627124},{"$f":"BalanceComprobacion!F811","v":33600},{"$f":"BalanceComprobacion!G811","v":593524}]
[{"$f":"IFERROR(IF(B766<>0,Data!$B$2,\"\"),\"\")","v":"15603"},{"$f":"BalanceComprobacion!A812","v":3.1},{"$f":"BalanceComprobacion!B812","v":"5.1.3.01.99.00."},{"$f":"BalanceComprobacion!C812","v":"Otros productos químicos y conexos"},{"$f":"BalanceComprobacion!D812","v":0},{"$f":"BalanceComprobacion!E812","v":627124},{"$f":"BalanceComprobacion!F812","v":33600},{"$f":"BalanceComprobacion!G812","v":593524}]
[{"$f":"IFERROR(IF(B767<>0,Data!$B$2,\"\"),\"\")","v":"15603"},{"$f":"BalanceComprobacion!A813","v":3.1},{"$f":"BalanceComprobacion!B813","v":"5.1.3.01.99.00.0."},{"$f":"BalanceComprobacion!C813","v":"Otros productos químicos y conexos"},{"$f":"BalanceComprobacion!D813","v":0},{"$f":"BalanceComprobacion!E813","v":627124},{"$f":"BalanceComprobacion!F813","v":33600},{"$f":"BalanceComprobacion!G813","v":593524}]
[{"$f":"IFERROR(IF(B768<>0,Data!$B$2,\"\"),\"\")","v":"15603"},{"$f":"BalanceComprobacion!A814","v":3.1},{"$f":"BalanceComprobacion!B814","v":"5.1.3.01.99.00.0.99999"},{"$f":"BalanceComprobacion!C814","v":"Otros productos químicos y conexos"},{"$f":"BalanceComprobacion!D814","v":0},{"$f":"BalanceComprobacion!E814","v":627124},{"$f":"BalanceComprobacion!F814","v":33600},{"$f":"BalanceComprobacion!G814","v":593524}]
[{"$f":"IFERROR(IF(B769<>0,Data!$B$2,\"\"),\"\")","v":"15603"},{"$f":"BalanceComprobacion!A815","v":3.1},{"$f":"BalanceComprobacion!B815","v":"5.1.3.02."},{"$f":"BalanceComprobacion!C815","v":"Alimentos y productos agropecuarios"},{"$f":"BalanceComprobacion!D815","v":0},{"$f":"BalanceComprobacion!E815","v":2460705},{"$f":"BalanceComprobacion!F815","v":0},{"$f":"BalanceComprobacion!G815","v":2460705}]
[{"$f":"IFERROR(IF(B770<>0,Data!$B$2,\"\"),\"\")","v":"15603"},{"$f":"BalanceComprobacion!A816","v":3.1},{"$f":"BalanceComprobacion!B816","v":"5.1.3.02.03."},{"$f":"BalanceComprobacion!C816","v":"Alimentos y bebidas"},{"$f":"BalanceComprobacion!D816","v":0},{"$f":"BalanceComprobacion!E816","v":2460705},{"$f":"BalanceComprobacion!F816","v":0},{"$f":"BalanceComprobacion!G816","v":2460705}]
[{"$f":"IFERROR(IF(B771<>0,Data!$B$2,\"\"),\"\")","v":"15603"},{"$f":"BalanceComprobacion!A817","v":3.1},{"$f":"BalanceComprobacion!B817","v":"5.1.3.02.03.00."},{"$f":"BalanceComprobacion!C817","v":"Alimentos y bebidas"},{"$f":"BalanceComprobacion!D817","v":0},{"$f":"BalanceComprobacion!E817","v":2460705},{"$f":"BalanceComprobacion!F817","v":0},{"$f":"BalanceComprobacion!G817","v":2460705}]
[{"$f":"IFERROR(IF(B772<>0,Data!$B$2,\"\"),\"\")","v":"15603"},{"$f":"BalanceComprobacion!A818","v":3.1},{"$f":"BalanceComprobacion!B818","v":"5.1.3.02.03.00.0."},{"$f":"BalanceComprobacion!C818","v":"Alimentos y bebidas"},{"$f":"BalanceComprobacion!D818","v":0},{"$f":"BalanceComprobacion!E818","v":2460705},{"$f":"BalanceComprobacion!F818","v":0},{"$f":"BalanceComprobacion!G818","v":2460705}]
[{"$f":"IFERROR(IF(B773<>0,Data!$B$2,\"\"),\"\")","v":"15603"},{"$f":"BalanceComprobacion!A819","v":3.1},{"$f":"BalanceComprobacion!B819","v":"5.1.3.02.03.00.0.99999"},{"$f":"BalanceComprobacion!C819","v":"Alimentos y bebidas"},{"$f":"BalanceComprobacion!D819","v":0},{"$f":"BalanceComprobacion!E819","v":2460705},{"$f":"BalanceComprobacion!F819","v":0},{"$f":"BalanceComprobacion!G819","v":2460705}]
[{"$f":"IFERROR(IF(B774<>0,Data!$B$2,\"\"),\"\")","v":"15603"},{"$f":"BalanceComprobacion!A820","v":3.1},{"$f":"BalanceComprobacion!B820","v":"5.1.3.03."},{"$f":"BalanceComprobacion!C820","v":"Material y producto uso en la construc y mantenim"},{"$f":"BalanceComprobacion!D820","v":0},{"$f":"BalanceComprobacion!E820","v":107891537.55},{"$f":"BalanceComprobacion!F820","v":3332210.2},{"$f":"BalanceComprobacion!G820","v":104559327.34999999}]
[{"$f":"IFERROR(IF(B775<>0,Data!$B$2,\"\"),\"\")","v":"15603"},{"$f":"BalanceComprobacion!A821","v":3.1},{"$f":"BalanceComprobacion!B821","v":"5.1.3.03.01."},{"$f":"BalanceComprobacion!C821","v":"Materiales y productos metálicos"},{"$f":"BalanceComprobacion!D821","v":0},{"$f":"BalanceComprobacion!E821","v":3291369.82},{"$f":"BalanceComprobacion!F821","v":263620},{"$f":"BalanceComprobacion!G821","v":3027749.82}]
[{"$f":"IFERROR(IF(B776<>0,Data!$B$2,\"\"),\"\")","v":"15603"},{"$f":"BalanceComprobacion!A822","v":3.1},{"$f":"BalanceComprobacion!B822","v":"5.1.3.03.01.00."},{"$f":"BalanceComprobacion!C822","v":"Materiales y productos metálicos"},{"$f":"BalanceComprobacion!D822","v":0},{"$f":"BalanceComprobacion!E822","v":3291369.82},{"$f":"BalanceComprobacion!F822","v":263620},{"$f":"BalanceComprobacion!G822","v":3027749.82}]
[{"$f":"IFERROR(IF(B777<>0,Data!$B$2,\"\"),\"\")","v":"15603"},{"$f":"BalanceComprobacion!A823","v":3.1},{"$f":"BalanceComprobacion!B823","v":"5.1.3.03.01.00.0."},{"$f":"BalanceComprobacion!C823","v":"Materiales y productos metálicos"},{"$f":"BalanceComprobacion!D823","v":0},{"$f":"BalanceComprobacion!E823","v":3291369.82},{"$f":"BalanceComprobacion!F823","v":263620},{"$f":"BalanceComprobacion!G823","v":3027749.82}]
[{"$f":"IFERROR(IF(B778<>0,Data!$B$2,\"\"),\"\")","v":"15603"},{"$f":"BalanceComprobacion!A824","v":3.1},{"$f":"BalanceComprobacion!B824","v":"5.1.3.03.01.00.0.99999"},{"$f":"BalanceComprobacion!C824","v":"Materiales y productos metálicos"},{"$f":"BalanceComprobacion!D824","v":0},{"$f":"BalanceComprobacion!E824","v":3291369.82},{"$f":"BalanceComprobacion!F824","v":263620},{"$f":"BalanceComprobacion!G824","v":3027749.82}]
[{"$f":"IFERROR(IF(B779<>0,Data!$B$2,\"\"),\"\")","v":"15603"},{"$f":"BalanceComprobacion!A825","v":3.1},{"$f":"BalanceComprobacion!B825","v":"5.1.3.03.02."},{"$f":"BalanceComprobacion!C825","v":"Materiales y productos minerales y asfálticos"},{"$f":"BalanceComprobacion!D825","v":0},{"$f":"BalanceComprobacion!E825","v":101038665},{"$f":"BalanceComprobacion!F825","v":3004645.2},{"$f":"BalanceComprobacion!G825","v":98034019.799999997}]
[{"$f":"IFERROR(IF(B780<>0,Data!$B$2,\"\"),\"\")","v":"15603"},{"$f":"BalanceComprobacion!A826","v":3.1},{"$f":"BalanceComprobacion!B826","v":"5.1.3.03.02.00."},{"$f":"BalanceComprobacion!C826","v":"Materiales y productos minerales y asfálticos"},{"$f":"BalanceComprobacion!D826","v":0},{"$f":"BalanceComprobacion!E826","v":101038665},{"$f":"BalanceComprobacion!F826","v":3004645.2},{"$f":"BalanceComprobacion!G826","v":98034019.799999997}]
[{"$f":"IFERROR(IF(B781<>0,Data!$B$2,\"\"),\"\")","v":"15603"},{"$f":"BalanceComprobacion!A827","v":3.1},{"$f":"BalanceComprobacion!B827","v":"5.1.3.03.02.00.0."},{"$f":"BalanceComprobacion!C827","v":"Materiales y productos minerales y asfálticos"},{"$f":"BalanceComprobacion!D827","v":0},{"$f":"BalanceComprobacion!E827","v":101038665},{"$f":"BalanceComprobacion!F827","v":3004645.2},{"$f":"BalanceComprobacion!G827","v":98034019.799999997}]
[{"$f":"IFERROR(IF(B782<>0,Data!$B$2,\"\"),\"\")","v":"15603"},{"$f":"BalanceComprobacion!A828","v":3.1},{"$f":"BalanceComprobacion!B828","v":"5.1.3.03.02.00.0.99999"},{"$f":"BalanceComprobacion!C828","v":"Materiales y productos minerales y asfálticos"},{"$f":"BalanceComprobacion!D828","v":0},{"$f":"BalanceComprobacion!E828","v":101038665},{"$f":"BalanceComprobacion!F828","v":3004645.2},{"$f":"BalanceComprobacion!G828","v":98034019.799999997}]
[{"$f":"IFERROR(IF(B783<>0,Data!$B$2,\"\"),\"\")","v":"15603"},{"$f":"BalanceComprobacion!A829","v":3.1},{"$f":"BalanceComprobacion!B829","v":"5.1.3.03.03."},{"$f":"BalanceComprobacion!C829","v":"Madera y sus derivados"},{"$f":"BalanceComprobacion!D829","v":0},{"$f":"BalanceComprobacion!E829","v":1531070},{"$f":"BalanceComprobacion!F829","v":63945},{"$f":"BalanceComprobacion!G829","v":1467125}]
[{"$f":"IFERROR(IF(B784<>0,Data!$B$2,\"\"),\"\")","v":"15603"},{"$f":"BalanceComprobacion!A830","v":3.1},{"$f":"BalanceComprobacion!B830","v":"5.1.3.03.03.00."},{"$f":"BalanceComprobacion!C830","v":"Madera y sus derivados"},{"$f":"BalanceComprobacion!D830","v":0},{"$f":"BalanceComprobacion!E830","v":1531070},{"$f":"BalanceComprobacion!F830","v":63945},{"$f":"BalanceComprobacion!G830","v":1467125}]
[{"$f":"IFERROR(IF(B785<>0,Data!$B$2,\"\"),\"\")","v":"15603"},{"$f":"BalanceComprobacion!A831","v":3.1},{"$f":"BalanceComprobacion!B831","v":"5.1.3.03.03.00.0."},{"$f":"BalanceComprobacion!C831","v":"Madera y sus derivados"},{"$f":"BalanceComprobacion!D831","v":0},{"$f":"BalanceComprobacion!E831","v":1531070},{"$f":"BalanceComprobacion!F831","v":63945},{"$f":"BalanceComprobacion!G831","v":1467125}]
[{"$f":"IFERROR(IF(B786<>0,Data!$B$2,\"\"),\"\")","v":"15603"},{"$f":"BalanceComprobacion!A832","v":3.1},{"$f":"BalanceComprobacion!B832","v":"5.1.3.03.03.00.0.99999"},{"$f":"BalanceComprobacion!C832","v":"Madera y sus derivados"},{"$f":"BalanceComprobacion!D832","v":0},{"$f":"BalanceComprobacion!E832","v":1531070},{"$f":"BalanceComprobacion!F832","v":63945},{"$f":"BalanceComprobacion!G832","v":1467125}]
[{"$f":"IFERROR(IF(B787<>0,Data!$B$2,\"\"),\"\")","v":"15603"},{"$f":"BalanceComprobacion!A833","v":3.1},{"$f":"BalanceComprobacion!B833","v":"5.1.3.03.04."},{"$f":"BalanceComprobacion!C833","v":"Material y producto eléctrico, telefónic y cómputo"},{"$f":"BalanceComprobacion!D833","v":0},{"$f":"BalanceComprobacion!E833","v":1783935.41},{"$f":"BalanceComprobacion!F833","v":0},{"$f":"BalanceComprobacion!G833","v":1783935.41}]
[{"$f":"IFERROR(IF(B788<>0,Data!$B$2,\"\"),\"\")","v":"15603"},{"$f":"BalanceComprobacion!A834","v":3.1},{"$f":"BalanceComprobacion!B834","v":"5.1.3.03.04.00."},{"$f":"BalanceComprobacion!C834","v":"Material y producto eléctrico, telefónic y cómputo"},{"$f":"BalanceComprobacion!D834","v":0},{"$f":"BalanceComprobacion!E834","v":1783935.41},{"$f":"BalanceComprobacion!F834","v":0},{"$f":"BalanceComprobacion!G834","v":1783935.41}]
[{"$f":"IFERROR(IF(B789<>0,Data!$B$2,\"\"),\"\")","v":"15603"},{"$f":"BalanceComprobacion!A835","v":3.1},{"$f":"BalanceComprobacion!B835","v":"5.1.3.03.04.00.0."},{"$f":"BalanceComprobacion!C835","v":"Material y producto eléctrico, telefónic y cómputo"},{"$f":"BalanceComprobacion!D835","v":0},{"$f":"BalanceComprobacion!E835","v":1783935.41},{"$f":"BalanceComprobacion!F835","v":0},{"$f":"BalanceComprobacion!G835","v":1783935.41}]
[{"$f":"IFERROR(IF(B790<>0,Data!$B$2,\"\"),\"\")","v":"15603"},{"$f":"BalanceComprobacion!A836","v":3.1},{"$f":"BalanceComprobacion!B836","v":"5.1.3.03.04.00.0.99999"},{"$f":"BalanceComprobacion!C836","v":"Material y producto eléctrico, telefónic y cómputo"},{"$f":"BalanceComprobacion!D836","v":0},{"$f":"BalanceComprobacion!E836","v":1783935.41},{"$f":"BalanceComprobacion!F836","v":0},{"$f":"BalanceComprobacion!G836","v":1783935.41}]
[{"$f":"IFERROR(IF(B791<>0,Data!$B$2,\"\"),\"\")","v":"15603"},{"$f":"BalanceComprobacion!A837","v":3.1},{"$f":"BalanceComprobacion!B837","v":"5.1.3.03.06."},{"$f":"BalanceComprobacion!C837","v":"Materiales y productos de plástico"},{"$f":"BalanceComprobacion!D837","v":0},{"$f":"BalanceComprobacion!E837","v":246497.32},{"$f":"BalanceComprobacion!F837","v":0},{"$f":"BalanceComprobacion!G837","v":246497.32}]
[{"$f":"IFERROR(IF(B792<>0,Data!$B$2,\"\"),\"\")","v":"15603"},{"$f":"BalanceComprobacion!A838","v":3.1},{"$f":"BalanceComprobacion!B838","v":"5.1.3.03.06.00."},{"$f":"BalanceComprobacion!C838","v":"Materiales y productos de plástico"},{"$f":"BalanceComprobacion!D838","v":0},{"$f":"BalanceComprobacion!E838","v":246497.32},{"$f":"BalanceComprobacion!F838","v":0},{"$f":"BalanceComprobacion!G838","v":246497.32}]
[{"$f":"IFERROR(IF(B793<>0,Data!$B$2,\"\"),\"\")","v":"15603"},{"$f":"BalanceComprobacion!A839","v":3.1},{"$f":"BalanceComprobacion!B839","v":"5.1.3.03.06.00.0."},{"$f":"BalanceComprobacion!C839","v":"Materiales y productos de plástico"},{"$f":"BalanceComprobacion!D839","v":0},{"$f":"BalanceComprobacion!E839","v":246497.32},{"$f":"BalanceComprobacion!F839","v":0},{"$f":"BalanceComprobacion!G839","v":246497.32}]
[{"$f":"IFERROR(IF(B794<>0,Data!$B$2,\"\"),\"\")","v":"15603"},{"$f":"BalanceComprobacion!A840","v":3.1},{"$f":"BalanceComprobacion!B840","v":"5.1.3.03.06.00.0.99999"},{"$f":"BalanceComprobacion!C840","v":"Materiales y productos de plástico"},{"$f":"BalanceComprobacion!D840","v":0},{"$f":"BalanceComprobacion!E840","v":246497.32},{"$f":"BalanceComprobacion!F840","v":0},{"$f":"BalanceComprobacion!G840","v":246497.32}]
[{"$f":"IFERROR(IF(B795<>0,Data!$B$2,\"\"),\"\")","v":"15603"},{"$f":"BalanceComprobacion!A841","v":3.1},{"$f":"BalanceComprobacion!B841","v":"5.1.3.04."},{"$f":"BalanceComprobacion!C841","v":"Herramientas, repuestos y accesorios"},{"$f":"BalanceComprobacion!D841","v":0},{"$f":"BalanceComprobacion!E841","v":50390566.350000001},{"$f":"BalanceComprobacion!F841","v":11554099.48},{"$f":"BalanceComprobacion!G841","v":38836466.869999997}]
[{"$f":"IFERROR(IF(B796<>0,Data!$B$2,\"\"),\"\")","v":"15603"},{"$f":"BalanceComprobacion!A842","v":3.1},{"$f":"BalanceComprobacion!B842","v":"5.1.3.04.01."},{"$f":"BalanceComprobacion!C842","v":"Herramientas e instrumentos"},{"$f":"BalanceComprobacion!D842","v":0},{"$f":"BalanceComprobacion!E842","v":412156.69},{"$f":"BalanceComprobacion!F842","v":412156.69},{"$f":"BalanceComprobacion!G842","v":0}]
[{"$f":"IFERROR(IF(B797<>0,Data!$B$2,\"\"),\"\")","v":"15603"},{"$f":"BalanceComprobacion!A843","v":3.1},{"$f":"BalanceComprobacion!B843","v":"5.1.3.04.01.00."},{"$f":"BalanceComprobacion!C843","v":"Herramientas e instrumentos"},{"$f":"BalanceComprobacion!D843","v":0},{"$f":"BalanceComprobacion!E843","v":412156.69},{"$f":"BalanceComprobacion!F843","v":412156.69},{"$f":"BalanceComprobacion!G843","v":0}]
[{"$f":"IFERROR(IF(B798<>0,Data!$B$2,\"\"),\"\")","v":"15603"},{"$f":"BalanceComprobacion!A844","v":3.1},{"$f":"BalanceComprobacion!B844","v":"5.1.3.04.01.00.0."},{"$f":"BalanceComprobacion!C844","v":"Herramientas e instrumentos nuevos"},{"$f":"BalanceComprobacion!D844","v":0},{"$f":"BalanceComprobacion!E844","v":412156.69},{"$f":"BalanceComprobacion!F844","v":412156.69},{"$f":"BalanceComprobacion!G844","v":0}]
[{"$f":"IFERROR(IF(B799<>0,Data!$B$2,\"\"),\"\")","v":"15603"},{"$f":"BalanceComprobacion!A845","v":3.1},{"$f":"BalanceComprobacion!B845","v":"5.1.3.04.01.00.0.99999"},{"$f":"BalanceComprobacion!C845","v":"Herramientas e instrumentos nuevos"},{"$f":"BalanceComprobacion!D845","v":0},{"$f":"BalanceComprobacion!E845","v":412156.69},{"$f":"BalanceComprobacion!F845","v":412156.69},{"$f":"BalanceComprobacion!G845","v":0}]
[{"$f":"IFERROR(IF(B800<>0,Data!$B$2,\"\"),\"\")","v":"15603"},{"$f":"BalanceComprobacion!A846","v":3.1},{"$f":"BalanceComprobacion!B846","v":"5.1.3.04.02."},{"$f":"BalanceComprobacion!C846","v":"Repuestos y accesorios"},{"$f":"BalanceComprobacion!D846","v":0},{"$f":"BalanceComprobacion!E846","v":49978409.659999996},{"$f":"BalanceComprobacion!F846","v":11141942.789999999},{"$f":"BalanceComprobacion!G846","v":38836466.869999997}]
[{"$f":"IFERROR(IF(B801<>0,Data!$B$2,\"\"),\"\")","v":"15603"},{"$f":"BalanceComprobacion!A847","v":3.1},{"$f":"BalanceComprobacion!B847","v":"5.1.3.04.02.01."},{"$f":"BalanceComprobacion!C847","v":"Repuestos y accesorios Nuevos"},{"$f":"BalanceComprobacion!D847","v":0},{"$f":"BalanceComprobacion!E847","v":49978409.659999996},{"$f":"BalanceComprobacion!F847","v":11141942.789999999},{"$f":"BalanceComprobacion!G847","v":38836466.869999997}]
[{"$f":"IFERROR(IF(B802<>0,Data!$B$2,\"\"),\"\")","v":"15603"},{"$f":"BalanceComprobacion!A848","v":3.1},{"$f":"BalanceComprobacion!B848","v":"5.1.3.04.02.01.0."},{"$f":"BalanceComprobacion!C848","v":"Repuestos y accesorios Nuevos"},{"$f":"BalanceComprobacion!D848","v":0},{"$f":"BalanceComprobacion!E848","v":49978409.659999996},{"$f":"BalanceComprobacion!F848","v":11141942.789999999},{"$f":"BalanceComprobacion!G848","v":38836466.869999997}]
[{"$f":"IFERROR(IF(B803<>0,Data!$B$2,\"\"),\"\")","v":"15603"},{"$f":"BalanceComprobacion!A849","v":3.1},{"$f":"BalanceComprobacion!B849","v":"5.1.3.04.02.01.0.99999"},{"$f":"BalanceComprobacion!C849","v":"Repuestos y accesorios Nuevos"},{"$f":"BalanceComprobacion!D849","v":0},{"$f":"BalanceComprobacion!E849","v":49978409.659999996},{"$f":"BalanceComprobacion!F849","v":11141942.789999999},{"$f":"BalanceComprobacion!G849","v":38836466.869999997}]
[{"$f":"IFERROR(IF(B804<>0,Data!$B$2,\"\"),\"\")","v":"15603"},{"$f":"BalanceComprobacion!A850","v":3.1},{"$f":"BalanceComprobacion!B850","v":"5.1.3.99."},{"$f":"BalanceComprobacion!C850","v":"Útiles, materiales y suministros diversos"},{"$f":"BalanceComprobacion!D850","v":0},{"$f":"BalanceComprobacion!E850","v":32749735.73},{"$f":"BalanceComprobacion!F850","v":8792599.4600000009},{"$f":"BalanceComprobacion!G850","v":23957136.27}]
[{"$f":"IFERROR(IF(B805<>0,Data!$B$2,\"\"),\"\")","v":"15603"},{"$f":"BalanceComprobacion!A851","v":3.1},{"$f":"BalanceComprobacion!B851","v":"5.1.3.99.01."},{"$f":"BalanceComprobacion!C851","v":"Útiles y materiales de oficina y cómputo"},{"$f":"BalanceComprobacion!D851","v":0},{"$f":"BalanceComprobacion!E851","v":1538159.95},{"$f":"BalanceComprobacion!F851","v":297931.44},{"$f":"BalanceComprobacion!G851","v":1240228.51}]
[{"$f":"IFERROR(IF(B806<>0,Data!$B$2,\"\"),\"\")","v":"15603"},{"$f":"BalanceComprobacion!A852","v":3.1},{"$f":"BalanceComprobacion!B852","v":"5.1.3.99.01.00."},{"$f":"BalanceComprobacion!C852","v":"Útiles y materiales de oficina y cómputo"},{"$f":"BalanceComprobacion!D852","v":0},{"$f":"BalanceComprobacion!E852","v":1538159.95},{"$f":"BalanceComprobacion!F852","v":297931.44},{"$f":"BalanceComprobacion!G852","v":1240228.51}]
[{"$f":"IFERROR(IF(B807<>0,Data!$B$2,\"\"),\"\")","v":"15603"},{"$f":"BalanceComprobacion!A853","v":3.1},{"$f":"BalanceComprobacion!B853","v":"5.1.3.99.01.00.0."},{"$f":"BalanceComprobacion!C853","v":"Útiles y materiales de oficina y cómputo"},{"$f":"BalanceComprobacion!D853","v":0},{"$f":"BalanceComprobacion!E853","v":1538159.95},{"$f":"BalanceComprobacion!F853","v":297931.44},{"$f":"BalanceComprobacion!G853","v":1240228.51}]
[{"$f":"IFERROR(IF(B808<>0,Data!$B$2,\"\"),\"\")","v":"15603"},{"$f":"BalanceComprobacion!A854","v":3.1},{"$f":"BalanceComprobacion!B854","v":"5.1.3.99.01.00.0.99999"},{"$f":"BalanceComprobacion!C854","v":"Útiles y materiales de oficina y cómputo"},{"$f":"BalanceComprobacion!D854","v":0},{"$f":"BalanceComprobacion!E854","v":1538159.95},{"$f":"BalanceComprobacion!F854","v":297931.44},{"$f":"BalanceComprobacion!G854","v":1240228.51}]
[{"$f":"IFERROR(IF(B809<>0,Data!$B$2,\"\"),\"\")","v":"15603"},{"$f":"BalanceComprobacion!A855","v":3.1},{"$f":"BalanceComprobacion!B855","v":"5.1.3.99.02."},{"$f":"BalanceComprobacion!C855","v":"Útiles y materiales méd, hospital y investigación"},{"$f":"BalanceComprobacion!D855","v":0},{"$f":"BalanceComprobacion!E855","v":320932.96999999997},{"$f":"BalanceComprobacion!F855","v":0},{"$f":"BalanceComprobacion!G855","v":320932.96999999997}]
[{"$f":"IFERROR(IF(B810<>0,Data!$B$2,\"\"),\"\")","v":"15603"},{"$f":"BalanceComprobacion!A856","v":3.1},{"$f":"BalanceComprobacion!B856","v":"5.1.3.99.02.00."},{"$f":"BalanceComprobacion!C856","v":"Útiles y materiales méd, hospital y investigación"},{"$f":"BalanceComprobacion!D856","v":0},{"$f":"BalanceComprobacion!E856","v":320932.96999999997},{"$f":"BalanceComprobacion!F856","v":0},{"$f":"BalanceComprobacion!G856","v":320932.96999999997}]
[{"$f":"IFERROR(IF(B811<>0,Data!$B$2,\"\"),\"\")","v":"15603"},{"$f":"BalanceComprobacion!A857","v":3.1},{"$f":"BalanceComprobacion!B857","v":"5.1.3.99.02.00.0."},{"$f":"BalanceComprobacion!C857","v":"Útiles y materiales méd, hospital y investigación"},{"$f":"BalanceComprobacion!D857","v":0},{"$f":"BalanceComprobacion!E857","v":320932.96999999997},{"$f":"BalanceComprobacion!F857","v":0},{"$f":"BalanceComprobacion!G857","v":320932.96999999997}]
[{"$f":"IFERROR(IF(B812<>0,Data!$B$2,\"\"),\"\")","v":"15603"},{"$f":"BalanceComprobacion!A858","v":3.1},{"$f":"BalanceComprobacion!B858","v":"5.1.3.99.02.00.0.99999"},{"$f":"BalanceComprobacion!C858","v":"Útiles y materiales méd, hospital y investigación"},{"$f":"BalanceComprobacion!D858","v":0},{"$f":"BalanceComprobacion!E858","v":320932.96999999997},{"$f":"BalanceComprobacion!F858","v":0},{"$f":"BalanceComprobacion!G858","v":320932.96999999997}]
[{"$f":"IFERROR(IF(B813<>0,Data!$B$2,\"\"),\"\")","v":"15603"},{"$f":"BalanceComprobacion!A859","v":3.1},{"$f":"BalanceComprobacion!B859","v":"5.1.3.99.03."},{"$f":"BalanceComprobacion!C859","v":"Productos de papel, cartón e impresos"},{"$f":"BalanceComprobacion!D859","v":0},{"$f":"BalanceComprobacion!E859","v":2076236.1},{"$f":"BalanceComprobacion!F859","v":476667.61},{"$f":"BalanceComprobacion!G859","v":1599568.49}]
[{"$f":"IFERROR(IF(B814<>0,Data!$B$2,\"\"),\"\")","v":"15603"},{"$f":"BalanceComprobacion!A860","v":3.1},{"$f":"BalanceComprobacion!B860","v":"5.1.3.99.03.00."},{"$f":"BalanceComprobacion!C860","v":"Productos de papel, cartón e impresos"},{"$f":"BalanceComprobacion!D860","v":0},{"$f":"BalanceComprobacion!E860","v":2076236.1},{"$f":"BalanceComprobacion!F860","v":476667.61},{"$f":"BalanceComprobacion!G860","v":1599568.49}]
[{"$f":"IFERROR(IF(B815<>0,Data!$B$2,\"\"),\"\")","v":"15603"},{"$f":"BalanceComprobacion!A861","v":3.1},{"$f":"BalanceComprobacion!B861","v":"5.1.3.99.03.00.0."},{"$f":"BalanceComprobacion!C861","v":"Productos de papel, cartón e impresos"},{"$f":"BalanceComprobacion!D861","v":0},{"$f":"BalanceComprobacion!E861","v":2076236.1},{"$f":"BalanceComprobacion!F861","v":476667.61},{"$f":"BalanceComprobacion!G861","v":1599568.49}]
[{"$f":"IFERROR(IF(B816<>0,Data!$B$2,\"\"),\"\")","v":"15603"},{"$f":"BalanceComprobacion!A862","v":3.1},{"$f":"BalanceComprobacion!B862","v":"5.1.3.99.03.00.0.99999"},{"$f":"BalanceComprobacion!C862","v":"Productos de papel, cartón e impresos"},{"$f":"BalanceComprobacion!D862","v":0},{"$f":"BalanceComprobacion!E862","v":2076236.1},{"$f":"BalanceComprobacion!F862","v":476667.61},{"$f":"BalanceComprobacion!G862","v":1599568.49}]
[{"$f":"IFERROR(IF(B817<>0,Data!$B$2,\"\"),\"\")","v":"15603"},{"$f":"BalanceComprobacion!A863","v":3.1},{"$f":"BalanceComprobacion!B863","v":"5.1.3.99.04."},{"$f":"BalanceComprobacion!C863","v":"Textiles y vestuario"},{"$f":"BalanceComprobacion!D863","v":0},{"$f":"BalanceComprobacion!E863","v":14739510.630000001},{"$f":"BalanceComprobacion!F863","v":1687442},{"$f":"BalanceComprobacion!G863","v":13052068.630000001}]
[{"$f":"IFERROR(IF(B818<>0,Data!$B$2,\"\"),\"\")","v":"15603"},{"$f":"BalanceComprobacion!A864","v":3.1},{"$f":"BalanceComprobacion!B864","v":"5.1.3.99.04.00."},{"$f":"BalanceComprobacion!C864","v":"Textiles y vestuario"},{"$f":"BalanceComprobacion!D864","v":0},{"$f":"BalanceComprobacion!E864","v":14739510.630000001},{"$f":"BalanceComprobacion!F864","v":1687442},{"$f":"BalanceComprobacion!G864","v":13052068.630000001}]
[{"$f":"IFERROR(IF(B819<>0,Data!$B$2,\"\"),\"\")","v":"15603"},{"$f":"BalanceComprobacion!A865","v":3.1},{"$f":"BalanceComprobacion!B865","v":"5.1.3.99.04.00.0."},{"$f":"BalanceComprobacion!C865","v":"Textiles y vestuario"},{"$f":"BalanceComprobacion!D865","v":0},{"$f":"BalanceComprobacion!E865","v":14739510.630000001},{"$f":"BalanceComprobacion!F865","v":1687442},{"$f":"BalanceComprobacion!G865","v":13052068.630000001}]
[{"$f":"IFERROR(IF(B820<>0,Data!$B$2,\"\"),\"\")","v":"15603"},{"$f":"BalanceComprobacion!A866","v":3.1},{"$f":"BalanceComprobacion!B866","v":"5.1.3.99.04.00.0.99999"},{"$f":"BalanceComprobacion!C866","v":"Textiles y vestuario"},{"$f":"BalanceComprobacion!D866","v":0},{"$f":"BalanceComprobacion!E866","v":14739510.630000001},{"$f":"BalanceComprobacion!F866","v":1687442},{"$f":"BalanceComprobacion!G866","v":13052068.630000001}]
[{"$f":"IFERROR(IF(B821<>0,Data!$B$2,\"\"),\"\")","v":"15603"},{"$f":"BalanceComprobacion!A867","v":3.1},{"$f":"BalanceComprobacion!B867","v":"5.1.3.99.05."},{"$f":"BalanceComprobacion!C867","v":"Útiles y materiales de limpieza"},{"$f":"BalanceComprobacion!D867","v":0},{"$f":"BalanceComprobacion!E867","v":4219119.71},{"$f":"BalanceComprobacion!F867","v":1464470.37},{"$f":"BalanceComprobacion!G867","v":2754649.34}]
[{"$f":"IFERROR(IF(B822<>0,Data!$B$2,\"\"),\"\")","v":"15603"},{"$f":"BalanceComprobacion!A868","v":3.1},{"$f":"BalanceComprobacion!B868","v":"5.1.3.99.05.00."},{"$f":"BalanceComprobacion!C868","v":"Útiles y materiales de limpieza"},{"$f":"BalanceComprobacion!D868","v":0},{"$f":"BalanceComprobacion!E868","v":4219119.71},{"$f":"BalanceComprobacion!F868","v":1464470.37},{"$f":"BalanceComprobacion!G868","v":2754649.34}]
[{"$f":"IFERROR(IF(B823<>0,Data!$B$2,\"\"),\"\")","v":"15603"},{"$f":"BalanceComprobacion!A869","v":3.1},{"$f":"BalanceComprobacion!B869","v":"5.1.3.99.05.00.0."},{"$f":"BalanceComprobacion!C869","v":"Útiles y materiales de limpieza"},{"$f":"BalanceComprobacion!D869","v":0},{"$f":"BalanceComprobacion!E869","v":4219119.71},{"$f":"BalanceComprobacion!F869","v":1464470.37},{"$f":"BalanceComprobacion!G869","v":2754649.34}]
[{"$f":"IFERROR(IF(B824<>0,Data!$B$2,\"\"),\"\")","v":"15603"},{"$f":"BalanceComprobacion!A870","v":3.1},{"$f":"BalanceComprobacion!B870","v":"5.1.3.99.05.00.0.99999"},{"$f":"BalanceComprobacion!C870","v":"Útiles y materiales de limpieza"},{"$f":"BalanceComprobacion!D870","v":0},{"$f":"BalanceComprobacion!E870","v":4219119.71},{"$f":"BalanceComprobacion!F870","v":1464470.37},{"$f":"BalanceComprobacion!G870","v":2754649.34}]
[{"$f":"IFERROR(IF(B825<>0,Data!$B$2,\"\"),\"\")","v":"15603"},{"$f":"BalanceComprobacion!A871","v":3.1},{"$f":"BalanceComprobacion!B871","v":"5.1.3.99.06."},{"$f":"BalanceComprobacion!C871","v":"Útiles y materiales de resguardo y seguridad"},{"$f":"BalanceComprobacion!D871","v":0},{"$f":"BalanceComprobacion!E871","v":7992760.3700000001},{"$f":"BalanceComprobacion!F871","v":4609053.04},{"$f":"BalanceComprobacion!G871","v":3383707.33}]
[{"$f":"IFERROR(IF(B826<>0,Data!$B$2,\"\"),\"\")","v":"15603"},{"$f":"BalanceComprobacion!A872","v":3.1},{"$f":"BalanceComprobacion!B872","v":"5.1.3.99.06.00."},{"$f":"BalanceComprobacion!C872","v":"Útiles y materiales de resguardo y seguridad"},{"$f":"BalanceComprobacion!D872","v":0},{"$f":"BalanceComprobacion!E872","v":7992760.3700000001},{"$f":"BalanceComprobacion!F872","v":4609053.04},{"$f":"BalanceComprobacion!G872","v":3383707.33}]
[{"$f":"IFERROR(IF(B827<>0,Data!$B$2,\"\"),\"\")","v":"15603"},{"$f":"BalanceComprobacion!A873","v":3.1},{"$f":"BalanceComprobacion!B873","v":"5.1.3.99.06.00.0."},{"$f":"BalanceComprobacion!C873","v":"Útiles y materiales de resguardo y seguridad"},{"$f":"BalanceComprobacion!D873","v":0},{"$f":"BalanceComprobacion!E873","v":7992760.3700000001},{"$f":"BalanceComprobacion!F873","v":4609053.04},{"$f":"BalanceComprobacion!G873","v":3383707.33}]
[{"$f":"IFERROR(IF(B828<>0,Data!$B$2,\"\"),\"\")","v":"15603"},{"$f":"BalanceComprobacion!A874","v":3.1},{"$f":"BalanceComprobacion!B874","v":"5.1.3.99.06.00.0.99999"},{"$f":"BalanceComprobacion!C874","v":"Útiles y materiales de resguardo y seguridad"},{"$f":"BalanceComprobacion!D874","v":0},{"$f":"BalanceComprobacion!E874","v":7992760.3700000001},{"$f":"BalanceComprobacion!F874","v":4609053.04},{"$f":"BalanceComprobacion!G874","v":3383707.33}]
[{"$f":"IFERROR(IF(B829<>0,Data!$B$2,\"\"),\"\")","v":"15603"},{"$f":"BalanceComprobacion!A875","v":3.1},{"$f":"BalanceComprobacion!B875","v":"5.1.3.99.99."},{"$f":"BalanceComprobacion!C875","v":"Otros útiles, materiales y suministros diversos"},{"$f":"BalanceComprobacion!D875","v":0},{"$f":"BalanceComprobacion!E875","v":1863016},{"$f":"BalanceComprobacion!F875","v":257035},{"$f":"BalanceComprobacion!G875","v":1605981}]
[{"$f":"IFERROR(IF(B830<>0,Data!$B$2,\"\"),\"\")","v":"15603"},{"$f":"BalanceComprobacion!A876","v":3.1},{"$f":"BalanceComprobacion!B876","v":"5.1.3.99.99.00."},{"$f":"BalanceComprobacion!C876","v":"Otros útiles, materiales y suministros diversos"},{"$f":"BalanceComprobacion!D876","v":0},{"$f":"BalanceComprobacion!E876","v":1863016},{"$f":"BalanceComprobacion!F876","v":257035},{"$f":"BalanceComprobacion!G876","v":1605981}]
[{"$f":"IFERROR(IF(B831<>0,Data!$B$2,\"\"),\"\")","v":"15603"},{"$f":"BalanceComprobacion!A877","v":3.1},{"$f":"BalanceComprobacion!B877","v":"5.1.3.99.99.00.0."},{"$f":"BalanceComprobacion!C877","v":"Otros útiles, materiales y suministros diversos"},{"$f":"BalanceComprobacion!D877","v":0},{"$f":"BalanceComprobacion!E877","v":1863016},{"$f":"BalanceComprobacion!F877","v":257035},{"$f":"BalanceComprobacion!G877","v":1605981}]
[{"$f":"IFERROR(IF(B832<>0,Data!$B$2,\"\"),\"\")","v":"15603"},{"$f":"BalanceComprobacion!A878","v":3.1},{"$f":"BalanceComprobacion!B878","v":"5.1.3.99.99.00.0.99999"},{"$f":"BalanceComprobacion!C878","v":"Otros útiles, materiales y suministros diversos"},{"$f":"BalanceComprobacion!D878","v":0},{"$f":"BalanceComprobacion!E878","v":1863016},{"$f":"BalanceComprobacion!F878","v":257035},{"$f":"BalanceComprobacion!G878","v":1605981}]
[{"$f":"IFERROR(IF(B833<>0,Data!$B$2,\"\"),\"\")","v":"15603"},{"$f":"BalanceComprobacion!A879","v":3.1},{"$f":"BalanceComprobacion!B879","v":"5.1.4."},{"$f":"BalanceComprobacion!C879","v":"Consumo de bienes distintos de inventarios"},{"$f":"BalanceComprobacion!D879","v":0},{"$f":"BalanceComprobacion!E879","v":85119132.340000004},{"$f":"BalanceComprobacion!F879","v":51123.06},{"$f":"BalanceComprobacion!G879","v":85068009.280000001}]
[{"$f":"IFERROR(IF(B834<>0,Data!$B$2,\"\"),\"\")","v":"15603"},{"$f":"BalanceComprobacion!A880","v":3.1},{"$f":"BalanceComprobacion!B880","v":"5.1.4.01."},{"$f":"BalanceComprobacion!C880","v":"Consumo de bienes no concesionados"},{"$f":"BalanceComprobacion!D880","v":0},{"$f":"BalanceComprobacion!E880","v":85119132.340000004},{"$f":"BalanceComprobacion!F880","v":51123.06},{"$f":"BalanceComprobacion!G880","v":85068009.280000001}]
[{"$f":"IFERROR(IF(B835<>0,Data!$B$2,\"\"),\"\")","v":"15603"},{"$f":"BalanceComprobacion!A934","v":3.1},{"$f":"BalanceComprobacion!B934","v":"5.4.1.02."},{"$f":"BalanceComprobacion!C934","v":"Transferencias corrientes al sector público interno"},{"$f":"BalanceComprobacion!D934","v":0},{"$f":"BalanceComprobacion!E934","v":43278943.32},{"$f":"BalanceComprobacion!F934","v":0},{"$f":"BalanceComprobacion!G934","v":43278943.32}]
[{"$f":"IFERROR(IF(B836<>0,Data!$B$2,\"\"),\"\")","v":"15603"},{"$f":"BalanceComprobacion!A935","v":3.1},{"$f":"BalanceComprobacion!B935","v":"5.4.1.02.01."},{"$f":"BalanceComprobacion!C935","v":"Transferencias corrientes al Gobierno Central"},{"$f":"BalanceComprobacion!D935","v":0},{"$f":"BalanceComprobacion!E935","v":3032078.91},{"$f":"BalanceComprobacion!F935","v":0},{"$f":"BalanceComprobacion!G935","v":3032078.91}]
[{"$f":"IFERROR(IF(B837<>0,Data!$B$2,\"\"),\"\")","v":"15603"},{"$f":"BalanceComprobacion!A936","v":3.1},{"$f":"BalanceComprobacion!B936","v":"5.4.1.02.01.06."},{"$f":"BalanceComprobacion!C936","v":"Transferencias corrientes al Gobierno Central"},{"$f":"BalanceComprobacion!D936","v":0},{"$f":"BalanceComprobacion!E936","v":2898728.91},{"$f":"BalanceComprobacion!F936","v":0},{"$f":"BalanceComprobacion!G936","v":2898728.91}]
[{"$f":"IFERROR(IF(B838<>0,Data!$B$2,\"\"),\"\")","v":"15603"},{"$f":"BalanceComprobacion!A937","v":3.1},{"$f":"BalanceComprobacion!B937","v":"5.4.1.02.01.06.0."},{"$f":"BalanceComprobacion!C937","v":"Transferencias corrientes al Gobierno Central"},{"$f":"BalanceComprobacion!D937","v":0},{"$f":"BalanceComprobacion!E937","v":2898728.91},{"$f":"BalanceComprobacion!F937","v":0},{"$f":"BalanceComprobacion!G937","v":2898728.91}]
[{"$f":"IFERROR(IF(B839<>0,Data!$B$2,\"\"),\"\")","v":"15603"},{"$f":"BalanceComprobacion!A938","v":3.1},{"$f":"BalanceComprobacion!B938","v":"5.4.1.02.01.06.0.11206"},{"$f":"BalanceComprobacion!C938","v":"Transferencias corrientes al Gobierno Central"},{"$f":"BalanceComprobacion!D938","v":0},{"$f":"BalanceComprobacion!E938","v":1896682.76},{"$f":"BalanceComprobacion!F938","v":0},{"$f":"BalanceComprobacion!G938","v":1896682.76}]
[{"$f":"IFERROR(IF(B840<>0,Data!$B$2,\"\"),\"\")","v":"15603"},{"$f":"BalanceComprobacion!A939","v":3.1},{"$f":"BalanceComprobacion!B939","v":"5.4.1.02.01.06.0.11219"},{"$f":"BalanceComprobacion!C939","v":"Ministerio de Ambiente, Energía y Telecomunicaciones (MINAET)"},{"$f":"BalanceComprobacion!D939","v":0},{"$f":"BalanceComprobacion!E939","v":1002046.15},{"$f":"BalanceComprobacion!F939","v":0},{"$f":"BalanceComprobacion!G939","v":1002046.15}]
[{"$f":"IFERROR(IF(B841<>0,Data!$B$2,\"\"),\"\")","v":"15603"},{"$f":"BalanceComprobacion!A940","v":3.1},{"$f":"BalanceComprobacion!B940","v":"5.4.1.02.01.99."},{"$f":"BalanceComprobacion!C940","v":"Otras transferencias corrientes al Gobierno Central"},{"$f":"BalanceComprobacion!D940","v":0},{"$f":"BalanceComprobacion!E940","v":133350},{"$f":"BalanceComprobacion!F940","v":0},{"$f":"BalanceComprobacion!G940","v":133350}]
[{"$f":"IFERROR(IF(B842<>0,Data!$B$2,\"\"),\"\")","v":"15603"},{"$f":"BalanceComprobacion!A941","v":3.1},{"$f":"BalanceComprobacion!B941","v":"5.4.1.02.01.99.0."},{"$f":"BalanceComprobacion!C941","v":"Otras transferencias corrientes al Gobierno Central"},{"$f":"BalanceComprobacion!D941","v":0},{"$f":"BalanceComprobacion!E941","v":133350},{"$f":"BalanceComprobacion!F941","v":0},{"$f":"BalanceComprobacion!G941","v":133350}]
[{"$f":"IFERROR(IF(B843<>0,Data!$B$2,\"\"),\"\")","v":"15603"},{"$f":"BalanceComprobacion!A942","v":3.1},{"$f":"BalanceComprobacion!B942","v":"5.4.1.02.01.99.0.11210"},{"$f":"BalanceComprobacion!C942","v":"Transferencias corrientes  a Instituciones del MEP"},{"$f":"BalanceComprobacion!D942","v":0},{"$f":"BalanceComprobacion!E942","v":133350},{"$f":"BalanceComprobacion!F942","v":0},{"$f":"BalanceComprobacion!G942","v":133350}]
[{"$f":"IFERROR(IF(B844<>0,Data!$B$2,\"\"),\"\")","v":"15603"},{"$f":"BalanceComprobacion!A943","v":3.1},{"$f":"BalanceComprobacion!B943","v":"5.4.1.02.02."},{"$f":"BalanceComprobacion!C943","v":"Transferencias corrientes a Órganos Desconcentrados"},{"$f":"BalanceComprobacion!D943","v":0},{"$f":"BalanceComprobacion!E943","v":6262769.2999999998},{"$f":"BalanceComprobacion!F943","v":0},{"$f":"BalanceComprobacion!G943","v":6262769.2999999998}]
[{"$f":"IFERROR(IF(B845<>0,Data!$B$2,\"\"),\"\")","v":"15603"},{"$f":"BalanceComprobacion!A944","v":3.1},{"$f":"BalanceComprobacion!B944","v":"5.4.1.02.02.06."},{"$f":"BalanceComprobacion!C944","v":"Transferencias corrientes a Órganos Desconcentrados"},{"$f":"BalanceComprobacion!D944","v":0},{"$f":"BalanceComprobacion!E944","v":6262769.2999999998},{"$f":"BalanceComprobacion!F944","v":0},{"$f":"BalanceComprobacion!G944","v":6262769.2999999998}]
[{"$f":"IFERROR(IF(B846<>0,Data!$B$2,\"\"),\"\")","v":"15603"},{"$f":"BalanceComprobacion!A945","v":3.1},{"$f":"BalanceComprobacion!B945","v":"5.4.1.02.02.06.0."},{"$f":"BalanceComprobacion!C945","v":"Transferencias corrientes a Órganos Desconcentrados"},{"$f":"BalanceComprobacion!D945","v":0},{"$f":"BalanceComprobacion!E945","v":6262769.2999999998},{"$f":"BalanceComprobacion!F945","v":0},{"$f":"BalanceComprobacion!G945","v":6262769.2999999998}]
[{"$f":"IFERROR(IF(B847<>0,Data!$B$2,\"\"),\"\")","v":"15603"},{"$f":"BalanceComprobacion!A946","v":3.1},{"$f":"BalanceComprobacion!B946","v":"5.4.1.02.02.06.0.12553"},{"$f":"BalanceComprobacion!C946","v":"Comision Nacional para la Gestión de la Biodiversidad (CONAGEBIO)"},{"$f":"BalanceComprobacion!D946","v":0},{"$f":"BalanceComprobacion!E946","v":159054.94},{"$f":"BalanceComprobacion!F946","v":0},{"$f":"BalanceComprobacion!G946","v":159054.94}]
[{"$f":"IFERROR(IF(B848<>0,Data!$B$2,\"\"),\"\")","v":"15603"},{"$f":"BalanceComprobacion!A947","v":3.1},{"$f":"BalanceComprobacion!B947","v":"5.4.1.02.02.06.0.12581"},{"$f":"BalanceComprobacion!C947","v":"Consejo Nacional de Personas con Discapacidad - CONAPDIS"},{"$f":"BalanceComprobacion!D947","v":0},{"$f":"BalanceComprobacion!E947","v":2310348.86},{"$f":"BalanceComprobacion!F947","v":0},{"$f":"BalanceComprobacion!G947","v":2310348.86}]
[{"$f":"IFERROR(IF(B849<>0,Data!$B$2,\"\"),\"\")","v":"15603"},{"$f":"BalanceComprobacion!A948","v":3.1},{"$f":"BalanceComprobacion!B948","v":"5.4.1.02.02.06.0.12784"},{"$f":"BalanceComprobacion!C948","v":"Junta Administrativa del Registro Nacional"},{"$f":"BalanceComprobacion!D948","v":0},{"$f":"BalanceComprobacion!E948","v":3793365.5},{"$f":"BalanceComprobacion!F948","v":0},{"$f":"BalanceComprobacion!G948","v":3793365.5}]
[{"$f":"IFERROR(IF(B850<>0,Data!$B$2,\"\"),\"\")","v":"15603"},{"$f":"BalanceComprobacion!A949","v":3.1},{"$f":"BalanceComprobacion!B949","v":"5.4.1.02.03."},{"$f":"BalanceComprobacion!C949","v":"Transferencias corrientes a Instituciones Descentralizadas no Empresariales"},{"$f":"BalanceComprobacion!D949","v":0},{"$f":"BalanceComprobacion!E949","v":18966827.510000002},{"$f":"BalanceComprobacion!F949","v":0},{"$f":"BalanceComprobacion!G949","v":18966827.510000002}]
[{"$f":"IFERROR(IF(B851<>0,Data!$B$2,\"\"),\"\")","v":"15603"},{"$f":"BalanceComprobacion!A950","v":3.1},{"$f":"BalanceComprobacion!B950","v":"5.4.1.02.03.06."},{"$f":"BalanceComprobacion!C950","v":"Transferencias corrientes a Instituciones Descentralizadas no Empresariales"},{"$f":"BalanceComprobacion!D950","v":0},{"$f":"BalanceComprobacion!E950","v":18966827.510000002},{"$f":"BalanceComprobacion!F950","v":0},{"$f":"BalanceComprobacion!G950","v":18966827.510000002}]
[{"$f":"IFERROR(IF(B852<>0,Data!$B$2,\"\"),\"\")","v":"15603"},{"$f":"BalanceComprobacion!A951","v":3.1},{"$f":"BalanceComprobacion!B951","v":"5.4.1.02.03.06.0."},{"$f":"BalanceComprobacion!C951","v":"Transferencias corrientes a Instituciones Descentralizadas no Empresariales"},{"$f":"BalanceComprobacion!D951","v":0},{"$f":"BalanceComprobacion!E951","v":18966827.510000002},{"$f":"BalanceComprobacion!F951","v":0},{"$f":"BalanceComprobacion!G951","v":18966827.510000002}]
[{"$f":"IFERROR(IF(B853<>0,Data!$B$2,\"\"),\"\")","v":"15603"},{"$f":"BalanceComprobacion!A952","v":3.1},{"$f":"BalanceComprobacion!B952","v":"5.4.1.02.03.06.0.14253"},{"$f":"BalanceComprobacion!C952","v":"Transferencias corrientes a Instituciones Descentralizadas no Empresariales"},{"$f":"BalanceComprobacion!D952","v":0},{"$f":"BalanceComprobacion!E952","v":18966827.510000002},{"$f":"BalanceComprobacion!F952","v":0},{"$f":"BalanceComprobacion!G952","v":18966827.510000002}]
[{"$f":"IFERROR(IF(B854<>0,Data!$B$2,\"\"),\"\")","v":"15603"},{"$f":"BalanceComprobacion!A953","v":3.1},{"$f":"BalanceComprobacion!B953","v":"5.4.1.02.99."},{"$f":"BalanceComprobacion!C953","v":"Transferencias corrientes a otras Instituciones de Gobiernos Locales"},{"$f":"BalanceComprobacion!D953","v":0},{"$f":"BalanceComprobacion!E953","v":15017267.6},{"$f":"BalanceComprobacion!F953","v":0},{"$f":"BalanceComprobacion!G953","v":15017267.6}]
[{"$f":"IFERROR(IF(B855<>0,Data!$B$2,\"\"),\"\")","v":"15603"},{"$f":"BalanceComprobacion!A954","v":3.1},{"$f":"BalanceComprobacion!B954","v":"5.4.1.02.99.06."},{"$f":"BalanceComprobacion!C954","v":"Transferencias corrientes a otras Instituciones de Gobiernos Locales"},{"$f":"BalanceComprobacion!D954","v":0},{"$f":"BalanceComprobacion!E954","v":15017267.6},{"$f":"BalanceComprobacion!F954","v":0},{"$f":"BalanceComprobacion!G954","v":15017267.6}]
[{"$f":"IFERROR(IF(B856<>0,Data!$B$2,\"\"),\"\")","v":"15603"},{"$f":"BalanceComprobacion!A955","v":3.1},{"$f":"BalanceComprobacion!B955","v":"5.4.1.02.99.06.0."},{"$f":"BalanceComprobacion!C955","v":"Transferencias corrientes a otras Instituciones de Gobiernos Locales"},{"$f":"BalanceComprobacion!D955","v":0},{"$f":"BalanceComprobacion!E955","v":15017267.6},{"$f":"BalanceComprobacion!F955","v":0},{"$f":"BalanceComprobacion!G955","v":15017267.6}]
[{"$f":"IFERROR(IF(B857<>0,Data!$B$2,\"\"),\"\")","v":"15603"},{"$f":"BalanceComprobacion!A956","v":3.1},{"$f":"BalanceComprobacion!B956","v":"5.4.1.02.99.06.0.15910"},{"$f":"BalanceComprobacion!C956","v":"Comités Cantonales de Deportes y Recreación"},{"$f":"BalanceComprobacion!D956","v":0},{"$f":"BalanceComprobacion!E956","v":13862093.17},{"$f":"BalanceComprobacion!F956","v":0},{"$f":"BalanceComprobacion!G956","v":13862093.17}]
[{"$f":"IFERROR(IF(B858<>0,Data!$B$2,\"\"),\"\")","v":"15603"},{"$f":"BalanceComprobacion!A957","v":3.1},{"$f":"BalanceComprobacion!B957","v":"5.4.1.02.99.06.0.15980"},{"$f":"BalanceComprobacion!C957","v":"Unión Nacional de Gobiernos Locales"},{"$f":"BalanceComprobacion!D957","v":0},{"$f":"BalanceComprobacion!E957","v":1155174.43},{"$f":"BalanceComprobacion!F957","v":0},{"$f":"BalanceComprobacion!G957","v":1155174.43}]
[{"$f":"IFERROR(IF(B859<>0,Data!$B$2,\"\"),\"\")","v":"15603"},{"$f":"BalanceComprobacion!A958","v":3.1},{"$f":"BalanceComprobacion!B958","v":"5.9."},{"$f":"BalanceComprobacion!C958","v":"Otros gastos"},{"$f":"BalanceComprobacion!D958","v":0},{"$f":"BalanceComprobacion!E958","v":5.42},{"$f":"BalanceComprobacion!F958","v":0},{"$f":"BalanceComprobacion!G958","v":5.42}]
[{"$f":"IFERROR(IF(B860<>0,Data!$B$2,\"\"),\"\")","v":"15603"},{"$f":"BalanceComprobacion!A959","v":3.1},{"$f":"BalanceComprobacion!B959","v":"5.9.9."},{"$f":"BalanceComprobacion!C959","v":"Otros gastos y resultados negativos"},{"$f":"BalanceComprobacion!D959","v":0},{"$f":"BalanceComprobacion!E959","v":5.42},{"$f":"BalanceComprobacion!F959","v":0},{"$f":"BalanceComprobacion!G959","v":5.42}]
[{"$f":"IFERROR(IF(B861<>0,Data!$B$2,\"\"),\"\")","v":"15603"},{"$f":"BalanceComprobacion!A960","v":3.1},{"$f":"BalanceComprobacion!B960","v":"5.9.9.99."},{"$f":"BalanceComprobacion!C960","v":"Gastos y resultados negativos varios"},{"$f":"BalanceComprobacion!D960","v":0},{"$f":"BalanceComprobacion!E960","v":5.42},{"$f":"BalanceComprobacion!F960","v":0},{"$f":"BalanceComprobacion!G960","v":5.42}]
[{"$f":"IFERROR(IF(B862<>0,Data!$B$2,\"\"),\"\")","v":"15603"},{"$f":"BalanceComprobacion!A961","v":3.1},{"$f":"BalanceComprobacion!B961","v":"5.9.9.99.99."},{"$f":"BalanceComprobacion!C961","v":"Otros resultados negativos"},{"$f":"BalanceComprobacion!D961","v":0},{"$f":"BalanceComprobacion!E961","v":5.42},{"$f":"BalanceComprobacion!F961","v":0},{"$f":"BalanceComprobacion!G961","v":5.42}]
[{"$f":"IFERROR(IF(B863<>0,Data!$B$2,\"\"),\"\")","v":"15603"},{"$f":"BalanceComprobacion!A962","v":3.1},{"$f":"BalanceComprobacion!B962","v":"5.9.9.99.99.00."},{"$f":"BalanceComprobacion!C962","v":"Otros resultados negativos"},{"$f":"BalanceComprobacion!D962","v":0},{"$f":"BalanceComprobacion!E962","v":5.42},{"$f":"BalanceComprobacion!F962","v":0},{"$f":"BalanceComprobacion!G962","v":5.42}]
[{"$f":"IFERROR(IF(B864<>0,Data!$B$2,\"\"),\"\")","v":"15603"},{"$f":"BalanceComprobacion!A963","v":3.1},{"$f":"BalanceComprobacion!B963","v":"5.9.9.99.99.00.0."},{"$f":"BalanceComprobacion!C963","v":"Otros resultados negativos"},{"$f":"BalanceComprobacion!D963","v":0},{"$f":"BalanceComprobacion!E963","v":5.42},{"$f":"BalanceComprobacion!F963","v":0},{"$f":"BalanceComprobacion!G963","v":5.42}]
[{"$f":"IFERROR(IF(B865<>0,Data!$B$2,\"\"),\"\")","v":"15603"},{"$f":"BalanceComprobacion!A964","v":3.1},{"$f":"BalanceComprobacion!B964","v":"5.9.9.99.99.00.0.99999"},{"$f":"BalanceComprobacion!C964","v":"Otros resultados negativos"},{"$f":"BalanceComprobacion!D964","v":0},{"$f":"BalanceComprobacion!E964","v":5.42},{"$f":"BalanceComprobacion!F964","v":0},{"$f":"BalanceComprobacion!G964","v":5.42}]
[{"$f":"IFERROR(IF(B866<>0,Data!$B$2,\"\"),\"\")","v":""},{"$f":"BalanceComprobacion!#REF!","v":{"$error":"#REF!"}},{"$f":"BalanceComprobacion!#REF!","v":{"$error":"#REF!"}},{"$f":"BalanceComprobacion!#REF!","v":{"$error":"#REF!"}},{"$f":"BalanceComprobacion!#REF!","v":{"$error":"#REF!"}},{"$f":"BalanceComprobacion!#REF!","v":{"$error":"#REF!"}},{"$f":"BalanceComprobacion!#REF!","v":{"$error":"#REF!"}},{"$f":"BalanceComprobacion!#REF!","v":{"$error":"#REF!"}}]
[{"$f":"IFERROR(IF(B867<>0,Data!$B$2,\"\"),\"\")","v":""},{"$f":"BalanceComprobacion!#REF!","v":{"$error":"#REF!"}},{"$f":"BalanceComprobacion!#REF!","v":{"$error":"#REF!"}},{"$f":"BalanceComprobacion!#REF!","v":{"$error":"#REF!"}},{"$f":"BalanceComprobacion!#REF!","v":{"$error":"#REF!"}},{"$f":"BalanceComprobacion!#REF!","v":{"$error":"#REF!"}},{"$f":"BalanceComprobacion!#REF!","v":{"$error":"#REF!"}},{"$f":"BalanceComprobacion!#REF!","v":{"$error":"#REF!"}}]
[{"$f":"IFERROR(IF(B868<>0,Data!$B$2,\"\"),\"\")","v":""},{"$f":"BalanceComprobacion!#REF!","v":{"$error":"#REF!"}},{"$f":"BalanceComprobacion!#REF!","v":{"$error":"#REF!"}},{"$f":"BalanceComprobacion!#REF!","v":{"$error":"#REF!"}},{"$f":"BalanceComprobacion!#REF!","v":{"$error":"#REF!"}},{"$f":"BalanceComprobacion!#REF!","v":{"$error":"#REF!"}},{"$f":"BalanceComprobacion!#REF!","v":{"$error":"#REF!"}},{"$f":"BalanceComprobacion!#REF!","v":{"$error":"#REF!"}}]
[{"$f":"IFERROR(IF(B869<>0,Data!$B$2,\"\"),\"\")","v":""},{"$f":"BalanceComprobacion!#REF!","v":{"$error":"#REF!"}},{"$f":"BalanceComprobacion!#REF!","v":{"$error":"#REF!"}},{"$f":"BalanceComprobacion!#REF!","v":{"$error":"#REF!"}},{"$f":"BalanceComprobacion!#REF!","v":{"$error":"#REF!"}},{"$f":"BalanceComprobacion!#REF!","v":{"$error":"#REF!"}},{"$f":"BalanceComprobacion!#REF!","v":{"$error":"#REF!"}},{"$f":"BalanceComprobacion!#REF!","v":{"$error":"#REF!"}}]
[{"$f":"IFERROR(IF(B870<>0,Data!$B$2,\"\"),\"\")","v":""},{"$f":"BalanceComprobacion!#REF!","v":{"$error":"#REF!"}},{"$f":"BalanceComprobacion!#REF!","v":{"$error":"#REF!"}},{"$f":"BalanceComprobacion!#REF!","v":{"$error":"#REF!"}},{"$f":"BalanceComprobacion!#REF!","v":{"$error":"#REF!"}},{"$f":"BalanceComprobacion!#REF!","v":{"$error":"#REF!"}},{"$f":"BalanceComprobacion!#REF!","v":{"$error":"#REF!"}},{"$f":"BalanceComprobacion!#REF!","v":{"$error":"#REF!"}}]
[{"$f":"IFERROR(IF(B871<>0,Data!$B$2,\"\"),\"\")","v":""},{"$f":"BalanceComprobacion!#REF!","v":{"$error":"#REF!"}},{"$f":"BalanceComprobacion!#REF!","v":{"$error":"#REF!"}},{"$f":"BalanceComprobacion!#REF!","v":{"$error":"#REF!"}},{"$f":"BalanceComprobacion!#REF!","v":{"$error":"#REF!"}},{"$f":"BalanceComprobacion!#REF!","v":{"$error":"#REF!"}},{"$f":"BalanceComprobacion!#REF!","v":{"$error":"#REF!"}},{"$f":"BalanceComprobacion!#REF!","v":{"$error":"#REF!"}}]
[{"$f":"IFERROR(IF(B872<>0,Data!$B$2,\"\"),\"\")","v":""},{"$f":"BalanceComprobacion!#REF!","v":{"$error":"#REF!"}},{"$f":"BalanceComprobacion!#REF!","v":{"$error":"#REF!"}},{"$f":"BalanceComprobacion!#REF!","v":{"$error":"#REF!"}},{"$f":"BalanceComprobacion!#REF!","v":{"$error":"#REF!"}},{"$f":"BalanceComprobacion!#REF!","v":{"$error":"#REF!"}},{"$f":"BalanceComprobacion!#REF!","v":{"$error":"#REF!"}},{"$f":"BalanceComprobacion!#REF!","v":{"$error":"#REF!"}}]
[{"$f":"IFERROR(IF(B873<>0,Data!$B$2,\"\"),\"\")","v":""},{"$f":"BalanceComprobacion!#REF!","v":{"$error":"#REF!"}},{"$f":"BalanceComprobacion!#REF!","v":{"$error":"#REF!"}},{"$f":"BalanceComprobacion!#REF!","v":{"$error":"#REF!"}},{"$f":"BalanceComprobacion!#REF!","v":{"$error":"#REF!"}},{"$f":"BalanceComprobacion!#REF!","v":{"$error":"#REF!"}},{"$f":"BalanceComprobacion!#REF!","v":{"$error":"#REF!"}},{"$f":"BalanceComprobacion!#REF!","v":{"$error":"#REF!"}}]
[{"$f":"IFERROR(IF(B874<>0,Data!$B$2,\"\"),\"\")","v":""},{"$f":"BalanceComprobacion!#REF!","v":{"$error":"#REF!"}},{"$f":"BalanceComprobacion!#REF!","v":{"$error":"#REF!"}},{"$f":"BalanceComprobacion!#REF!","v":{"$error":"#REF!"}},{"$f":"BalanceComprobacion!#REF!","v":{"$error":"#REF!"}},{"$f":"BalanceComprobacion!#REF!","v":{"$error":"#REF!"}},{"$f":"BalanceComprobacion!#REF!","v":{"$error":"#REF!"}},{"$f":"BalanceComprobacion!#REF!","v":{"$error":"#REF!"}}]
[{"$f":"IFERROR(IF(B875<>0,Data!$B$2,\"\"),\"\")","v":""},{"$f":"BalanceComprobacion!#REF!","v":{"$error":"#REF!"}},{"$f":"BalanceComprobacion!#REF!","v":{"$error":"#REF!"}},{"$f":"BalanceComprobacion!#REF!","v":{"$error":"#REF!"}},{"$f":"BalanceComprobacion!#REF!","v":{"$error":"#REF!"}},{"$f":"BalanceComprobacion!#REF!","v":{"$error":"#REF!"}},{"$f":"BalanceComprobacion!#REF!","v":{"$error":"#REF!"}},{"$f":"BalanceComprobacion!#REF!","v":{"$error":"#REF!"}}]
[{"$f":"IFERROR(IF(B876<>0,Data!$B$2,\"\"),\"\")","v":""},{"$f":"BalanceComprobacion!#REF!","v":{"$error":"#REF!"}},{"$f":"BalanceComprobacion!#REF!","v":{"$error":"#REF!"}},{"$f":"BalanceComprobacion!#REF!","v":{"$error":"#REF!"}},{"$f":"BalanceComprobacion!#REF!","v":{"$error":"#REF!"}},{"$f":"BalanceComprobacion!#REF!","v":{"$error":"#REF!"}},{"$f":"BalanceComprobacion!#REF!","v":{"$error":"#REF!"}},{"$f":"BalanceComprobacion!#REF!","v":{"$error":"#REF!"}}]
[{"$f":"IFERROR(IF(B877<>0,Data!$B$2,\"\"),\"\")","v":""},{"$f":"BalanceComprobacion!#REF!","v":{"$error":"#REF!"}},{"$f":"BalanceComprobacion!#REF!","v":{"$error":"#REF!"}},{"$f":"BalanceComprobacion!#REF!","v":{"$error":"#REF!"}},{"$f":"BalanceComprobacion!#REF!","v":{"$error":"#REF!"}},{"$f":"BalanceComprobacion!#REF!","v":{"$error":"#REF!"}},{"$f":"BalanceComprobacion!#REF!","v":{"$error":"#REF!"}},{"$f":"BalanceComprobacion!#REF!","v":{"$error":"#REF!"}}]
[{"$f":"IFERROR(IF(B878<>0,Data!$B$2,\"\"),\"\")","v":""},{"$f":"BalanceComprobacion!#REF!","v":{"$error":"#REF!"}},{"$f":"BalanceComprobacion!#REF!","v":{"$error":"#REF!"}},{"$f":"BalanceComprobacion!#REF!","v":{"$error":"#REF!"}},{"$f":"BalanceComprobacion!#REF!","v":{"$error":"#REF!"}},{"$f":"BalanceComprobacion!#REF!","v":{"$error":"#REF!"}},{"$f":"BalanceComprobacion!#REF!","v":{"$error":"#REF!"}},{"$f":"BalanceComprobacion!#REF!","v":{"$error":"#REF!"}}]
[{"$f":"IFERROR(IF(B879<>0,Data!$B$2,\"\"),\"\")","v":""},{"$f":"BalanceComprobacion!#REF!","v":{"$error":"#REF!"}},{"$f":"BalanceComprobacion!#REF!","v":{"$error":"#REF!"}},{"$f":"BalanceComprobacion!#REF!","v":{"$error":"#REF!"}},{"$f":"BalanceComprobacion!#REF!","v":{"$error":"#REF!"}},{"$f":"BalanceComprobacion!#REF!","v":{"$error":"#REF!"}},{"$f":"BalanceComprobacion!#REF!","v":{"$error":"#REF!"}},{"$f":"BalanceComprobacion!#REF!","v":{"$error":"#REF!"}}]
[{"$f":"IFERROR(IF(B880<>0,Data!$B$2,\"\"),\"\")","v":""},{"$f":"BalanceComprobacion!#REF!","v":{"$error":"#REF!"}},{"$f":"BalanceComprobacion!#REF!","v":{"$error":"#REF!"}},{"$f":"BalanceComprobacion!#REF!","v":{"$error":"#REF!"}},{"$f":"BalanceComprobacion!#REF!","v":{"$error":"#REF!"}},{"$f":"BalanceComprobacion!#REF!","v":{"$error":"#REF!"}},{"$f":"BalanceComprobacion!#REF!","v":{"$error":"#REF!"}},{"$f":"BalanceComprobacion!#REF!","v":{"$error":"#REF!"}}]
[{"$f":"IFERROR(IF(B881<>0,Data!$B$2,\"\"),\"\")","v":""},{"$f":"BalanceComprobacion!#REF!","v":{"$error":"#REF!"}},{"$f":"BalanceComprobacion!#REF!","v":{"$error":"#REF!"}},{"$f":"BalanceComprobacion!#REF!","v":{"$error":"#REF!"}},{"$f":"BalanceComprobacion!#REF!","v":{"$error":"#REF!"}},{"$f":"BalanceComprobacion!#REF!","v":{"$error":"#REF!"}},{"$f":"BalanceComprobacion!#REF!","v":{"$error":"#REF!"}},{"$f":"BalanceComprobacion!#REF!","v":{"$error":"#REF!"}}]
[{"$f":"IFERROR(IF(B882<>0,Data!$B$2,\"\"),\"\")","v":""},{"$f":"BalanceComprobacion!A965","v":0},{"$f":"BalanceComprobacion!B965","v":"GRAN TOTAL"},{"$f":"BalanceComprobacion!C965","v":0},{"$f":"BalanceComprobacion!D965","v":0},{"$f":"BalanceComprobacion!E965","v":18557294142.549999},{"$f":"BalanceComprobacion!F965","v":18557294142.549999},{"$f":"BalanceComprobacion!G965","v":0}]