{"text_format":"1","workbook":"xlsx","n_sheets":3,"sheets":["BalanceComprobacion","Data","BC"],"not_rendered":{"charts":0,"images":0,"macros":1,"external_links":0,"defined_names":2,"comments":0,"pivot_tables":0},"unopened":[],"bounds":{"document_bytes":16777216,"sheet_cells":100000,"rows_first":2000,"rows_last":500,"rows_between":2000,"halvings":0,"cell_chars":16384,"cell_head_chars":4096},"cells_cut":0,"cells_raw":0,"read":"whole","date_system":"1900"}

{"sheet":"BalanceComprobacion","index":0,"n_rows":965,"n_cols":7,"rows_kept":965,"cut":false,"hidden":false,"merged":[]}
[]
[]
[null,{"$f":"IF(Data!A2=\"\",\"\",Data!M1)","v":"Municipalidad de Buenos Aires"}]
[null,"Balance de Comprobación"]
[null,{"$f":"IF(Data!A2=\"\",\"\",CONCATENATE(\"Del 01 de enero \",Data!$D$2,\" al \",VLOOKUP(Data!C2,Data!F1:H24,2,FALSE),\" \",\"de\",\" \",Data!D2))","v":"Del 01 de enero 2024 al 31 de Mayo de 2024"}]
[null,{"$f":"IF(Data!A2=\"\",\"\",\"Código Institucional: \" & Data!B2)","v":"Código Institucional: 15603"}]
[null,"Moneda: CRC"]
[null,{"$f":"IF(Data!A2=\"\",\"\",CONCATENATE(\"Periodo:\",\" \",VLOOKUP(Data!C2,Data!F1:H24,3,FALSE)))","v":"Periodo: 5"}]
["CODIGO SEGMENTO","CUENTA (REPORTAR MÁXIMO A NIVEL 8)","NOMBRE CUENTA","SALDO INICIAL","DEBITOS PERIODO","CREDITOS PERIODO","SALDO FINAL"]
[3.1,"1.","ACTIVO",165832845328.79001,8752435484.8199997,6125581688.3800001,168459699125.23001]
[3.1,"1.1.","Activo Corriente",2822037062.1700001,8538190244.0200005,5913443926.3699999,5446783379.8199997]
[3.1,"1.1.1.","Efectivo  equivalentes de efectivo",2106811911.3199999,3514521067.9000001,3517425890.48,2103907088.74]
[3.1,"1.1.1.01.","Efectivo",2106811911.3199999,2846689297.0900002,3517425890.48,1436075317.9300001]
[3.1,"1.1.1.01.02.","Depósitos bancarios",2103561911.3199999,2846689297.0900002,3517425890.48,1432825317.9300001]
[3.1,"1.1.1.01.02.02.","Depósitos bancarios en el sector público interno",2103561911.3199999,2846689297.0900002,3517425890.48,1432825317.9300001]
[3.1,"1.1.1.01.02.02.2.","Cuentas corrientes en el sector público interno",687233539.54999995,912770483.08000004,1522199477.3199999,77804545.310000002]
[3.1,"1.1.1.01.02.02.2.21101","Banco Costa Rica",372598001.66000003,104424477.15000001,475258912.64999998,1763566.16]
[3.1,"1.1.1.01.02.02.2.21103","Banco Nacional de Costa Rica",314635537.88999999,808346005.92999995,1046940564.67,76040979.150000006]
[3.1,"1.1.1.01.02.02.3.","Caja Única",1416328371.77,1933918814.01,1995226413.1600001,1355020772.6199999]
[3.1,"1.1.1.01.02.02.3.11206","Ministerio de Hacienda",1416328371.77,1933918814.01,1995226413.1600001,1355020772.6199999]
[3.1,"1.1.1.01.03.","Cajas chicas  fondos rotatorios",3250000,0,0,3250000]
[3.1,"1.1.1.01.03.01.","Cajas chicas",2250000,0,0,2250000]
[3.1,"1.1.1.01.03.01.2.","Cajas chicas en el país",2250000,0,0,2250000]
[3.1,"1.1.1.01.03.01.2.99999","Cajas chicas en el país",2250000,0,0,2250000]
[3.1,"1.1.1.01.03.02.","Fondos rotatorios",1000000,0,0,1000000]
[3.1,"1.1.1.01.03.02.2.","Fondos rotatorios en el sector público interno",1000000,0,0,1000000]
[3.1,"1.1.1.01.03.02.2.99999","Fondos rotatorios en el sector público interno",1000000,0,0,1000000]
[3.1,"1.1.1.02.","Equivalentes de efectivo",0,667831770.80999994,0,667831770.80999994]
[3.1,"1.1.1.02.99.","Otros equivalentes de efectivo",0,667831770.80999994,0,667831770.80999994]
[3.1,"1.1.1.02.99.02.","Otros equivalentes de efectivo en el sector público interno",0,667831770.80999994,0,667831770.80999994]
{"$rows_left_out":936}
{"sheet":"Data","index":1,"n_rows":324,"n_cols":13,"rows_kept":324,"cut":false,"hidden":false,"merged":[]}
["FileName","IDEntidad","UnidadTiempoPeriodo","Periodo",null,"B1","28 de Febrero",2,null,"11000","PODER EJECUTIVO ( MINISTERIOS DE LA REPUBLICA )",null,{"$f":"VLOOKUP(B2,$J$1:$K$323,2,FALSE)","v":"Municipalidad de Buenos Aires"}]
[{"$f":"MID(MID(CELL(\"filename\"),FIND(\"[\",CELL(\"filename\"))+1, FIND(\"]\",CELL(\"filename\"))-FIND(\"[\",CELL(\"filename\"))-1), 1, FIND(\"_\",MID(CELL(\"filename\"),FIND(\"[\",CELL(\"filename\"))+1, FIND(\"]\",CELL(\"filename\"))-FIND(\"[\",CELL(\"filename\"))-1))-1)","v":"15603M052024"},{"$f":"IF(A2=\"\",\"\",MID(A2,1,5))","v":"15603"},{"$f":"IF(MID(A2,6,1)=\"M\",MID(A2,6,3),MID(A2,6,2))","v":"M05"},{"$f":"RIGHT(A2,4)","v":"2024"},null,"B2","30 de Abril",4,null,"11201","Presidencia de la República"]
[null,null,null,null,null,"B3","30 de Junio",6,null,"11202","Ministerio de la Presidencia (MP)"]
[null,null,null,null,null,"B4","31 de Agosto",8,null,"11203","Ministerio de Gobernación y Policía"]
[null,null,null,null,null,"B5","31 de Octubre",10,null,"11204","Ministerio de Relaciones Exteriores y Culto (RE)"]
[null,null,null,null,null,"B6","31 de Diciembre",12,null,"11205","Ministerio de Seguridad Pública (MSP)"]
[null,null,null,null,null,"T1","31 de Marzo",3,null,"11206","Ministerio de Hacienda (MHD)  "]
[null,null,null,null,null,"T2","30 de Junio",6,null,"11207","Ministerio de Agricultura y Ganadería (MAG)  "]
[null,null,null,null,null,"T3","30 de Setiembre",9,null,"11208","Ministerio de Economía, Industria y Comercio (MEIC)"]
[null,null,null,null,null,"T4","31 de Diciembre",12,null,"11209","Ministerio de Obras Públicas y Transportes (MOPT) "]
[null,null,null,null,null,"C1","30 de Abril",4,null,"11210","Ministerio de Educación Pública (MEP) "]
[null,null,null,null,null,"C2","31 de Agosto",8,null,"11211","Ministerio de Salud"]
[null,null,null,null,null,"C3","31 de Diciembre",12,null,"11212","Ministerio de Trabajo y Seguridad Social (MTSS)"]
[null,null,null,null,null,"S1","30 de Junio",6,null,"11213","Ministerio de Cultura, Juventud y Deportes (MCJD)"]
[null,null,null,null,null,"S2","31 de Diciembre",12,null,"11214","Ministerio de Justicia y Gracia "]
[null,null,null,null,null,"A1","31 de Diciembre",12,null,"11215","Ministerio de la Vivienda y Asentamientos Humanos (MIVAH)"]
[null,null,null,null,null,"M01","31 de Enero",1,null,"11216","Ministerio de Comercio Exterior (COMEX)"]
[null,null,null,null,null,"M02","28 de Febrero",2,null,"11217","Ministerio de Planificación Nacional y Política Económica   (MIDEPLAN)"]
[null,null,null,null,null,"M04","30 de Abril",4,null,"11218","Ministerio de Ciencia y Tecnología (MICIT)"]
[null,null,null,null,null,"M05","31 de Mayo",5,null,"11219","Ministerio de Ambiente, Energía  y Telecomunicaciones (MINAET) "]
[null,null,null,null,null,"M07","31 de Julio",7,null,"11230","Servicio de la Deuda Pública"]
[null,null,null,null,null,"M08","31 de Agosto",8,null,"11231","Regímenes de Pensiones con Cargo al Presupuesto de la  República"]
[null,null,null,null,null,"M10","31 de Octubre",10,null,"11232","Obras Específicas"]
[null,null,null,null,null,"M11","30 de Noviembre",11,null,"13000","OTROS PODERES DE LA REPUBLICA "]
[null,null,null,null,null,null,null,null,null,"13101","Asamblea Legislativa"]
[null,null,null,null,null,null,null,null,null,"13102","Contraloría General de la República (CGR)"]
[null,null,null,null,null,null,null,null,null,"13103","Defensoría de los Habitantes de la República"]
[null,null,null,null,null,null,null,null,null,"13301","Poder Judicial "]
[null,null,null,null,null,null,null,null,null,"13401","Tribunal Supremo de Elecciones (TSE)"]
[null,null,null,null,null,null,null,null,null,"12000","ÓRGANOS DESCONCENTRADOS"]
{"$rows_left_out":295}
{"sheet":"BC","index":2,"n_rows":882,"n_cols":8,"rows_kept":882,"cut":false,"hidden":false,"merged":[]}
["ENTIDAD","CODIGO SEGMENTO2","CUENTA (REPORTAR MÁXIMO A NIVEL 8)","NOMBRE CUENTA","SALDO INICIAL","DEBITOS PERIODO","CREDITOS PERIODO","SALDO FINAL"]
[{"$f":"IFERROR(IF(B2<>0,Data!$B$2,\"\"),\"\")","v":"15603"},{"$f":"BalanceComprobacion!A10","v":3.1},{"$f":"BalanceComprobacion!B10","v":"1."},{"$f":"BalanceComprobacion!C10","v":"ACTIVO"},{"$f":"BalanceComprobacion!D10","v":165832845328.79001},{"$f":"BalanceComprobacion!E10","v":8752435484.8199997},{"$f":"BalanceComprobacion!F10","v":6125581688.3800001},{"$f":"BalanceComprobacion!G10","v":168459699125.23001}]
[{"$f":"IFERROR(IF(B3<>0,Data!$B$2,\"\"),\"\")","v":"15603"},{"$f":"BalanceComprobacion!A49","v":3.1},{"$f":"BalanceComprobacion!B49","v":"1.1.3.04.01.04.0."},{"$f":"BalanceComprobacion!C49","v":"Servicios comunitarios a cobrar c/p"},{"$f":"BalanceComprobacion!D49","v":179741182.80000001},{"$f":"BalanceComprobacion!E49","v":436629150.75999999},{"$f":"BalanceComprobacion!F49","v":340881574.04000002},{"$f":"BalanceComprobacion!G49","v":275488759.51999998}]
[{"$f":"IFERROR(IF(B4<>0,Data!$B$2,\"\"),\"\")","v":"15603"},{"$f":"BalanceComprobacion!A50","v":3.1},{"$f":"BalanceComprobacion!B50","v":"1.1.3.04.01.04.0.99999"},{"$f":"BalanceComprobacion!C50","v":"Servicios comunitarios a cobrar c/p"},{"$f":"BalanceComprobacion!D50","v":179741182.80000001},{"$f":"BalanceComprobacion!E50","v":436629150.75999999},{"$f":"BalanceComprobacion!F50","v":340881574.04000002},{"$f":"BalanceComprobacion!G50","v":275488759.51999998}]
[{"$f":"IFERROR(IF(B5<>0,Data!$B$2,\"\"),\"\")","v":"15603"},{"$f":"BalanceComprobacion!A51","v":3.1},{"$f":"BalanceComprobacion!B51","v":"1.1.3.04.02."},{"$f":"BalanceComprobacion!C51","v":"Derechos administrativos a cobrar c/p"},{"$f":"BalanceComprobacion!D51","v":442455},{"$f":"BalanceComprobacion!E51","v":619478.32999999996},{"$f":"BalanceComprobacion!F51","v":590495},{"$f":"BalanceComprobacion!G51","v":471438.33}]
[{"$f":"IFERROR(IF(B6<>0,Data!$B$2,\"\"),\"\")","v":"15603"},{"$f":"BalanceComprobacion!A52","v":3.1},{"$f":"BalanceComprobacion!B52","v":"1.1.3.04.02.01."},{"$f":"BalanceComprobacion!C52","v":"Derechos administrativos a los servicios de transporte a cobrar c/p"},{"$f":"BalanceComprobacion!D52","v":50000},{"$f":"BalanceComprobacion!E52","v":390000},{"$f":"BalanceComprobacion!F52","v":400000},{"$f":"BalanceComprobacion!G52","v":40000}]
[{"$f":"IFERROR(IF(B7<>0,Data!$B$2,\"\"),\"\")","v":"15603"},{"$f":"BalanceComprobacion!A53","v":3.1},{"$f":"BalanceComprobacion!B53","v":"1.1.3.04.02.01.0."},{"$f":"BalanceComprobacion!C53","v":"Derechos administrativos a los servicios de transporte a cobrar c/p"},{"$f":"BalanceComprobacion!D53","v":50000},{"$f":"BalanceComprobacion!E53","v":390000},{"$f":"BalanceComprobacion!F53","v":400000},{"$f":"BalanceComprobacion!G53","v":40000}]
[{"$f":"IFERROR(IF(B8<>0,Data!$B$2,\"\"),\"\")","v":"15603"},{"$f":"BalanceComprobacion!A54","v":3.1},{"$f":"BalanceComprobacion!B54","v":"1.1.3.04.02.01.0.99999"},{"$f":"BalanceComprobacion!C54","v":"Derechos administrativos a los servicios de transporte a cobrar c/p  Derecho de piso  uso terminal"},{"$f":"BalanceComprobacion!D54","v":50000},{"$f":"BalanceComprobacion!E54","v":390000},{"$f":"BalanceComprobacion!F54","v":400000},{"$f":"BalanceComprobacion!G54","v":40000}]
[{"$f":"IFERROR(IF(B9<>0,Data!$B$2,\"\"),\"\")","v":"15603"},{"$f":"BalanceComprobacion!A55","v":3.1},{"$f":"BalanceComprobacion!B55","v":"1.1.3.04.02.99."},{"$f":"BalanceComprobacion!C55","v":"Otros derechos administrativos a cobrar c/p"},{"$f":"BalanceComprobacion!D55","v":392455},{"$f":"BalanceComprobacion!E55","v":229478.33},{"$f":"BalanceComprobacion!F55","v":190495},{"$f":"BalanceComprobacion!G55","v":431438.33}]
[{"$f":"IFERROR(IF(B10<>0,Data!$B$2,\"\"),\"\")","v":"15603"},{"$f":"BalanceComprobacion!A56","v":3.1},{"$f":"BalanceComprobacion!B56","v":"1.1.3.04.02.99.0."},{"$f":"BalanceComprobacion!C56","v":"Otros derechos administrativos a cobrar c/p"},{"$f":"BalanceComprobacion!D56","v":392455},{"$f":"BalanceComprobacion!E56","v":229478.33},{"$f":"BalanceComprobacion!F56","v":190495},{"$f":"BalanceComprobacion!G56","v":431438.33}]
[{"$f":"IFERROR(IF(B11<>0,Data!$B$2,\"\"),\"\")","v":"15603"},{"$f":"BalanceComprobacion!A57","v":3.1},{"$f":"BalanceComprobacion!B57","v":"1.1.3.04.02.99.0.99999"},{"$f":"BalanceComprobacion!C57","v":"Otros derechos administrativos a cobrar c/p Derecho cementerio"},{"$f":"BalanceComprobacion!D57","v":392455},{"$f":"BalanceComprobacion!E57","v":229478.33},{"$f":"BalanceComprobacion!F57","v":190495},{"$f":"BalanceComprobacion!G57","v":431438.33}]
[{"$f":"IFERROR(IF(B12<>0,Data!$B$2,\"\"),\"\")","v":"15603"},{"$f":"BalanceComprobacion!A58","v":3.1},{"$f":"BalanceComprobacion!B58","v":"1.1.3.06."},{"$f":"BalanceComprobacion!C58","v":"Transferencias a cobrar a c/p"},{"$f":"BalanceComprobacion!D58","v":0},{"$f":"BalanceComprobacion!E58","v":3784139549.0700002},{"$f":"BalanceComprobacion!F58","v":1261372841.0899999},{"$f":"BalanceComprobacion!G58","v":2522766707.98}]
[{"$f":"IFERROR(IF(B13<>0,Data!$B$2,\"\"),\"\")","v":"15603"},{"$f":"BalanceComprobacion!A59","v":3.1},{"$f":"BalanceComprobacion!B59","v":"1.1.3.06.02."},{"$f":"BalanceComprobacion!C59","v":"Transferencias del sector público interno a cobrar c/p"},{"$f":"BalanceComprobacion!D59","v":0},{"$f":"BalanceComprobacion!E59","v":3784139549.0700002},{"$f":"BalanceComprobacion!F59","v":1261372841.0899999},{"$f":"BalanceComprobacion!G59","v":2522766707.98}]
[{"$f":"IFERROR(IF(B14<>0,Data!$B$2,\"\"),\"\")","v":"15603"},{"$f":"BalanceComprobacion!A60","v":3.1},{"$f":"BalanceComprobacion!B60","v":"1.1.3.06.02.01."},{"$f":"BalanceComprobacion!C60","v":"Transferencias del Gobierno Central a cobrar c/p"},{"$f":"BalanceComprobacion!D60","v":0},{"$f":"BalanceComprobacion!E60","v":3772816719},{"$f":"BalanceComprobacion!F60","v":1257605572.96},{"$f":"BalanceComprobacion!G60","v":2515211146.04}]
[{"$f":"IFERROR(IF(B15<>0,Data!$B$2,\"\"),\"\")","v":"15603"},{"$f":"BalanceComprobacion!A61","v":3.1},{"$f":"BalanceComprobacion!B61","v":"1.1.3.06.02.01.0."},{"$f":"BalanceComprobacion!C61","v":"Transferencias del Gobierno Central a cobrar c/p"},{"$f":"BalanceComprobacion!D61","v":0},{"$f":"BalanceComprobacion!E61","v":3772816719},{"$f":"BalanceComprobacion!F61","v":1257605572.96},{"$f":"BalanceComprobacion!G61","v":2515211146.04}]
[{"$f":"IFERROR(IF(B16<>0,Data!$B$2,\"\"),\"\")","v":"15603"},{"$f":"BalanceComprobacion!A62","v":3.1},{"$f":"BalanceComprobacion!B62","v":"1.1.3.06.02.01.0.11206"},{"$f":"BalanceComprobacion!C62","v":"Ministerio de Hacienda"},{"$f":"BalanceComprobacion!D62","v":0},{"$f":"BalanceComprobacion!E62","v":3772816719},{"$f":"BalanceComprobacion!F62","v":1257605572.96},{"$f":"BalanceComprobacion!G62","v":2515211146.04}]
[{"$f":"IFERROR(IF(B17<>0,Data!$B$2,\"\"),\"\")","v":"15603"},{"$f":"BalanceComprobacion!A63","v":3.1},{"$f":"BalanceComprobacion!B63","v":"1.1.3.06.02.03."},{"$f":"BalanceComprobacion!C63","v":"Transferencias de Instituciones Descentralizadas no Empresariales a cobrar c/p"},{"$f":"BalanceComprobacion!D63","v":0},{"$f":"BalanceComprobacion!E63","v":11322830.07},{"$f":"BalanceComprobacion!F63","v":3767268.13},{"$f":"BalanceComprobacion!G63","v":7555561.9400000004}]
[{"$f":"IFERROR(IF(B18<>0,Data!$B$2,\"\"),\"\")","v":"15603"},{"$f":"BalanceComprobacion!A64","v":3.1},{"$f":"BalanceComprobacion!B64","v":"1.1.3.06.02.03.0."},{"$f":"BalanceComprobacion!C64","v":"Transferencias de Instituciones Descentralizadas no Empresariales a cobrar c/p"},{"$f":"BalanceComprobacion!D64","v":0},{"$f":"BalanceComprobacion!E64","v":11322830.07},{"$f":"BalanceComprobacion!F64","v":3767268.13},{"$f":"BalanceComprobacion!G64","v":7555561.9400000004}]
[{"$f":"IFERROR(IF(B19<>0,Data!$B$2,\"\"),\"\")","v":"15603"},{"$f":"BalanceComprobacion!A65","v":3.1},{"$f":"BalanceComprobacion!B65","v":"1.1.3.06.02.03.0.14226"},{"$f":"BalanceComprobacion!C65","v":"Transferencias de Instituciones Descentralizadas no Empresariales a cobrar c/p (Aporte IFAM Licores Nacionales y Ext)"},{"$f":"BalanceComprobacion!D65","v":0},{"$f":"BalanceComprobacion!E65","v":11322830.07},{"$f":"BalanceComprobacion!F65","v":3767268.13},{"$f":"BalanceComprobacion!G65","v":7555561.9400000004}]
[{"$f":"IFERROR(IF(B20<>0,Data!$B$2,\"\"),\"\")","v":"15603"},{"$f":"BalanceComprobacion!A66","v":3.1},{"$f":"BalanceComprobacion!B66","v":"1.1.3.98."},{"$f":"BalanceComprobacion!C66","v":"Otras cuentas a cobrar a corto plazo"},{"$f":"BalanceComprobacion!D66","v":2767182.6},{"$f":"BalanceComprobacion!E66","v":4441310.0999999996},{"$f":"BalanceComprobacion!F66","v":2519491.1},{"$f":"BalanceComprobacion!G66","v":4689001.5999999996}]
[{"$f":"IFERROR(IF(B21<>0,Data!$B$2,\"\"),\"\")","v":"15603"},{"$f":"BalanceComprobacion!A67","v":3.1},{"$f":"BalanceComprobacion!B67","v":"1.1.3.98.01."},{"$f":"BalanceComprobacion!C67","v":"Multas, sanciones, remates y confiscaciones de origen no tributario a cobrar c/p"},{"$f":"BalanceComprobacion!D67","v":2267182.6},{"$f":"BalanceComprobacion!E67","v":4441310.0999999996},{"$f":"BalanceComprobacion!F67","v":2519491.1},{"$f":"BalanceComprobacion!G67","v":4189001.6}]
[{"$f":"IFERROR(IF(B22<>0,Data!$B$2,\"\"),\"\")","v":"15603"},{"$f":"BalanceComprobacion!A68","v":3.1},{"$f":"BalanceComprobacion!B68","v":"1.1.3.98.01.01."},{"$f":"BalanceComprobacion!C68","v":"Multas y sanciones administrativas a cobrar c/p"},{"$f":"BalanceComprobacion!D68","v":2267182.6},{"$f":"BalanceComprobacion!E68","v":4441310.0999999996},{"$f":"BalanceComprobacion!F68","v":2519491.1},{"$f":"BalanceComprobacion!G68","v":4189001.6}]
[{"$f":"IFERROR(IF(B23<>0,Data!$B$2,\"\"),\"\")","v":"15603"},{"$f":"BalanceComprobacion!A69","v":3.1},{"$f":"BalanceComprobacion!B69","v":"1.1.3.98.01.01.0."},{"$f":"BalanceComprobacion!C69","v":"Multas y sanciones administrativas a cobrar c/p"},{"$f":"BalanceComprobacion!D69","v":2267182.6},{"$f":"BalanceComprobacion!E69","v":4441310.0999999996},{"$f":"BalanceComprobacion!F69","v":2519491.1},{"$f":"BalanceComprobacion!G69","v":4189001.6}]
[{"$f":"IFERROR(IF(B24<>0,Data!$B$2,\"\"),\"\")","v":"15603"},{"$f":"BalanceComprobacion!A70","v":3.1},{"$f":"BalanceComprobacion!B70","v":"1.1.3.98.01.01.0.99999"},{"$f":"BalanceComprobacion!C70","v":"Multas y sanciones administrativas a cobrar c/p"},{"$f":"BalanceComprobacion!D70","v":2267182.6},{"$f":"BalanceComprobacion!E70","v":4441310.0999999996},{"$f":"BalanceComprobacion!F70","v":2519491.1},{"$f":"BalanceComprobacion!G70","v":4189001.6}]
[{"$f":"IFERROR(IF(B25<>0,Data!$B$2,\"\"),\"\")","v":"15603"},{"$f":"BalanceComprobacion!A71","v":3.1},{"$f":"BalanceComprobacion!B71","v":"1.1.3.98.03."},{"$f":"BalanceComprobacion!C71","v":"Depósitos en garantía c/p"},{"$f":"BalanceComprobacion!D71","v":500000},{"$f":"BalanceComprobacion!E71","v":0},{"$f":"BalanceComprobacion!F71","v":0},{"$f":"BalanceComprobacion!G71","v":500000}]
[{"$f":"IFERROR(IF(B26<>0,Data!$B$2,\"\"),\"\")","v":"15603"},{"$f":"BalanceComprobacion!A72","v":3.1},{"$f":"BalanceComprobacion!B72","v":"1.1.3.98.03.02."},{"$f":"BalanceComprobacion!C72","v":"Depósitos en garantía en el sector público interno c/p"},{"$f":"BalanceComprobacion!D72","v":500000},{"$f":"BalanceComprobacion!E72","v":0},{"$f":"BalanceComprobacion!F72","v":0},{"$f":"BalanceComprobacion!G72","v":500000}]
[{"$f":"IFERROR(IF(B27<>0,Data!$B$2,\"\"),\"\")","v":"15603"},{"$f":"BalanceComprobacion!A73","v":3.1},{"$f":"BalanceComprobacion!B73","v":"1.1.3.98.03.02.0."},{"$f":"BalanceComprobacion!C73","v":"Depósitos en garantía en el sector público interno c/p"},{"$f":"BalanceComprobacion!D73","v":500000},{"$f":"BalanceComprobacion!E73","v":0},{"$f":"BalanceComprobacion!F73","v":0},{"$f":"BalanceComprobacion!G73","v":500000}]
[{"$f":"IFERROR(IF(B28<>0,Data!$B$2,\"\"),\"\")","v":"15603"},{"$f":"BalanceComprobacion!A74","v":3.1},{"$f":"BalanceComprobacion!B74","v":"1.1.3.98.03.02.0.99999"},{"$f":"BalanceComprobacion!C74","v":"Depósitos en garantía en el sector público interno c/p"},{"$f":"BalanceComprobacion!D74","v":500000},{"$f":"BalanceComprobacion!E74","v":0},{"$f":"BalanceComprobacion!F74","v":0},{"$f":"BalanceComprobacion!G74","v":500000}]
[{"$f":"IFERROR(IF(B29<>0,Data!$B$2,\"\"),\"\")","v":"15603"},{"$f":"BalanceComprobacion!A75","v":3.1},{"$f":"BalanceComprobacion!B75","v":"1.1.3.99."},{"$f":"BalanceComprobacion!C75","v":"Previsiones para deterioro de cuentas a cobrar a corto plazo *"},{"$f":"BalanceComprobacion!D75","v":-175377897.37},{"$f":"BalanceComprobacion!E75","v":0},{"$f":"BalanceComprobacion!F75","v":0},{"$f":"BalanceComprobacion!G75","v":-175377897.37}]
[{"$f":"IFERROR(IF(B30<>0,Data!$B$2,\"\"),\"\")","v":"15603"},{"$f":"BalanceComprobacion!A76","v":3.1},{"$f":"BalanceComprobacion!B76","v":"1.1.3.99.01."},{"$f":"BalanceComprobacion!C76","v":"Previsiones para impuestos a cobrar c/p *"},{"$f":"BalanceComprobacion!D76","v":-116983004.63},{"$f":"BalanceComprobacion!E76","v":0},{"$f":"BalanceComprobacion!F76","v":0},{"$f":"BalanceComprobacion!G76","v":-116983004.63}]
{"$rows_left_out":852}