{"text_format":"1","workbook":"xlsx","n_sheets":48,"sheets":["DATOS","BC_ACTUAL","BC_ANTERIOR","EEFF_SITUACION","EEFF_RENDIMIENTOS","EEFF_FLUJO","EEFF_CAPITAL","MATRIZ_AUTOVALUACION","NOTAS_POR_CUENTA","NICSP","NICSP_1","NICSP_2","NICSP_3","NICSP_4","NICSP_5","NICSP_9","NISCP_10","NICSP_11","NICSP_12","NICSP_13","NICSP_14","NICSP_16","NICSP_17","NICSP_18","NICSP_19_ACTIVO","NICSP_19_PASIVO","NICSP_20","NICSP_21","NICSP_22","NICSP_23","NICSP_24","NICSP_26","NICSP_27","NICSP_28_29_30","FIDEICOMISOS","NICSP_31","NICSP_32","NICSP_33","NICSP_34","NICSP_35","NICSP_36","NICSP_37","NICSP_38","NICSP_39","NICSP_40","NOTAS_PARTICULAR","PARAMETROS","BASE_DATOS"],"not_rendered":{"charts":0,"images":1,"macros":1,"external_links":0,"defined_names":2,"comments":0,"pivot_tables":0},"unopened":[],"bounds":{"document_bytes":16777216,"sheet_cells":100000,"rows_first":2000,"rows_last":500,"rows_between":2000,"halvings":0,"cell_chars":16384,"cell_head_chars":4096},"cells_cut":0,"cells_raw":0,"read":"whole","date_system":"1900"}

{"sheet":"DATOS","index":0,"n_rows":40,"n_cols":4,"rows_kept":40,"cut":false,"hidden":false,"merged":[[20,3,23,3],[27,3,30,3],[34,3,37,3]]}
[]
[]
[]
[null,null,null,"Ministerio de Hacienda "]
[null,null,null,"Dirección General de Contabilidad Nacional"]
[null,null,null,"Anexo de Notas a los Estados Financieros Entidades"]
[null,null,null,{"$f":"IFERROR(PROPER(D17),\"\")","v":""}]
[]
[]
[null,null,"NOMBRE_ARCHIVO",{"$f":"MID(CELL(\"filename\"),FIND(\"[\",CELL(\"filename\"))+1, FIND(\"]\",\nCELL(\"filename\"))-(FIND(\"[\",CELL(\"filename\"))+1))","v":"XXXXX_PXX_202X_Anexo_Estado_Notas_Contables_Vinculadas.xlsm"}]
[null,null,"GRUPO_INSTITUCIONAL",{"$f":"IFERROR(VLOOKUP(D12,PARAMETROS!F:I,4,0),\"\")","v":""}]
[null,null,"CODIGO_ENTIDAD",{"$f":"IFERROR(IF(MID(D10,1,5)=\"XXXXX\",\"\",MID(D10,1,5)),\"\")","v":""}]
[null,null,"NOMBRE_INSTITUCION ",{"$f":"IFERROR(IF(MID(D10,1,5)=\"XXXXX\",\"\",VLOOKUP(D12,PARAMETROS!F:G,2,0)),\"\")","v":""}]
[null,null,"PERIODO",{"$f":"IFERROR(IF(MID(D10,7,3)=\"PXX\",\"\",MID(D10,7,3)),\"\")","v":""}]
[null,null,"PERIODO_CONTABLE",{"$f":"IFERROR(IF(MID(D10,1,5)=\"XXXXX\",\"\",\"Del\"&\" \"&\"01\"&\" \"&\"de\"&\" \"&\"Enero\"&\" \"&\"al\"&\" \"&IF(MID(D10,7,3)=\"PXX\",\"\",VLOOKUP(MID(D10,7,3),PARAMETROS!M:O,3,0))),\"\")","v":""}]
[null,null,"AÑO",{"$f":"IFERROR(IF(MID(D10,1,5)=\"XXXXX\",\"\",MID(D10,11,4)),\"\")","v":""}]
[null,null,"PERIODO_ACTUAL",{"$f":"IFERROR(IF(MID(D10,1,5)=\"XXXXX\",\"\",VLOOKUP(MID(D10,7,3),PARAMETROS!M:N,2,0)&\" \"&MID(D10,11,4)),\"\")","v":""}]
[null,null,"PERIODO_ANTERIOR",{"$f":"IFERROR(IF(MID(D10,1,5)=\"XXXXX\",\"\",VLOOKUP(MID(D10,7,3),PARAMETROS!M:N,2,0)&\" \"&((TEXT(MID(D10,11,4),0)))-1),\"\")","v":""}]
[]
[]
[]
[]
[]
[]
[null,null,null,"Firma Digital del Representante Legal"]
[null,null,null,"Nombre del Representante Legal: "]
[]
[]
[]
[]
[]
[null,null,null,"Firma Digital del Jerarca Institucional"]
[null,null,null,"Nombre del Jerarca: "]
[]
[]
[]
[]
[]
[null,null,null,"Firma Digital del Contador"]
[null,null,null,"Nombre del Contador: "]

{"sheet":"BC_ACTUAL","index":1,"n_rows":499,"n_cols":8,"rows_kept":499,"cut":false,"hidden":false,"merged":[[5,1,5,6],[6,1,6,6],[7,1,7,6]]}
[]
[]
[]
[]
[]
[]
[]
[]
["CODIGO SEGMENTO","CUENTA (REPORTAR MÁXIMO A NIVEL 8)","NOMBRE CUENTA","SALDO INICIAL","DEBITOS PERIODO","CREDITOS PERIODO","SALDO FINAL"]
[]
[]
[]
[]
[]
[]
[]
[]
[]
[]
[]
[]
[]
[]
[]
[]
[]
[]
[]
[]
[]
[]
[]
[]
[]
[]
[]
[]
[]
[]
[]
[]
[]
[]
[]
[]
[]
[]
[]
[]
[]
[]
[]
[]
[]
[]
[]
[]
[]
[]
[]
[]
[]
[]
[]
[]
[]
[]
[]
[]
[]
[]
[]
[]
[]
[]
[]
[]
[]
[]
[]
[]
[]
[]
[]
[]
[]
[]
[]
[]
[]
[]
[]
[]
[]
[]
[]
[]
[]
[]
[]
[]
[]
[]
[]
[]
[]
[]
[]
[]
[]
[]
[]
[]
[]
[]
[]
[]
[]
[]
[]
[]
[]
[]
[]
[]
[]
[]
[]
[]
[]
[]
[]
[]
[]
[]
[]
[]
[]
[]
[]
[]
[]
[]
[]
[]
[]
[]
[]
[]
[]
[]
[]
[]
[]
[]
[]
[]
[]
[]
[]
[]
[]
[]
[]
[]
[]
[]
[]
[]
[]
[]
[]
[]
[]
[]
[]
[]
[]
[]
[]
[]
[]
[]
[]
[]
[]
[]
[]
[]
[]
[]
[]
[]
[]
[]
[]
[]
[]
[]
[]
[]
[]
[]
[]
[]
[]
[]
[]
[]
[]
[]
[]
[]
[]
[]
[]
[]
[]
[]
[]
[]
[]
[]
[]
[]
[]
[]
[]
[]
[]
[]
[]
[]
[]
[]
[]
[]
[]
[]
[]
[]
[]
[]
[]
[]
[]
[]
[]
[]
[]
[]
[]
[]
[]
[]
[]
[]
[]
[]
[]
[]
[]
[]
[]
[]
[]
[]
[]
[]
[]
[]
[]
[]
[]
[]
[]
[]
[]
[]
[]
[]
[]
[]
[]
[]
[]
[]
[]
[]
[]
[]
[]
[]
[]
[]
[]
[]
[]
[]
[]
[]
[]
[]
[]
[]
[]
[]
[]
[]
[]
[]
[]
[]
[]
[]
[]
[]
[]
[]
[]
[]
[]
[]
[]
[]
[]
[]
[]
[]
[]
[]
[]
[]
[]
[]
[]
[]
[]
[]
[]
[]
[]
[]
[]
[]
[]
[]
[]
[]
[]
[]
[]
[]
[]
[]
[]
[]
[]
[]
[]
[]
[]
[]
[]
[]
[]
[]
[]
[]
[]
[]
[]
[]
[]
[]
[]
[]
[]
[]
[]
[]
[]
[]
[]
[]
[]
[]
[]
[]
[]
[]
[]
[]
[]
[]
[]
[]
[]
[]
[]
[]
[]
[]
[]
[]
[]
[]
[]
[]
[]
[]
[]
[]
[]
[]
[]
[]
[]
[]
[]
[]
[]
[]
[]
[]
[]
[]
[]
[]
[]
[]
[]
[]
[]
[]
[]
[]
[]
[]
[]
[]
[]
[]
[]
[]
[]
[]
[]
[]
[]
[]
[]
[]
[]
[]
[]
[]
[]
[]
[]
[]
[]
[]
[]
[]
[]
[]
[]
[]
[]
[]
[]
[]
[]
[]
[]
[]
[]
[]
[]
[]
[]
[]
[]
[]
[]
[]
[]
[]
[]
[]
[]
[]
[]
[]
[]
[]
[]
[null,null,null,null,null,null,null,{"$f":"G499-G615","v":0}]

{"sheet":"BC_ANTERIOR","index":2,"n_rows":497,"n_cols":8,"rows_kept":497,"cut":false,"hidden":false,"merged":[[5,1,5,6],[6,1,6,6],[7,1,7,6]]}
[]
[]
[]
[]
[]
[]
[]
[]
["CODIGO SEGMENTO","CUENTA (REPORTAR MÁXIMO A NIVEL 8)","NOMBRE CUENTA","SALDO INICIAL","DEBITOS PERIODO","CREDITOS PERIODO","SALDO FINAL"]
[]
[]
[]
[]
[]
[]
[]
[]
[]
[]
[]
[]
[]
[]
[]
[]
[]
[]
[]
[]
[]
[]
[]
[]
[]
[]
[]
[]
[]
[]
[]
[]
[]
[]
[]
[]
[]
[]
[]
[]
[]
[]
[]
[]
[]
[]
[]
[]
[]
[]
[]
[]
[]
[]
[]
[]
[]
[]
[]
[]
[]
[]
[]
[]
[]
[]
[]
[]
[]
[]
[]
[]
[]
[]
[]
[]
[]
[]
[]
[]
[]
[]
[]
[]
[]
[]
[]
[]
[]
[]
[]
[]
[]
[]
[]
[]
[]
[]
[]
[]
[]
[]
[]
[]
[]
[]
[]
[]
[]
[]
[]
[]
[]
[]
[]
[]
[]
[]
[]
[]
[]
[]
[]
[]
[]
[]
[]
[]
[]
[]
[]
[]
[]
[]
[]
[]
[]
[]
[]
[]
[]
[]
[]
[]
[]
[]
[]
[]
[]
[]
[]
[]
[]
[]
[]
[]
[]
[]
[]
[]
[]
[]
[]
[]
[]
[]
[]
[]
[]
[]
[]
[]
[]
[]
[]
[]
[]
[]
[]
[]
[]
[]
[]
[]
[]
[]
[]
[]
[]
[]
[]
[]
[]
[]
[]
[]
[]
[]
[]
[]
[]
[]
[]
[]
[]
[]
[]
[]
[]
[]
[]
[]
[]
[]
[]
[]
[]
[]
[]
[]
[]
[]
[]
[]
[]
[]
[]
[]
[]
[]
[]
[]
[]
[]
[]
[]
[]
[]
[]
[]
[]
[]
[]
[]
[]
[]
[]
[]
[]
[]
[]
[]
[]
[]
[]
[]
[]
[]
[]
[]
[]
[]
[]
[]
[]
[]
[]
[]
[]
[]
[]
[]
[]
[]
[]
[]
[]
[]
[]
[]
[]
[]
[]
[]
[]
[]
[]
[]
[]
[]
[]
[]
[]
[]
[]
[]
[]
[]
[]
[]
[]
[]
[]
[]
[]
[]
[]
[]
[]
[]
[]
[]
[]
[]
[]
[]
[]
[]
[]
[]
[]
[]
[]
[]
[]
[]
[]
[]
[]
[]
[]
[]
[]
[]
[]
[]
[]
[]
[]
[]
[]
[]
[]
[]
[]
[]
[]
[]
[]
[]
[]
[]
[]
[]
[]
[]
[]
[]
[]
[]
[]
[]
[]
[]
[]
[]
[]
[]
[]
[]
[]
[]
[]
[]
[]
[]
[]
[]
[]
[]
[]
[]
[]
[]
[]
[]
[]
[]
[]
[]
[]
[]
[]
[]
[]
[]
[]
[]
[]
[]
[]
[]
[]
[]
[]
[]
[]
[]
[]
[]
[]
[]
[]
[]
[]
[]
[]
[]
[]
[]
[]
[]
[]
[]
[]
[]
[]
[]
[]
[]
[]
[]
[]
[]
[]
[]
[]
[]
[]
[]
[]
[]
[]
[]
[]
[]
[]
[]
[]
[]
[]
[]
[]
[]
[]
[]
[]
[]
[]
[]
[]
[]
[]
[]
[]
[]
[]
[]
[]
[]
[]
[]
[]
[]
[]
[]
[]
[]
[]
[]
[]
[]
[]
[]
[]
[]
[]
[null,null,null,null,null,null,null,{"$f":"G497-G614","v":0}]

{"sheet":"EEFF_SITUACION","index":3,"n_rows":183,"n_cols":12,"rows_kept":183,"cut":false,"hidden":false,"merged":[[0,0,0,4],[1,0,1,4],[2,0,2,4],[3,0,3,4],[0,6,0,9],[1,6,1,9],[2,6,2,9],[3,6,3,9]]}
[{"$f":"DATOS!D13","v":""}]
["Estado de Situación Financiera o Balance General",null,null,null,null,null,"Estado de Situación Financiera o Balance General"]
[{"$f":"DATOS!D15&\" \"&RIGHT(D6,4)","v":" "},null,null,null,null,null,"Análisis de Variaciones"]
["- En miles de colones -",null,null,null,null,null,{"$f":"DATOS!D15&\" \"&RIGHT(D6,4)","v":" "}]
[]
["Cuenta","Descripción","Nota",{"$f":"PROPER(DATOS!D17)","v":""},{"$f":"PROPER(DATOS!D18)","v":""},null,"Análisis Vertical (%) Periodo Actual","Análisis Vertical (%) Periodo Anterior","Monto Variación\nAbsoluta"," Variación relativa (%)"]
[]
["1.","ACTIVO"]
["1.1.","Activo Corriente"]
["1.1.1.","Efectivo y equivalentes de efectivo","03",{"$f":"SUM(D11:D12)","v":0},{"$f":"SUM(E11:E12)","v":0},null,{"$f":"IFERROR(D10/$D$91,0)","v":0},{"$f":"IFERROR(E10/$E$91,0)","v":0},{"$f":"IFERROR(D10-E10,0)","v":0},{"$f":"IFERROR(I10/E10,0)","v":0},null,{"$f":"\"La\"&\" \"&\"cuenta\"&\" \"&B10&\",\"&\" \"&\"representa\"&\" \"&\"el\"&\" \"&TEXT(G10,\"0,00%\")&\" \"&\"del\"&\" \"&\"total\"&\" \"&\"del\"&\" \"&IF(MID(A10,1,2)=\"1.\",\"Activo\",IF(MID(A10,1,2)=\"2.\",\"Pasivo\",IF(MID(A10,1,2)=\"3.\",\"Capital\",IF(MID(A10,1,2)=\"4.\",\"Ingresos\",IF(MID(A10,1,2)=\"5.\",\"Gastos\",\"\")))))&\",\"&\" \"&\"que\"&\" \"&\"comparado\"&\" \"&\"al\"&\" \"&\"periodo\"&\" \"&\"anterior\"&\" \"&\"genera\"&\" \"&\"una\"&\" \"&\"variación\"&\" \"&\"absoluta\"&\" \"&\"de\"&\" \"&TEXT(I10,\"0 000,00\")&\" \"&\"que\"&\" \"&\"corresponde\"&\" \"&\"a\"&\" \"&\"un\"&\" \"&IF(I10<0,\"Disminución\",\"Aumento\")&\" \"&\"del\"&\" \"&TEXT(J10,\"0,00%\")&\" \"&\"de\"&\" \"&\"recursos\"&\" \"&\"disponibles\"&\".\"","v":"La cuenta Efectivo y equivalentes de efectivo, representa el 0,00% del total del Activo, que comparado al periodo anterior genera una variación absoluta de 0 000,00 que corresponde a un Aumento del 0,00% de recursos disponibles."}]
["1.1.1.01.","Efectivo",null,{"$f":"IFERROR(VLOOKUP(A11,BC_ACTUAL!B:G,6,0)/1000,0)","v":0},{"$f":"IFERROR(VLOOKUP(A11,BC_ANTERIOR!B:G,6,0)/1000,0)","v":0},null,{"$f":"IFERROR(D11/$D$91,0)","v":0},{"$f":"IFERROR(E11/$E$91,0)","v":0},{"$f":"IFERROR(D11-E11,0)","v":0},{"$f":"IFERROR(I11/E11,0)","v":0},null,{"$f":"\"La\"&\" \"&\"cuenta\"&\" \"&B11&\",\"&\" \"&\"representa\"&\" \"&\"el\"&\" \"&TEXT(G11,\"0,00%\")&\" \"&\"del\"&\" \"&\"total\"&\" \"&\"del\"&\" \"&IF(MID(A11,1,2)=\"1.\",\"Activo\",IF(MID(A11,1,2)=\"2.\",\"Pasivo\",IF(MID(A11,1,2)=\"3.\",\"Capital\",IF(MID(A11,1,2)=\"4.\",\"Ingresos\",IF(MID(A11,1,2)=\"5.\",\"Gastos\",\"\")))))&\",\"&\" \"&\"que\"&\" \"&\"comparado\"&\" \"&\"al\"&\" \"&\"periodo\"&\" \"&\"anterior\"&\" \"&\"genera\"&\" \"&\"una\"&\" \"&\"variación\"&\" \"&\"absoluta\"&\" \"&\"de\"&\" \"&TEXT(I11,\"0 000,00\")&\" \"&\"que\"&\" \"&\"corresponde\"&\" \"&\"a\"&\" \"&\"un\"&\" \"&IF(I11<0,\"Disminución\",\"Aumento\")&\" \"&\"del\"&\" \"&TEXT(J11,\"0,00%\")&\" \"&\"de\"&\" \"&\"recursos\"&\" \"&\"disponibles\"&\".\"","v":"La cuenta Efectivo, representa el 0,00% del total del Activo, que comparado al periodo anterior genera una variación absoluta de 0 000,00 que corresponde a un Aumento del 0,00% de recursos disponibles."}]
["1.1.1.02.","Equivalentes de efectivo",null,{"$f":"IFERROR(VLOOKUP(A12,BC_ACTUAL!B:G,6,0)/1000,0)","v":0},{"$f":"IFERROR(VLOOKUP(A12,BC_ANTERIOR!B:G,6,0)/1000,0)","v":0},null,0,0,0,0,null,"La cuenta Equivalentes de efectivo, representa el 0,00% del total del Activo, que comparado al periodo anterior genera una variación absoluta de 0 000,00 que corresponde a un Aumento del 0,00% de recursos disponibles."]
["1.1.2.","Inversiones a corto plazo","04",{"$f":"SUM(D14:D18)","v":0},{"$f":"SUM(E14:E18)","v":0},null,0,0,0,0,null,"La cuenta Inversiones a corto plazo, representa el 0,00% del total del Activo, que comparado al periodo anterior genera una variación absoluta de 0 000,00 que corresponde a un Aumento del 0,00% de recursos disponibles."]
["1.1.2.01.","Títulos y valores a valor razonable a corto plazo",null,{"$f":"IFERROR(VLOOKUP(A14,BC_ACTUAL!B:G,6,0)/1000,0)","v":0},{"$f":"IFERROR(VLOOKUP(A14,BC_ANTERIOR!B:G,6,0)/1000,0)","v":0},null,0,0,0,{"$f":"IFERROR(I14/E14,0)","v":0},null,"La cuenta Títulos y valores a valor razonable a corto plazo, representa el 0,00% del total del Activo, que comparado al periodo anterior genera una variación absoluta de 0 000,00 que corresponde a un Aumento del 0,00% de recursos disponibles."]
["1.1.2.02.","Títulos y valores a costo amortizado a corto plazo",null,{"$f":"IFERROR(VLOOKUP(A15,BC_ACTUAL!B:G,6,0)/1000,0)","v":0},{"$f":"IFERROR(VLOOKUP(A15,BC_ANTERIOR!B:G,6,0)/1000,0)","v":0},null,0,0,0,0,null,"La cuenta Títulos y valores a costo amortizado a corto plazo, representa el 0,00% del total del Activo, que comparado al periodo anterior genera una variación absoluta de 0 000,00 que corresponde a un Aumento del 0,00% de recursos disponibles."]
["1.1.2.03.","Instrumentos Derivados a corto plazo",null,{"$f":"IFERROR(VLOOKUP(A16,BC_ACTUAL!B:G,6,0)/1000,0)","v":0},{"$f":"IFERROR(VLOOKUP(A16,BC_ANTERIOR!B:G,6,0)/1000,0)","v":0},null,0,0,0,0,null,"La cuenta Instrumentos Derivados a corto plazo, representa el 0,00% del total del Activo, que comparado al periodo anterior genera una variación absoluta de 0 000,00 que corresponde a un Aumento del 0,00% de recursos disponibles."]
["1.1.2.98.","Otras inversiones a corto plazo",null,{"$f":"IFERROR(VLOOKUP(A17,BC_ACTUAL!B:G,6,0)/1000,0)","v":0},{"$f":"IFERROR(VLOOKUP(A17,BC_ANTERIOR!B:G,6,0)/1000,0)","v":0},null,0,0,0,0,null,"La cuenta Otras inversiones a corto plazo, representa el 0,00% del total del Activo, que comparado al periodo anterior genera una variación absoluta de 0 000,00 que corresponde a un Aumento del 0,00% de recursos disponibles."]
["1.1.2.99.","Previsiones para deterioro de inversiones a corto plazo *",null,{"$f":"IFERROR(VLOOKUP(A18,BC_ACTUAL!B:G,6,0)/1000,0)","v":0},{"$f":"IFERROR(VLOOKUP(A18,BC_ANTERIOR!B:G,6,0)/1000,0)","v":0},null,0,0,0,0,null,"La cuenta Previsiones para deterioro de inversiones a corto plazo *, representa el 0,00% del total del Activo, que comparado al periodo anterior genera una variación absoluta de 0 000,00 que corresponde a un Aumento del 0,00% de recursos disponibles."]
["1.1.3.","Cuentas a cobrar a corto plazo","05",{"$f":"SUM(D20:D36)","v":0},{"$f":"SUM(E20:E36)","v":0},null,0,0,0,0,null,"La cuenta Cuentas a cobrar a corto plazo, representa el 0,00% del total del Activo, que comparado al periodo anterior genera una variación absoluta de 0 000,00 que corresponde a un Aumento del 0,00% de recursos disponibles."]
["1.1.3.01.","Impuestos a cobrar a corto plazo",null,{"$f":"IFERROR(VLOOKUP(A20,BC_ACTUAL!B:G,6,0)/1000,0)","v":0},{"$f":"IFERROR(VLOOKUP(A20,BC_ANTERIOR!B:G,6,0)/1000,0)","v":0},null,0,0,0,0,null,"La cuenta Impuestos a cobrar a corto plazo, representa el 0,00% del total del Activo, que comparado al periodo anterior genera una variación absoluta de 0 000,00 que corresponde a un Aumento del 0,00% de recursos disponibles."]
["1.1.3.02.","Contribuciones sociales a cobrar a corto plazo",null,{"$f":"IFERROR(VLOOKUP(A21,BC_ACTUAL!B:G,6,0)/1000,0)","v":0},{"$f":"IFERROR(VLOOKUP(A21,BC_ANTERIOR!B:G,6,0)/1000,0)","v":0},null,0,0,0,0,null,"La cuenta Contribuciones sociales a cobrar a corto plazo, representa el 0,00% del total del Activo, que comparado al periodo anterior genera una variación absoluta de 0 000,00 que corresponde a un Aumento del 0,00% de recursos disponibles."]
["1.1.3.03.","Ventas a cobrar a corto plazo",null,{"$f":"IFERROR(VLOOKUP(A22,BC_ACTUAL!B:G,6,0)/1000,0)","v":0},{"$f":"IFERROR(VLOOKUP(A22,BC_ANTERIOR!B:G,6,0)/1000,0)","v":0},null,0,0,0,0,null,"La cuenta Ventas a cobrar a corto plazo, representa el 0,00% del total del Activo, que comparado al periodo anterior genera una variación absoluta de 0 000,00 que corresponde a un Aumento del 0,00% de recursos disponibles."]
["1.1.3.04.","Servicios y derechos a cobrar a corto plazo",null,{"$f":"IFERROR(VLOOKUP(A23,BC_ACTUAL!B:G,6,0)/1000,0)","v":0},{"$f":"IFERROR(VLOOKUP(A23,BC_ANTERIOR!B:G,6,0)/1000,0)","v":0},null,0,0,0,0,null,"La cuenta Servicios y derechos a cobrar a corto plazo, representa el 0,00% del total del Activo, que comparado al periodo anterior genera una variación absoluta de 0 000,00 que corresponde a un Aumento del 0,00% de recursos disponibles."]
["1.1.3.05.","Ingresos de la propiedad a cobrar a corto plazo",null,{"$f":"IFERROR(VLOOKUP(A24,BC_ACTUAL!B:G,6,0)/1000,0)","v":0},{"$f":"IFERROR(VLOOKUP(A24,BC_ANTERIOR!B:G,6,0)/1000,0)","v":0},null,0,0,0,0,null,"La cuenta Ingresos de la propiedad a cobrar a corto plazo, representa el 0,00% del total del Activo, que comparado al periodo anterior genera una variación absoluta de 0 000,00 que corresponde a un Aumento del 0,00% de recursos disponibles."]
["1.1.3.06.","Transferencias a cobrar a corto plazo",null,{"$f":"IFERROR(VLOOKUP(A25,BC_ACTUAL!B:G,6,0)/1000,0)","v":0},{"$f":"IFERROR(VLOOKUP(A25,BC_ANTERIOR!B:G,6,0)/1000,0)","v":0},null,0,0,0,0,null,"La cuenta Transferencias a cobrar a corto plazo, representa el 0,00% del total del Activo, que comparado al periodo anterior genera una variación absoluta de 0 000,00 que corresponde a un Aumento del 0,00% de recursos disponibles."]
["1.1.3.07.","Préstamos a corto plazo",null,{"$f":"IFERROR(VLOOKUP(A26,BC_ACTUAL!B:G,6,0)/1000,0)","v":0},{"$f":"IFERROR(VLOOKUP(A26,BC_ANTERIOR!B:G,6,0)/1000,0)","v":0},null,0,0,0,0,null,"La cuenta Préstamos a corto plazo, representa el 0,00% del total del Activo, que comparado al periodo anterior genera una variación absoluta de 0 000,00 que corresponde a un Aumento del 0,00% de recursos disponibles."]
["1.1.3.08.","Documentos a cobrar a corto plazo",null,{"$f":"IFERROR(VLOOKUP(A27,BC_ACTUAL!B:G,6,0)/1000,0)","v":0},{"$f":"IFERROR(VLOOKUP(A27,BC_ANTERIOR!B:G,6,0)/1000,0)","v":0},null,0,0,0,0,null,"La cuenta Documentos a cobrar a corto plazo, representa el 0,00% del total del Activo, que comparado al periodo anterior genera una variación absoluta de 0 000,00 que corresponde a un Aumento del 0,00% de recursos disponibles."]
["1.1.3.09.","Anticipos a corto plazo",null,{"$f":"IFERROR(VLOOKUP(A28,BC_ACTUAL!B:G,6,0)/1000,0)","v":0},{"$f":"IFERROR(VLOOKUP(A28,BC_ANTERIOR!B:G,6,0)/1000,0)","v":0},null,0,0,0,0,null,"La cuenta Anticipos a corto plazo, representa el 0,00% del total del Activo, que comparado al periodo anterior genera una variación absoluta de 0 000,00 que corresponde a un Aumento del 0,00% de recursos disponibles."]
["1.1.3.10.","Deudores por avales ejecutados a corto plazo",null,{"$f":"IFERROR(VLOOKUP(A29,BC_ACTUAL!B:G,6,0)/1000,0)","v":0},{"$f":"IFERROR(VLOOKUP(A29,BC_ANTERIOR!B:G,6,0)/1000,0)","v":0},null,0,0,0,0,null,"La cuenta Deudores por avales ejecutados a corto plazo, representa el 0,00% del total del Activo, que comparado al periodo anterior genera una variación absoluta de 0 000,00 que corresponde a un Aumento del 0,00% de recursos disponibles."]
["1.1.3.11.","Planillas salariales",null,{"$f":"IFERROR(VLOOKUP(A30,BC_ACTUAL!B:G,6,0)/1000,0)","v":0},{"$f":"IFERROR(VLOOKUP(A30,BC_ANTERIOR!B:G,6,0)/1000,0)","v":0},null,0,0,0,0,null,"La cuenta Planillas salariales, representa el 0,00% del total del Activo, que comparado al periodo anterior genera una variación absoluta de 0 000,00 que corresponde a un Aumento del 0,00% de recursos disponibles."]
["1.1.3.12.","Beneficios Sociales",null,{"$f":"IFERROR(VLOOKUP(A31,BC_ACTUAL!B:G,6,0)/1000,0)","v":0},{"$f":"IFERROR(VLOOKUP(A31,BC_ANTERIOR!B:G,6,0)/1000,0)","v":0},null,0,0,0,0,null,"La cuenta Beneficios Sociales, representa el 0,00% del total del Activo, que comparado al periodo anterior genera una variación absoluta de 0 000,00 que corresponde a un Aumento del 0,00% de recursos disponibles."]
["1.1.3.13.","Cuentas por Cobrar Cajas Únicas",null,{"$f":"IFERROR(VLOOKUP(A32,BC_ACTUAL!B:G,6,0)/1000,0)","v":0},{"$f":"IFERROR(VLOOKUP(A32,BC_ANTERIOR!B:G,6,0)/1000,0)","v":0},null,0,0,0,0,null,"La cuenta Cuentas por Cobrar Cajas Únicas, representa el 0,00% del total del Activo, que comparado al periodo anterior genera una variación absoluta de 0 000,00 que corresponde a un Aumento del 0,00% de recursos disponibles."]
["1.1.3.50.","Registro transitorio de transacción de activo fijo",null,{"$f":"IFERROR(VLOOKUP(A33,BC_ACTUAL!B:G,6,0)/1000,0)","v":0},{"$f":"IFERROR(VLOOKUP(A33,BC_ANTERIOR!B:G,6,0)/1000,0)","v":0},null,0,0,0,0,null,"La cuenta Registro transitorio de transacción de activo fijo, representa el 0,00% del total del Activo, que comparado al periodo anterior genera una variación absoluta de 0 000,00 que corresponde a un Aumento del 0,00% de recursos disponibles."]
["1.1.3.97.","Cuentas a cobrar en gestión judicial",null,{"$f":"IFERROR(VLOOKUP(A34,BC_ACTUAL!B:G,6,0)/1000,0)","v":0},{"$f":"IFERROR(VLOOKUP(A34,BC_ANTERIOR!B:G,6,0)/1000,0)","v":0},null,0,0,0,0,null,"La cuenta Cuentas a cobrar en gestión judicial, representa el 0,00% del total del Activo, que comparado al periodo anterior genera una variación absoluta de 0 000,00 que corresponde a un Aumento del 0,00% de recursos disponibles."]
["1.1.3.98.","Otras cuentas a cobrar a corto plazo",null,{"$f":"IFERROR(VLOOKUP(A35,BC_ACTUAL!B:G,6,0)/1000,0)","v":0},{"$f":"IFERROR(VLOOKUP(A35,BC_ANTERIOR!B:G,6,0)/1000,0)","v":0},null,0,0,0,0,null,"La cuenta Otras cuentas a cobrar a corto plazo, representa el 0,00% del total del Activo, que comparado al periodo anterior genera una variación absoluta de 0 000,00 que corresponde a un Aumento del 0,00% de recursos disponibles."]
["1.1.3.99.","Previsiones para deterioro de cuentas a cobrar a corto plazo *",null,{"$f":"IFERROR(VLOOKUP(A36,BC_ACTUAL!B:G,6,0)/1000,0)","v":0},{"$f":"IFERROR(VLOOKUP(A36,BC_ANTERIOR!B:G,6,0)/1000,0)","v":0},null,0,0,0,0,null,"La cuenta Previsiones para deterioro de cuentas a cobrar a corto plazo *, representa el 0,00% del total del Activo, que comparado al periodo anterior genera una variación absoluta de 0 000,00 que corresponde a un Aumento del 0,00% de recursos disponibles."]
["1.1.4.","Inventarios","06",{"$f":"SUM(D38:D42)","v":0},{"$f":"SUM(E38:E42)","v":0},null,0,0,0,0,null,"La cuenta Inventarios, representa el 0,00% del total del Activo, que comparado al periodo anterior genera una variación absoluta de 0 000,00 que corresponde a un Aumento del 0,00% de recursos disponibles."]
["1.1.4.01.","Materiales y suministros para consumo y prestación de servicios",null,{"$f":"IFERROR(VLOOKUP(A38,BC_ACTUAL!B:G,6,0)/1000,0)","v":0},{"$f":"IFERROR(VLOOKUP(A38,BC_ANTERIOR!B:G,6,0)/1000,0)","v":0},null,0,0,0,0,null,"La cuenta Materiales y suministros para consumo y prestación de servicios, representa el 0,00% del total del Activo, que comparado al periodo anterior genera una variación absoluta de 0 000,00 que corresponde a un Aumento del 0,00% de recursos disponibles."]
["1.1.4.02.","Bienes para la venta",null,{"$f":"IFERROR(VLOOKUP(A39,BC_ACTUAL!B:G,6,0)/1000,0)","v":0},{"$f":"IFERROR(VLOOKUP(A39,BC_ANTERIOR!B:G,6,0)/1000,0)","v":0},null,0,0,0,0,null,"La cuenta Bienes para la venta, representa el 0,00% del total del Activo, que comparado al periodo anterior genera una variación absoluta de 0 000,00 que corresponde a un Aumento del 0,00% de recursos disponibles."]
["1.1.4.03.","Materias primas y bienes en producción",null,{"$f":"IFERROR(VLOOKUP(A40,BC_ACTUAL!B:G,6,0)/1000,0)","v":0},{"$f":"IFERROR(VLOOKUP(A40,BC_ANTERIOR!B:G,6,0)/1000,0)","v":0},null,0,0,0,0,null,"La cuenta Materias primas y bienes en producción, representa el 0,00% del total del Activo, que comparado al periodo anterior genera una variación absoluta de 0 000,00 que corresponde a un Aumento del 0,00% de recursos disponibles."]
["1.1.4.04.","Bienes a Transferir sin contraprestación - Donaciones",null,{"$f":"IFERROR(VLOOKUP(A41,BC_ACTUAL!B:G,6,0)/1000,0)","v":0},{"$f":"IFERROR(VLOOKUP(A41,BC_ANTERIOR!B:G,6,0)/1000,0)","v":0},null,0,0,0,0,null,"La cuenta Bienes a Transferir sin contraprestación - Donaciones, representa el 0,00% del total del Activo, que comparado al periodo anterior genera una variación absoluta de 0 000,00 que corresponde a un Aumento del 0,00% de recursos disponibles."]
["1.1.4.99.","Previsiones para deterioro y pérdidas de inventario *",null,{"$f":"IFERROR(VLOOKUP(A42,BC_ACTUAL!B:G,6,0)/1000,0)","v":0},{"$f":"IFERROR(VLOOKUP(A42,BC_ANTERIOR!B:G,6,0)/1000,0)","v":0},null,0,0,0,0,null,"La cuenta Previsiones para deterioro y pérdidas de inventario *, representa el 0,00% del total del Activo, que comparado al periodo anterior genera una variación absoluta de 0 000,00 que corresponde a un Aumento del 0,00% de recursos disponibles."]
["1.1.9.","Otros activos a corto plazo","07",{"$f":"SUM(D44:D46)","v":0},{"$f":"SUM(E44:E46)","v":0},null,0,0,0,0,null,"La cuenta Otros activos a corto plazo, representa el 0,00% del total del Activo, que comparado al periodo anterior genera una variación absoluta de 0 000,00 que corresponde a un Aumento del 0,00% de recursos disponibles."]
["1.1.9.01.","Gastos a devengar a corto plazo",null,{"$f":"IFERROR(VLOOKUP(A44,BC_ACTUAL!B:G,6,0)/1000,0)","v":0},{"$f":"IFERROR(VLOOKUP(A44,BC_ANTERIOR!B:G,6,0)/1000,0)","v":0},null,0,0,0,0,null,"La cuenta Gastos a devengar a corto plazo, representa el 0,00% del total del Activo, que comparado al periodo anterior genera una variación absoluta de 0 000,00 que corresponde a un Aumento del 0,00% de recursos disponibles."]
["1.1.9.02.","Cuentas transitorias",null,{"$f":"IFERROR(VLOOKUP(A45,BC_ACTUAL!B:G,6,0)/1000,0)","v":0},{"$f":"IFERROR(VLOOKUP(A45,BC_ANTERIOR!B:G,6,0)/1000,0)","v":0},null,0,0,0,0,null,"La cuenta Cuentas transitorias, representa el 0,00% del total del Activo, que comparado al periodo anterior genera una variación absoluta de 0 000,00 que corresponde a un Aumento del 0,00% de recursos disponibles."]
["1.1.9.99.","Activos a corto plazo sujetos a depuración contable",null,{"$f":"IFERROR(VLOOKUP(A46,BC_ACTUAL!B:G,6,0)/1000,0)","v":0},{"$f":"IFERROR(VLOOKUP(A46,BC_ANTERIOR!B:G,6,0)/1000,0)","v":0},null,0,0,0,0,null,"La cuenta Activos a corto plazo sujetos a depuración contable, representa el 0,00% del total del Activo, que comparado al periodo anterior genera una variación absoluta de 0 000,00 que corresponde a un Aumento del 0,00% de recursos disponibles."]
[null,"Total del Activo Corriente",null,{"$f":"+D43++D37+D19+D13+D10","v":0},{"$f":"+E43++E37+E19+E13+E10","v":0},null,{"$f":"+G43++G37+G19+G13+G10","v":0},{"$f":"+H43++H37+H19+H13+H10","v":0},{"$f":"+I43++I37+I19+I13+I10","v":0},0]
[]
["1.2.","Activo No Corriente"]
["1.2.2.","Inversiones a largo plazo","08",{"$f":"SUM(D51:D55)","v":0},{"$f":"SUM(E51:E55)","v":0},null,0,{"$f":"IFERROR(E50/$E$91,0)","v":0},0,0,null,"La cuenta Inversiones a largo plazo, representa el 0,00% del total del Activo, que comparado al periodo anterior genera una variación absoluta de 0 000,00 que corresponde a un Aumento del 0,00% de recursos disponibles."]
["1.2.2.01.","Títulos y valores a valor razonable a largo plazo",null,{"$f":"IFERROR(VLOOKUP(A51,BC_ACTUAL!B:G,6,0)/1000,0)","v":0},{"$f":"IFERROR(VLOOKUP(A51,BC_ANTERIOR!B:G,6,0)/1000,0)","v":0},null,0,0,0,0,null,"La cuenta Títulos y valores a valor razonable a largo plazo, representa el 0,00% del total del Activo, que comparado al periodo anterior genera una variación absoluta de 0 000,00 que corresponde a un Aumento del 0,00% de recursos disponibles."]
["1.2.2.02.","Títulos y valores a costo amortizado a largo plazo",null,{"$f":"IFERROR(VLOOKUP(A52,BC_ACTUAL!B:G,6,0)/1000,0)","v":0},{"$f":"IFERROR(VLOOKUP(A52,BC_ANTERIOR!B:G,6,0)/1000,0)","v":0},null,0,0,0,0,null,"La cuenta Títulos y valores a costo amortizado a largo plazo, representa el 0,00% del total del Activo, que comparado al periodo anterior genera una variación absoluta de 0 000,00 que corresponde a un Aumento del 0,00% de recursos disponibles."]
["1.2.2.03.","Instrumentos Derivados a largo plazo",null,{"$f":"IFERROR(VLOOKUP(A53,BC_ACTUAL!B:G,6,0)/1000,0)","v":0},{"$f":"IFERROR(VLOOKUP(A53,BC_ANTERIOR!B:G,6,0)/1000,0)","v":0},null,0,0,0,0,null,"La cuenta Instrumentos Derivados a largo plazo, representa el 0,00% del total del Activo, que comparado al periodo anterior genera una variación absoluta de 0 000,00 que corresponde a un Aumento del 0,00% de recursos disponibles."]
["1.2.2.98.","Otras inversiones a largo plazo",null,{"$f":"IFERROR(VLOOKUP(A54,BC_ACTUAL!B:G,6,0)/1000,0)","v":0},{"$f":"IFERROR(VLOOKUP(A54,BC_ANTERIOR!B:G,6,0)/1000,0)","v":0},null,0,0,0,0,null,"La cuenta Otras inversiones a largo plazo, representa el 0,00% del total del Activo, que comparado al periodo anterior genera una variación absoluta de 0 000,00 que corresponde a un Aumento del 0,00% de recursos disponibles."]
["1.2.2.99.","Previsiones para deterioro de inversiones a largo plazo *",null,{"$f":"IFERROR(VLOOKUP(A55,BC_ACTUAL!B:G,6,0)/1000,0)","v":0},{"$f":"IFERROR(VLOOKUP(A55,BC_ANTERIOR!B:G,6,0)/1000,0)","v":0},null,0,0,0,0,null,"La cuenta Previsiones para deterioro de inversiones a largo plazo *, representa el 0,00% del total del Activo, que comparado al periodo anterior genera una variación absoluta de 0 000,00 que corresponde a un Aumento del 0,00% de recursos disponibles."]
["1.2.3.","Cuentas a cobrar a largo plazo","09",{"$f":"SUM(D57:D63)","v":0},{"$f":"SUM(E57:E63)","v":0},null,0,0,0,0,null,"La cuenta Cuentas a cobrar a largo plazo, representa el 0,00% del total del Activo, que comparado al periodo anterior genera una variación absoluta de 0 000,00 que corresponde a un Aumento del 0,00% de recursos disponibles."]
["1.2.3.03.","Ventas a cobrar a largo plazo",null,{"$f":"IFERROR(VLOOKUP(A57,BC_ACTUAL!B:G,6,0)/1000,0)","v":0},{"$f":"IFERROR(VLOOKUP(A57,BC_ANTERIOR!B:G,6,0)/1000,0)","v":0},null,0,0,0,0,null,"La cuenta Ventas a cobrar a largo plazo, representa el 0,00% del total del Activo, que comparado al periodo anterior genera una variación absoluta de 0 000,00 que corresponde a un Aumento del 0,00% de recursos disponibles."]
["1.2.3.07.","Préstamos a largo plazo",null,{"$f":"IFERROR(VLOOKUP(A58,BC_ACTUAL!B:G,6,0)/1000,0)","v":0},{"$f":"IFERROR(VLOOKUP(A58,BC_ANTERIOR!B:G,6,0)/1000,0)","v":0},null,0,0,0,0,null,"La cuenta Préstamos a largo plazo, representa el 0,00% del total del Activo, que comparado al periodo anterior genera una variación absoluta de 0 000,00 que corresponde a un Aumento del 0,00% de recursos disponibles."]
["1.2.3.08.","Documentos a cobrar a largo plazo",null,{"$f":"IFERROR(VLOOKUP(A59,BC_ACTUAL!B:G,6,0)/1000,0)","v":0},{"$f":"IFERROR(VLOOKUP(A59,BC_ANTERIOR!B:G,6,0)/1000,0)","v":0},null,0,0,0,0,null,"La cuenta Documentos a cobrar a largo plazo, representa el 0,00% del total del Activo, que comparado al periodo anterior genera una variación absoluta de 0 000,00 que corresponde a un Aumento del 0,00% de recursos disponibles."]
["1.2.3.09.","Anticipos a largo plazo",null,{"$f":"IFERROR(VLOOKUP(A60,BC_ACTUAL!B:G,6,0)/1000,0)","v":0},{"$f":"IFERROR(VLOOKUP(A60,BC_ANTERIOR!B:G,6,0)/1000,0)","v":0},null,0,0,0,0,null,"La cuenta Anticipos a largo plazo, representa el 0,00% del total del Activo, que comparado al periodo anterior genera una variación absoluta de 0 000,00 que corresponde a un Aumento del 0,00% de recursos disponibles."]
["1.2.3.10.","Deudores por avales ejecutados a largo plazo",null,{"$f":"IFERROR(VLOOKUP(A61,BC_ACTUAL!B:G,6,0)/1000,0)","v":0},{"$f":"IFERROR(VLOOKUP(A61,BC_ANTERIOR!B:G,6,0)/1000,0)","v":0},null,0,0,0,0,null,"La cuenta Deudores por avales ejecutados a largo plazo, representa el 0,00% del total del Activo, que comparado al periodo anterior genera una variación absoluta de 0 000,00 que corresponde a un Aumento del 0,00% de recursos disponibles."]
["1.2.3.98.","Otras cuentas a cobrar a largo plazo",null,{"$f":"IFERROR(VLOOKUP(A62,BC_ACTUAL!B:G,6,0)/1000,0)","v":0},{"$f":"IFERROR(VLOOKUP(A62,BC_ANTERIOR!B:G,6,0)/1000,0)","v":0},null,0,0,0,0,null,"La cuenta Otras cuentas a cobrar a largo plazo, representa el 0,00% del total del Activo, que comparado al periodo anterior genera una variación absoluta de 0 000,00 que corresponde a un Aumento del 0,00% de recursos disponibles."]
["1.2.3.99.","Previsiones para deterioro de cuentas a cobrar a largo plazo *",null,{"$f":"IFERROR(VLOOKUP(A63,BC_ACTUAL!B:G,6,0)/1000,0)","v":0},{"$f":"IFERROR(VLOOKUP(A63,BC_ANTERIOR!B:G,6,0)/1000,0)","v":0},null,0,0,0,0,null,"La cuenta Previsiones para deterioro de cuentas a cobrar a largo plazo *, representa el 0,00% del total del Activo, que comparado al periodo anterior genera una variación absoluta de 0 000,00 que corresponde a un Aumento del 0,00% de recursos disponibles."]
["1.2.5.","Bienes no concesionados","10",{"$f":"SUM(D65:D73)","v":0},{"$f":"SUM(E65:E73)","v":0},null,0,0,0,0,null,"La cuenta Bienes no concesionados, representa el 0,00% del total del Activo, que comparado al periodo anterior genera una variación absoluta de 0 000,00 que corresponde a un Aumento del 0,00% de recursos disponibles."]
["1.2.5.01.","Propiedades, planta y equipos explotados",null,{"$f":"IFERROR(VLOOKUP(A65,BC_ACTUAL!B:G,6,0)/1000,0)","v":0},{"$f":"IFERROR(VLOOKUP(A65,BC_ANTERIOR!B:G,6,0)/1000,0)","v":0},null,0,0,0,0,null,"La cuenta Propiedades, planta y equipos explotados, representa el 0,00% del total del Activo, que comparado al periodo anterior genera una variación absoluta de 0 000,00 que corresponde a un Aumento del 0,00% de recursos disponibles."]
["1.2.5.02.","Propiedades de inversión",null,{"$f":"IFERROR(VLOOKUP(A66,BC_ACTUAL!B:G,6,0)/1000,0)","v":0},{"$f":"IFERROR(VLOOKUP(A66,BC_ANTERIOR!B:G,6,0)/1000,0)","v":0},null,0,0,0,0,null,"La cuenta Propiedades de inversión, representa el 0,00% del total del Activo, que comparado al periodo anterior genera una variación absoluta de 0 000,00 que corresponde a un Aumento del 0,00% de recursos disponibles."]
["1.2.5.03.","Activos biológicos no concesionados",null,{"$f":"IFERROR(VLOOKUP(A67,BC_ACTUAL!B:G,6,0)/1000,0)","v":0},{"$f":"IFERROR(VLOOKUP(A67,BC_ANTERIOR!B:G,6,0)/1000,0)","v":0},null,0,0,0,0,null,"La cuenta Activos biológicos no concesionados, representa el 0,00% del total del Activo, que comparado al periodo anterior genera una variación absoluta de 0 000,00 que corresponde a un Aumento del 0,00% de recursos disponibles."]
["1.2.5.04.","Bienes de infraestructura y de beneficio y uso público en servicio",null,{"$f":"IFERROR(VLOOKUP(A68,BC_ACTUAL!B:G,6,0)/1000,0)","v":0},{"$f":"IFERROR(VLOOKUP(A68,BC_ANTERIOR!B:G,6,0)/1000,0)","v":0},null,0,0,0,0,null,"La cuenta Bienes de infraestructura y de beneficio y uso público en servicio, representa el 0,00% del total del Activo, que comparado al periodo anterior genera una variación absoluta de 0 000,00 que corresponde a un Aumento del 0,00% de recursos disponibles."]
["1.2.5.05.","Bienes históricos y culturales",null,{"$f":"IFERROR(VLOOKUP(A69,BC_ACTUAL!B:G,6,0)/1000,0)","v":0},{"$f":"IFERROR(VLOOKUP(A69,BC_ANTERIOR!B:G,6,0)/1000,0)","v":0},null,0,0,0,0,null,"La cuenta Bienes históricos y culturales, representa el 0,00% del total del Activo, que comparado al periodo anterior genera una variación absoluta de 0 000,00 que corresponde a un Aumento del 0,00% de recursos disponibles."]
["1.2.5.06.","Recursos naturales en explotación",null,{"$f":"IFERROR(VLOOKUP(A70,BC_ACTUAL!B:G,6,0)/1000,0)","v":0},{"$f":"IFERROR(VLOOKUP(A70,BC_ANTERIOR!B:G,6,0)/1000,0)","v":0},null,0,0,0,0,null,"La cuenta Recursos naturales en explotación, representa el 0,00% del total del Activo, que comparado al periodo anterior genera una variación absoluta de 0 000,00 que corresponde a un Aumento del 0,00% de recursos disponibles."]
["1.2.5.07.","Recursos naturales en conservación",null,{"$f":"IFERROR(VLOOKUP(A71,BC_ACTUAL!B:G,6,0)/1000,0)","v":0},{"$f":"IFERROR(VLOOKUP(A71,BC_ANTERIOR!B:G,6,0)/1000,0)","v":0},null,0,0,0,0,null,"La cuenta Recursos naturales en conservación, representa el 0,00% del total del Activo, que comparado al periodo anterior genera una variación absoluta de 0 000,00 que corresponde a un Aumento del 0,00% de recursos disponibles."]
["1.2.5.08.","Bienes intangibles no concesionados",null,{"$f":"IFERROR(VLOOKUP(A72,BC_ACTUAL!B:G,6,0)/1000,0)","v":0},{"$f":"IFERROR(VLOOKUP(A72,BC_ANTERIOR!B:G,6,0)/1000,0)","v":0},null,0,0,0,0,null,"La cuenta Bienes intangibles no concesionados, representa el 0,00% del total del Activo, que comparado al periodo anterior genera una variación absoluta de 0 000,00 que corresponde a un Aumento del 0,00% de recursos disponibles."]
["1.2.5.99.","Bienes no concesionados en proceso de producción",null,{"$f":"IFERROR(VLOOKUP(A73,BC_ACTUAL!B:G,6,0)/1000,0)","v":0},{"$f":"IFERROR(VLOOKUP(A73,BC_ANTERIOR!B:G,6,0)/1000,0)","v":0},null,0,0,0,0,null,"La cuenta Bienes no concesionados en proceso de producción, representa el 0,00% del total del Activo, que comparado al periodo anterior genera una variación absoluta de 0 000,00 que corresponde a un Aumento del 0,00% de recursos disponibles."]
["1.2.6.","Bienes concesionados","11",{"$f":"SUM(D75:D80)","v":0},{"$f":"SUM(E75:E80)","v":0},null,0,0,0,0,null,"La cuenta Bienes concesionados, representa el 0,00% del total del Activo, que comparado al periodo anterior genera una variación absoluta de 0 000,00 que corresponde a un Aumento del 0,00% de recursos disponibles."]
["1.2.6.01.","Propiedades, planta y equipos concesionados",null,{"$f":"IFERROR(VLOOKUP(A75,BC_ACTUAL!B:G,6,0)/1000,0)","v":0},{"$f":"IFERROR(VLOOKUP(A75,BC_ANTERIOR!B:G,6,0)/1000,0)","v":0},null,{"$f":"IFERROR(D75/$D$91,0)","v":0},0,{"$f":"IFERROR(D75-E75,0)","v":0},{"$f":"IFERROR(I75/E75,0)","v":0},null,{"$f":"\"La\"&\" \"&\"cuenta\"&\" \"&B75&\",\"&\" \"&\"representa\"&\" \"&\"el\"&\" \"&TEXT(G75,\"0,00%\")&\" \"&\"del\"&\" \"&\"total\"&\" \"&\"del\"&\" \"&IF(MID(A75,1,2)=\"1.\",\"Activo\",IF(MID(A75,1,2)=\"2.\",\"Pasivo\",IF(MID(A75,1,2)=\"3.\",\"Capital\",IF(MID(A75,1,2)=\"4.\",\"Ingresos\",IF(MID(A75,1,2)=\"5.\",\"Gastos\",\"\")))))&\",\"&\" \"&\"que\"&\" \"&\"comparado\"&\" \"&\"al\"&\" \"&\"periodo\"&\" \"&\"anterior\"&\" \"&\"genera\"&\" \"&\"una\"&\" \"&\"variación\"&\" \"&\"absoluta\"&\" \"&\"de\"&\" \"&TEXT(I75,\"0 000,00\")&\" \"&\"que\"&\" \"&\"corresponde\"&\" \"&\"a\"&\" \"&\"un\"&\" \"&IF(I75<0,\"Disminución\",\"Aumento\")&\" \"&\"del\"&\" \"&TEXT(J75,\"0,00%\")&\" \"&\"de\"&\" \"&\"recursos\"&\" \"&\"disponibles\"&\".\"","v":"La cuenta Propiedades, planta y equipos concesionados, representa el 0,00% del total del Activo, que comparado al periodo anterior genera una variación absoluta de 0 000,00 que corresponde a un Aumento del 0,00% de recursos disponibles."}]
["1.2.6.03.","Activos biológicos concesionados",null,{"$f":"IFERROR(VLOOKUP(A76,BC_ACTUAL!B:G,6,0)/1000,0)","v":0},{"$f":"IFERROR(VLOOKUP(A76,BC_ANTERIOR!B:G,6,0)/1000,0)","v":0},null,0,0,0,0,null,"La cuenta Activos biológicos concesionados, representa el 0,00% del total del Activo, que comparado al periodo anterior genera una variación absoluta de 0 000,00 que corresponde a un Aumento del 0,00% de recursos disponibles."]
["1.2.6.04.","Bienes de infraestructura y de beneficio y uso público concesionados",null,{"$f":"IFERROR(VLOOKUP(A77,BC_ACTUAL!B:G,6,0)/1000,0)","v":0},{"$f":"IFERROR(VLOOKUP(A77,BC_ANTERIOR!B:G,6,0)/1000,0)","v":0},null,0,0,0,0,null,"La cuenta Bienes de infraestructura y de beneficio y uso público concesionados, representa el 0,00% del total del Activo, que comparado al periodo anterior genera una variación absoluta de 0 000,00 que corresponde a un Aumento del 0,00% de recursos disponibles."]
["1.2.6.06.","Recursos naturales concesionados",null,{"$f":"IFERROR(VLOOKUP(A78,BC_ACTUAL!B:G,6,0)/1000,0)","v":0},{"$f":"IFERROR(VLOOKUP(A78,BC_ANTERIOR!B:G,6,0)/1000,0)","v":0},null,0,0,0,0,null,"La cuenta Recursos naturales concesionados, representa el 0,00% del total del Activo, que comparado al periodo anterior genera una variación absoluta de 0 000,00 que corresponde a un Aumento del 0,00% de recursos disponibles."]
["1.2.6.08.","Bienes intangibles concesionados",null,{"$f":"IFERROR(VLOOKUP(A79,BC_ACTUAL!B:G,6,0)/1000,0)","v":0},{"$f":"IFERROR(VLOOKUP(A79,BC_ANTERIOR!B:G,6,0)/1000,0)","v":0},null,0,0,0,0,null,"La cuenta Bienes intangibles concesionados, representa el 0,00% del total del Activo, que comparado al periodo anterior genera una variación absoluta de 0 000,00 que corresponde a un Aumento del 0,00% de recursos disponibles."]
["1.2.6.99.","Bienes concesionados en proceso de producción",null,{"$f":"IFERROR(VLOOKUP(A80,BC_ACTUAL!B:G,6,0)/1000,0)","v":0},{"$f":"IFERROR(VLOOKUP(A80,BC_ANTERIOR!B:G,6,0)/1000,0)","v":0},null,0,0,0,0,null,"La cuenta Bienes concesionados en proceso de producción, representa el 0,00% del total del Activo, que comparado al periodo anterior genera una variación absoluta de 0 000,00 que corresponde a un Aumento del 0,00% de recursos disponibles."]
["1.2.7.","Inversiones patrimoniales - Método de participación","12",{"$f":"SUM(D82:D85)","v":0},{"$f":"SUM(E82:E85)","v":0},null,0,0,0,0,null,"La cuenta Inversiones patrimoniales - Método de participación, representa el 0,00% del total del Activo, que comparado al periodo anterior genera una variación absoluta de 0 000,00 que corresponde a un Aumento del 0,00% de recursos disponibles."]
["1.2.7.01.","Inversiones patrimoniales en el sector privado interno",null,{"$f":"IFERROR(VLOOKUP(A82,BC_ACTUAL!B:G,6,0)/1000,0)","v":0},{"$f":"IFERROR(VLOOKUP(A82,BC_ANTERIOR!B:G,6,0)/1000,0)","v":0},null,0,0,0,0,null,"La cuenta Inversiones patrimoniales en el sector privado interno, representa el 0,00% del total del Activo, que comparado al periodo anterior genera una variación absoluta de 0 000,00 que corresponde a un Aumento del 0,00% de recursos disponibles."]
["1.2.7.02.","Inversiones patrimoniales en el sector público interno",null,{"$f":"IFERROR(VLOOKUP(A83,BC_ACTUAL!B:G,6,0)/1000,0)","v":0},{"$f":"IFERROR(VLOOKUP(A83,BC_ANTERIOR!B:G,6,0)/1000,0)","v":0},null,0,0,0,0,null,"La cuenta Inversiones patrimoniales en el sector público interno, representa el 0,00% del total del Activo, que comparado al periodo anterior genera una variación absoluta de 0 000,00 que corresponde a un Aumento del 0,00% de recursos disponibles."]
["1.2.7.03.","Inversiones patrimoniales en el sector externo",null,{"$f":"IFERROR(VLOOKUP(A84,BC_ACTUAL!B:G,6,0)/1000,0)","v":0},{"$f":"IFERROR(VLOOKUP(A84,BC_ANTERIOR!B:G,6,0)/1000,0)","v":0},null,0,0,0,0,null,"La cuenta Inversiones patrimoniales en el sector externo, representa el 0,00% del total del Activo, que comparado al periodo anterior genera una variación absoluta de 0 000,00 que corresponde a un Aumento del 0,00% de recursos disponibles."]
["1.2.7.04.","Inversiones patrimoniales en fideicomisos",null,{"$f":"IFERROR(VLOOKUP(A85,BC_ACTUAL!B:G,6,0)/1000,0)","v":0},{"$f":"IFERROR(VLOOKUP(A85,BC_ANTERIOR!B:G,6,0)/1000,0)","v":0},null,0,0,0,0,null,"La cuenta Inversiones patrimoniales en fideicomisos, representa el 0,00% del total del Activo, que comparado al periodo anterior genera una variación absoluta de 0 000,00 que corresponde a un Aumento del 0,00% de recursos disponibles."]
["1.2.9.","Otros activos a largo plazo","13",{"$f":"SUM(D87:D89)","v":0},{"$f":"SUM(E87:E89)","v":0},null,0,0,0,0,null,"La cuenta Otros activos a largo plazo, representa el 0,00% del total del Activo, que comparado al periodo anterior genera una variación absoluta de 0 000,00 que corresponde a un Aumento del 0,00% de recursos disponibles."]
["1.2.9.01.","Gastos a devengar a largo plazo",null,{"$f":"IFERROR(VLOOKUP(A87,BC_ACTUAL!B:G,6,0)/1000,0)","v":0},{"$f":"IFERROR(VLOOKUP(A87,BC_ANTERIOR!B:G,6,0)/1000,0)","v":0},null,0,0,0,0,null,"La cuenta Gastos a devengar a largo plazo, representa el 0,00% del total del Activo, que comparado al periodo anterior genera una variación absoluta de 0 000,00 que corresponde a un Aumento del 0,00% de recursos disponibles."]
["1.2.9.03.","Objetos de valor",null,{"$f":"IFERROR(VLOOKUP(A88,BC_ACTUAL!B:G,6,0)/1000,0)","v":0},{"$f":"IFERROR(VLOOKUP(A88,BC_ANTERIOR!B:G,6,0)/1000,0)","v":0},null,{"$f":"IFERROR(D88/$D$91,0)","v":0},0,0,0,null,"La cuenta Objetos de valor, representa el 0,00% del total del Activo, que comparado al periodo anterior genera una variación absoluta de 0 000,00 que corresponde a un Aumento del 0,00% de recursos disponibles."]
["1.2.9.99.","Activos a largo plazo sujetos a depuración contable",null,{"$f":"IFERROR(VLOOKUP(A89,BC_ACTUAL!B:G,6,0)/1000,0)","v":0},{"$f":"IFERROR(VLOOKUP(A89,BC_ANTERIOR!B:G,6,0)/1000,0)","v":0},null,0,0,0,0,null,"La cuenta Activos a largo plazo sujetos a depuración contable, representa el 0,00% del total del Activo, que comparado al periodo anterior genera una variación absoluta de 0 000,00 que corresponde a un Aumento del 0,00% de recursos disponibles."]
[null,"Total del Activo no Corriente",null,{"$f":"+D86+D81+D74+D64+D56+D50","v":0},{"$f":"+E86+E81+E74+E64+E56+E50","v":0},null,{"$f":"+G86+G81+G74+G64+G56+G50","v":0},{"$f":"+H86+H81+H74+H64+H56+H50","v":0},{"$f":"+I86+I81+I74+I64+I56+I50","v":0},0,null,"La cuenta Total del Activo no Corriente, representa el 0,00% del total del , que comparado al periodo anterior genera una variación absoluta de 0 000,00 que corresponde a un Aumento del 0,00% de recursos disponibles."]
[null,"TOTAL DEL ACTIVO",null,{"$f":"+D90+D47","v":0},{"$f":"+E90+E47","v":0},null,{"$f":"+G90+G47","v":0},{"$f":"+H90+H47","v":0},{"$f":"+I90+I47","v":0},0]
[null,null,null," "," "]
["2.","PASIVO"]
["2.1.","Pasivo Corriente"]
["2.1.1.","Deudas a corto plazo","14",{"$f":"SUM(D96:D105)","v":0},{"$f":"SUM(E96:E105)","v":0},null,{"$f":"IFERROR(D95/$D$151,0)","v":0},{"$f":"IFERROR(E95/$E$151,0)","v":0},0,0,null,"La cuenta Deudas a corto plazo, representa el 0,00% del total del Pasivo, que comparado al periodo anterior genera una variación absoluta de 0 000,00 que corresponde a un Aumento del 0,00% de recursos disponibles."]
["2.1.1.01.","Deudas comerciales a corto plazo",null,{"$f":"IFERROR(VLOOKUP(A96,BC_ACTUAL!B:G,6,0)/1000,0)","v":0},{"$f":"IFERROR(VLOOKUP(A96,BC_ANTERIOR!B:G,6,0)/1000,0)","v":0},null,{"$f":"IFERROR(D96/$D$151,0)","v":0},{"$f":"IFERROR(E96/$E$151,0)","v":0},0,0,null,"La cuenta Deudas comerciales a corto plazo, representa el 0,00% del total del Pasivo, que comparado al periodo anterior genera una variación absoluta de 0 000,00 que corresponde a un Aumento del 0,00% de recursos disponibles."]
["2.1.1.02.","Deudas sociales y fiscales a corto plazo",null,{"$f":"IFERROR(VLOOKUP(A97,BC_ACTUAL!B:G,6,0)/1000,0)","v":0},{"$f":"IFERROR(VLOOKUP(A97,BC_ANTERIOR!B:G,6,0)/1000,0)","v":0},null,0,0,0,0,null,"La cuenta Deudas sociales y fiscales a corto plazo, representa el 0,00% del total del Pasivo, que comparado al periodo anterior genera una variación absoluta de 0 000,00 que corresponde a un Aumento del 0,00% de recursos disponibles."]
["2.1.1.03.","Transferencias a pagar a corto plazo",null,{"$f":"IFERROR(VLOOKUP(A98,BC_ACTUAL!B:G,6,0)/1000,0)","v":0},{"$f":"IFERROR(VLOOKUP(A98,BC_ANTERIOR!B:G,6,0)/1000,0)","v":0},null,0,0,0,0,null,"La cuenta Transferencias a pagar a corto plazo, representa el 0,00% del total del Pasivo, que comparado al periodo anterior genera una variación absoluta de 0 000,00 que corresponde a un Aumento del 0,00% de recursos disponibles."]
["2.1.1.04.","Documentos a pagar a corto plazo",null,{"$f":"IFERROR(VLOOKUP(A99,BC_ACTUAL!B:G,6,0)/1000,0)","v":0},{"$f":"IFERROR(VLOOKUP(A99,BC_ANTERIOR!B:G,6,0)/1000,0)","v":0},null,0,0,0,0,null,"La cuenta Documentos a pagar a corto plazo, representa el 0,00% del total del Pasivo, que comparado al periodo anterior genera una variación absoluta de 0 000,00 que corresponde a un Aumento del 0,00% de recursos disponibles."]
["2.1.1.05.","Inversiones patrimoniales a pagar a corto plazo",null,{"$f":"IFERROR(VLOOKUP(A100,BC_ACTUAL!B:G,6,0)/1000,0)","v":0},{"$f":"IFERROR(VLOOKUP(A100,BC_ANTERIOR!B:G,6,0)/1000,0)","v":0},null,0,0,0,0,null,"La cuenta Inversiones patrimoniales a pagar a corto plazo, representa el 0,00% del total del Pasivo, que comparado al periodo anterior genera una variación absoluta de 0 000,00 que corresponde a un Aumento del 0,00% de recursos disponibles."]
["2.1.1.06.","Deudas por avales ejecutados a corto plazo",null,{"$f":"IFERROR(VLOOKUP(A101,BC_ACTUAL!B:G,6,0)/1000,0)","v":0},{"$f":"IFERROR(VLOOKUP(A101,BC_ANTERIOR!B:G,6,0)/1000,0)","v":0},null,0,0,0,0,null,"La cuenta Deudas por avales ejecutados a corto plazo, representa el 0,00% del total del Pasivo, que comparado al periodo anterior genera una variación absoluta de 0 000,00 que corresponde a un Aumento del 0,00% de recursos disponibles."]
["2.1.1.07.","Deudas por anticipos a corto plazo",null,{"$f":"IFERROR(VLOOKUP(A102,BC_ACTUAL!B:G,6,0)/1000,0)","v":0},{"$f":"IFERROR(VLOOKUP(A102,BC_ANTERIOR!B:G,6,0)/1000,0)","v":0},null,0,0,0,0,null,"La cuenta Deudas por anticipos a corto plazo, representa el 0,00% del total del Pasivo, que comparado al periodo anterior genera una variación absoluta de 0 000,00 que corresponde a un Aumento del 0,00% de recursos disponibles."]
["2.1.1.08.","Deudas por Planillas salariales",null,{"$f":"IFERROR(VLOOKUP(A103,BC_ACTUAL!B:G,6,0)/1000,0)","v":0},{"$f":"IFERROR(VLOOKUP(A103,BC_ANTERIOR!B:G,6,0)/1000,0)","v":0},null,0,0,0,0,null,"La cuenta Deudas por Planillas salariales, representa el 0,00% del total del Pasivo, que comparado al periodo anterior genera una variación absoluta de 0 000,00 que corresponde a un Aumento del 0,00% de recursos disponibles."]
["2.1.1.13.","Deudas por Créditos Fiscales a favor de terceros c/p",null,{"$f":"IFERROR(VLOOKUP(A104,BC_ACTUAL!B:G,6,0)/1000,0)","v":0},{"$f":"IFERROR(VLOOKUP(A104,BC_ANTERIOR!B:G,6,0)/1000,0)","v":0},null,0,0,0,0,null,"La cuenta Deudas por Créditos Fiscales a favor de terceros c/p, representa el 0,00% del total del Pasivo, que comparado al periodo anterior genera una variación absoluta de 0 000,00 que corresponde a un Aumento del 0,00% de recursos disponibles."]
["2.1.1.99.","Otras deudas a corto plazo",null,{"$f":"IFERROR(VLOOKUP(A105,BC_ACTUAL!B:G,6,0)/1000,0)","v":0},{"$f":"IFERROR(VLOOKUP(A105,BC_ANTERIOR!B:G,6,0)/1000,0)","v":0},null,0,0,0,0,null,"La cuenta Otras deudas a corto plazo, representa el 0,00% del total del Pasivo, que comparado al periodo anterior genera una variación absoluta de 0 000,00 que corresponde a un Aumento del 0,00% de recursos disponibles."]
["2.1.2.","Endeudamiento público a corto plazo","15",{"$f":"SUM(D107:D111)","v":0},{"$f":"SUM(E107:E111)","v":0},null,0,0,0,0,null,"La cuenta Endeudamiento público a corto plazo, representa el 0,00% del total del Pasivo, que comparado al periodo anterior genera una variación absoluta de 0 000,00 que corresponde a un Aumento del 0,00% de recursos disponibles."]
["2.1.2.01.","Títulos y valores de la deuda pública a pagar a corto plazo",null,{"$f":"IFERROR(VLOOKUP(A107,BC_ACTUAL!B:G,6,0)/1000,0)","v":0},{"$f":"IFERROR(VLOOKUP(A107,BC_ANTERIOR!B:G,6,0)/1000,0)","v":0},null,0,0,0,0,null,"La cuenta Títulos y valores de la deuda pública a pagar a corto plazo, representa el 0,00% del total del Pasivo, que comparado al periodo anterior genera una variación absoluta de 0 000,00 que corresponde a un Aumento del 0,00% de recursos disponibles."]
["2.1.2.02.","Préstamos a pagar a corto plazo",null,{"$f":"IFERROR(VLOOKUP(A108,BC_ACTUAL!B:G,6,0)/1000,0)","v":0},{"$f":"IFERROR(VLOOKUP(A108,BC_ANTERIOR!B:G,6,0)/1000,0)","v":0},null,0,0,0,0,null,"La cuenta Préstamos a pagar a corto plazo, representa el 0,00% del total del Pasivo, que comparado al periodo anterior genera una variación absoluta de 0 000,00 que corresponde a un Aumento del 0,00% de recursos disponibles."]
["2.1.2.03.","Deudas asumidas a corto plazo",null,{"$f":"IFERROR(VLOOKUP(A109,BC_ACTUAL!B:G,6,0)/1000,0)","v":0},{"$f":"IFERROR(VLOOKUP(A109,BC_ANTERIOR!B:G,6,0)/1000,0)","v":0},null,0,0,0,0,null,"La cuenta Deudas asumidas a corto plazo, representa el 0,00% del total del Pasivo, que comparado al periodo anterior genera una variación absoluta de 0 000,00 que corresponde a un Aumento del 0,00% de recursos disponibles."]
["2.1.2.04.","Endeudamiento de Tesorería a corto plazo",null,{"$f":"IFERROR(VLOOKUP(A110,BC_ACTUAL!B:G,6,0)/1000,0)","v":0},{"$f":"IFERROR(VLOOKUP(A110,BC_ANTERIOR!B:G,6,0)/1000,0)","v":0},null,0,0,0,0,null,"La cuenta Endeudamiento de Tesorería a corto plazo, representa el 0,00% del total del Pasivo, que comparado al periodo anterior genera una variación absoluta de 0 000,00 que corresponde a un Aumento del 0,00% de recursos disponibles."]
["2.1.2.05.","Endeudamiento público a valor razonable",null,{"$f":"IFERROR(VLOOKUP(A111,BC_ACTUAL!B:G,6,0)/1000,0)","v":0},{"$f":"IFERROR(VLOOKUP(A111,BC_ANTERIOR!B:G,6,0)/1000,0)","v":0},null,0,0,0,0,null,"La cuenta Endeudamiento público a valor razonable, representa el 0,00% del total del Pasivo, que comparado al periodo anterior genera una variación absoluta de 0 000,00 que corresponde a un Aumento del 0,00% de recursos disponibles."]
["2.1.3.","Fondos de terceros y en garantía","16",{"$f":"SUM(D113:D117)","v":0},{"$f":"SUM(E113:E117)","v":0},null,0,0,0,0,null,"La cuenta Fondos de terceros y en garantía, representa el 0,00% del total del Pasivo, que comparado al periodo anterior genera una variación absoluta de 0 000,00 que corresponde a un Aumento del 0,00% de recursos disponibles."]
["2.1.3.01.","Fondos de terceros en la Caja Única",null,{"$f":"IFERROR(VLOOKUP(A113,BC_ACTUAL!B:G,6,0)/1000,0)","v":0},{"$f":"IFERROR(VLOOKUP(A113,BC_ANTERIOR!B:G,6,0)/1000,0)","v":0},null,0,0,0,0,null,"La cuenta Fondos de terceros en la Caja Única, representa el 0,00% del total del Pasivo, que comparado al periodo anterior genera una variación absoluta de 0 000,00 que corresponde a un Aumento del 0,00% de recursos disponibles."]
["2.1.3.02.","Recaudación por cuenta de terceros",null,{"$f":"IFERROR(VLOOKUP(A114,BC_ACTUAL!B:G,6,0)/1000,0)","v":0},{"$f":"IFERROR(VLOOKUP(A114,BC_ANTERIOR!B:G,6,0)/1000,0)","v":0},null,0,0,0,0,null,"La cuenta Recaudación por cuenta de terceros, representa el 0,00% del total del Pasivo, que comparado al periodo anterior genera una variación absoluta de 0 000,00 que corresponde a un Aumento del 0,00% de recursos disponibles."]
["2.1.3.03.","Depósitos en garantía",null,{"$f":"IFERROR(VLOOKUP(A115,BC_ACTUAL!B:G,6,0)/1000,0)","v":0},{"$f":"IFERROR(VLOOKUP(A115,BC_ANTERIOR!B:G,6,0)/1000,0)","v":0},null,0,0,0,0,null,"La cuenta Depósitos en garantía, representa el 0,00% del total del Pasivo, que comparado al periodo anterior genera una variación absoluta de 0 000,00 que corresponde a un Aumento del 0,00% de recursos disponibles."]
["2.1.3.90.","Cuentas Asociadas ( Deudores )  CP",null,{"$f":"IFERROR(VLOOKUP(A116,BC_ACTUAL!B:G,6,0)/1000,0)","v":0},{"$f":"IFERROR(VLOOKUP(A116,BC_ANTERIOR!B:G,6,0)/1000,0)","v":0},null,0,0,0,0,null,"La cuenta Cuentas Asociadas ( Deudores )  CP, representa el 0,00% del total del Pasivo, que comparado al periodo anterior genera una variación absoluta de 0 000,00 que corresponde a un Aumento del 0,00% de recursos disponibles."]
["2.1.3.99.","Otros fondos de terceros",null,{"$f":"IFERROR(VLOOKUP(A117,BC_ACTUAL!B:G,6,0)/1000,0)","v":0},{"$f":"IFERROR(VLOOKUP(A117,BC_ANTERIOR!B:G,6,0)/1000,0)","v":0},null,0,0,0,0,null,"La cuenta Otros fondos de terceros, representa el 0,00% del total del Pasivo, que comparado al periodo anterior genera una variación absoluta de 0 000,00 que corresponde a un Aumento del 0,00% de recursos disponibles."]
["2.1.4.","Provisiones y reservas técnicas a corto plazo","17",{"$f":"SUM(D119:D120)","v":0},{"$f":"SUM(E119:E120)","v":0},null,0,0,0,0,null,"La cuenta Provisiones y reservas técnicas a corto plazo, representa el 0,00% del total del Pasivo, que comparado al periodo anterior genera una variación absoluta de 0 000,00 que corresponde a un Aumento del 0,00% de recursos disponibles."]
["2.1.4.01.","Provisiones a corto plazo",null,{"$f":"IFERROR(VLOOKUP(A119,BC_ACTUAL!B:G,6,0)/1000,0)","v":0},{"$f":"IFERROR(VLOOKUP(A119,BC_ANTERIOR!B:G,6,0)/1000,0)","v":0},null,0,0,0,0,null,"La cuenta Provisiones a corto plazo, representa el 0,00% del total del Pasivo, que comparado al periodo anterior genera una variación absoluta de 0 000,00 que corresponde a un Aumento del 0,00% de recursos disponibles."]
["2.1.4.02.","Reservas técnicas a corto plazo",null,{"$f":"IFERROR(VLOOKUP(A120,BC_ACTUAL!B:G,6,0)/1000,0)","v":0},{"$f":"IFERROR(VLOOKUP(A120,BC_ANTERIOR!B:G,6,0)/1000,0)","v":0},null,0,0,0,0,null,"La cuenta Reservas técnicas a corto plazo, representa el 0,00% del total del Pasivo, que comparado al periodo anterior genera una variación absoluta de 0 000,00 que corresponde a un Aumento del 0,00% de recursos disponibles."]
["2.1.9.","Otros pasivos a corto plazo","18",{"$f":"SUM(D122:D124)","v":0},{"$f":"SUM(E122:E124)","v":0},null,0,0,0,0,null,"La cuenta Otros pasivos a corto plazo, representa el 0,00% del total del Pasivo, que comparado al periodo anterior genera una variación absoluta de 0 000,00 que corresponde a un Aumento del 0,00% de recursos disponibles."]
["2.1.9.01.","Ingresos a devengar a corto plazo",null,{"$f":"IFERROR(VLOOKUP(A122,BC_ACTUAL!B:G,6,0)/1000,0)","v":0},{"$f":"IFERROR(VLOOKUP(A122,BC_ANTERIOR!B:G,6,0)/1000,0)","v":0},null,0,0,0,0,null,"La cuenta Ingresos a devengar a corto plazo, representa el 0,00% del total del Pasivo, que comparado al periodo anterior genera una variación absoluta de 0 000,00 que corresponde a un Aumento del 0,00% de recursos disponibles."]
["2.1.9.02.","Instrumentos Derivados a pagar a corto plazo",null,{"$f":"IFERROR(VLOOKUP(A123,BC_ACTUAL!B:G,6,0)/1000,0)","v":0},{"$f":"IFERROR(VLOOKUP(A123,BC_ANTERIOR!B:G,6,0)/1000,0)","v":0},null,0,0,0,0,null,"La cuenta Instrumentos Derivados a pagar a corto plazo, representa el 0,00% del total del Pasivo, que comparado al periodo anterior genera una variación absoluta de 0 000,00 que corresponde a un Aumento del 0,00% de recursos disponibles."]
["2.1.9.99.","Pasivos a corto plazo sujetos a depuración contable",null,{"$f":"IFERROR(VLOOKUP(A124,BC_ACTUAL!B:G,6,0)/1000,0)","v":0},{"$f":"IFERROR(VLOOKUP(A124,BC_ANTERIOR!B:G,6,0)/1000,0)","v":0},null,0,0,0,0,null,"La cuenta Pasivos a corto plazo sujetos a depuración contable, representa el 0,00% del total del Pasivo, que comparado al periodo anterior genera una variación absoluta de 0 000,00 que corresponde a un Aumento del 0,00% de recursos disponibles."]
[null,"Total del Pasivo Corriente",null,{"$f":"+D121+D118+D112+D106+D95","v":0},{"$f":"+E121+E118+E112+E106+E95","v":0},null,{"$f":"+G121+G118+G112+G106+G95","v":0},{"$f":"+H121+H118+H112+H106+H95","v":0},{"$f":"+I121+I118+I112+I106+I95","v":0},0]
[]
["2.2.","Pasivo No Corriente"]
["2.2.1.","Deudas a largo plazo","19",{"$f":"SUM(D129:D135)","v":0},{"$f":"SUM(E129:E135)","v":0},null,0,{"$f":"IFERROR(E128/$E$151,0)","v":0},0,0,null,"La cuenta Deudas a largo plazo, representa el 0,00% del total del Pasivo, que comparado al periodo anterior genera una variación absoluta de 0 000,00 que corresponde a un Aumento del 0,00% de recursos disponibles."]
["2.2.1.01.","Deudas comerciales a largo plazo",null,{"$f":"IFERROR(VLOOKUP(A129,BC_ACTUAL!B:G,6,0)/1000,0)","v":0},{"$f":"IFERROR(VLOOKUP(A129,BC_ANTERIOR!B:G,6,0)/1000,0)","v":0},null,0,0,0,0,null,"La cuenta Deudas comerciales a largo plazo, representa el 0,00% del total del Pasivo, que comparado al periodo anterior genera una variación absoluta de 0 000,00 que corresponde a un Aumento del 0,00% de recursos disponibles."]
["2.2.1.02.","Deudas sociales y fiscales a largo plazo",null,{"$f":"IFERROR(VLOOKUP(A130,BC_ACTUAL!B:G,6,0)/1000,0)","v":0},{"$f":"IFERROR(VLOOKUP(A130,BC_ANTERIOR!B:G,6,0)/1000,0)","v":0},null,0,0,0,0,null,"La cuenta Deudas sociales y fiscales a largo plazo, representa el 0,00% del total del Pasivo, que comparado al periodo anterior genera una variación absoluta de 0 000,00 que corresponde a un Aumento del 0,00% de recursos disponibles."]
["2.2.1.04.","Documentos a pagar a largo plazo",null,{"$f":"IFERROR(VLOOKUP(A131,BC_ACTUAL!B:G,6,0)/1000,0)","v":0},{"$f":"IFERROR(VLOOKUP(A131,BC_ANTERIOR!B:G,6,0)/1000,0)","v":0},null,0,0,0,0,null,"La cuenta Documentos a pagar a largo plazo, representa el 0,00% del total del Pasivo, que comparado al periodo anterior genera una variación absoluta de 0 000,00 que corresponde a un Aumento del 0,00% de recursos disponibles."]
["2.2.1.05.","Inversiones patrimoniales a pagar a largo plazo",null,{"$f":"IFERROR(VLOOKUP(A132,BC_ACTUAL!B:G,6,0)/1000,0)","v":0},{"$f":"IFERROR(VLOOKUP(A132,BC_ANTERIOR!B:G,6,0)/1000,0)","v":0},null,0,0,0,0,null,"La cuenta Inversiones patrimoniales a pagar a largo plazo, representa el 0,00% del total del Pasivo, que comparado al periodo anterior genera una variación absoluta de 0 000,00 que corresponde a un Aumento del 0,00% de recursos disponibles."]
["2.2.1.06.","Deudas por avales ejecutados a largo plazo",null,{"$f":"IFERROR(VLOOKUP(A133,BC_ACTUAL!B:G,6,0)/1000,0)","v":0},{"$f":"IFERROR(VLOOKUP(A133,BC_ANTERIOR!B:G,6,0)/1000,0)","v":0},null,0,0,0,0,null,"La cuenta Deudas por avales ejecutados a largo plazo, representa el 0,00% del total del Pasivo, que comparado al periodo anterior genera una variación absoluta de 0 000,00 que corresponde a un Aumento del 0,00% de recursos disponibles."]
["2.2.1.07.","Deudas por anticipos a largo plazo",null,{"$f":"IFERROR(VLOOKUP(A134,BC_ACTUAL!B:G,6,0)/1000,0)","v":0},{"$f":"IFERROR(VLOOKUP(A134,BC_ANTERIOR!B:G,6,0)/1000,0)","v":0},null,0,0,0,0,null,"La cuenta Deudas por anticipos a largo plazo, representa el 0,00% del total del Pasivo, que comparado al periodo anterior genera una variación absoluta de 0 000,00 que corresponde a un Aumento del 0,00% de recursos disponibles."]
["2.2.1.99.","Otras deudas a largo plazo",null,{"$f":"IFERROR(VLOOKUP(A135,BC_ACTUAL!B:G,6,0)/1000,0)","v":0},{"$f":"IFERROR(VLOOKUP(A135,BC_ANTERIOR!B:G,6,0)/1000,0)","v":0},null,0,0,0,0,null,"La cuenta Otras deudas a largo plazo, representa el 0,00% del total del Pasivo, que comparado al periodo anterior genera una variación absoluta de 0 000,00 que corresponde a un Aumento del 0,00% de recursos disponibles."]
["2.2.2.","Endeudamiento público a largo plazo","20",{"$f":"SUM(D137:D139)","v":0},{"$f":"SUM(E137:E139)","v":0},null,0,0,0,0,null,"La cuenta Endeudamiento público a largo plazo, representa el 0,00% del total del Pasivo, que comparado al periodo anterior genera una variación absoluta de 0 000,00 que corresponde a un Aumento del 0,00% de recursos disponibles."]
["2.2.2.01.","Títulos y valores de la deuda pública a pagar a largo plazo",null,{"$f":"IFERROR(VLOOKUP(A137,BC_ACTUAL!B:G,6,0)/1000,0)","v":0},{"$f":"IFERROR(VLOOKUP(A137,BC_ANTERIOR!B:G,6,0)/1000,0)","v":0},null,0,0,0,0,null,"La cuenta Títulos y valores de la deuda pública a pagar a largo plazo, representa el 0,00% del total del Pasivo, que comparado al periodo anterior genera una variación absoluta de 0 000,00 que corresponde a un Aumento del 0,00% de recursos disponibles."]
["2.2.2.02.","Préstamos a pagar a largo plazo",null,{"$f":"IFERROR(VLOOKUP(A138,BC_ACTUAL!B:G,6,0)/1000,0)","v":0},{"$f":"IFERROR(VLOOKUP(A138,BC_ANTERIOR!B:G,6,0)/1000,0)","v":0},null,0,0,0,0,null,"La cuenta Préstamos a pagar a largo plazo, representa el 0,00% del total del Pasivo, que comparado al periodo anterior genera una variación absoluta de 0 000,00 que corresponde a un Aumento del 0,00% de recursos disponibles."]
["2.2.2.03.","Deudas asumidas a largo plazo",null,{"$f":"IFERROR(VLOOKUP(A139,BC_ACTUAL!B:G,6,0)/1000,0)","v":0},{"$f":"IFERROR(VLOOKUP(A139,BC_ANTERIOR!B:G,6,0)/1000,0)","v":0},null,0,0,{"$f":"IFERROR(D139-E139,0)","v":0},{"$f":"IFERROR(I139/E139,0)","v":0},null,{"$f":"\"La\"&\" \"&\"cuenta\"&\" \"&B139&\",\"&\" \"&\"representa\"&\" \"&\"el\"&\" \"&TEXT(G139,\"0,00%\")&\" \"&\"del\"&\" \"&\"total\"&\" \"&\"del\"&\" \"&IF(MID(A139,1,2)=\"1.\",\"Activo\",IF(MID(A139,1,2)=\"2.\",\"Pasivo\",IF(MID(A139,1,2)=\"3.\",\"Capital\",IF(MID(A139,1,2)=\"4.\",\"Ingresos\",IF(MID(A139,1,2)=\"5.\",\"Gastos\",\"\")))))&\",\"&\" \"&\"que\"&\" \"&\"comparado\"&\" \"&\"al\"&\" \"&\"periodo\"&\" \"&\"anterior\"&\" \"&\"genera\"&\" \"&\"una\"&\" \"&\"variación\"&\" \"&\"absoluta\"&\" \"&\"de\"&\" \"&TEXT(I139,\"0 000,00\")&\" \"&\"que\"&\" \"&\"corresponde\"&\" \"&\"a\"&\" \"&\"un\"&\" \"&IF(I139<0,\"Disminución\",\"Aumento\")&\" \"&\"del\"&\" \"&TEXT(J139,\"0,00%\")&\" \"&\"de\"&\" \"&\"recursos\"&\" \"&\"disponibles\"&\".\"","v":"La cuenta Deudas asumidas a largo plazo, representa el 0,00% del total del Pasivo, que comparado al periodo anterior genera una variación absoluta de 0 000,00 que corresponde a un Aumento del 0,00% de recursos disponibles."}]
["2.2.3.","Fondos de terceros y en garantía","21",{"$f":"SUM(D141:D142)","v":0},{"$f":"SUM(E141:E142)","v":0},null,0,0,0,0,null,"La cuenta Fondos de terceros y en garantía, representa el 0,00% del total del Pasivo, que comparado al periodo anterior genera una variación absoluta de 0 000,00 que corresponde a un Aumento del 0,00% de recursos disponibles."]
["2.2.3.01.","Fondos de terceros en la Caja Única",null,{"$f":"IFERROR(VLOOKUP(A141,BC_ACTUAL!B:G,6,0)/1000,0)","v":0},{"$f":"IFERROR(VLOOKUP(A141,BC_ANTERIOR!B:G,6,0)/1000,0)","v":0},null,0,0,0,0,null,"La cuenta Fondos de terceros en la Caja Única, representa el 0,00% del total del Pasivo, que comparado al periodo anterior genera una variación absoluta de 0 000,00 que corresponde a un Aumento del 0,00% de recursos disponibles."]
["2.2.3.99.","Otros fondos de terceros",null,{"$f":"IFERROR(VLOOKUP(A142,BC_ACTUAL!B:G,6,0)/1000,0)","v":0},{"$f":"IFERROR(VLOOKUP(A142,BC_ANTERIOR!B:G,6,0)/1000,0)","v":0},null,0,0,0,0,null,"La cuenta Otros fondos de terceros, representa el 0,00% del total del Pasivo, que comparado al periodo anterior genera una variación absoluta de 0 000,00 que corresponde a un Aumento del 0,00% de recursos disponibles."]
["2.2.4.","Provisiones y reservas técnicas a largo plazo","22",{"$f":"SUM(D144:D145)","v":0},{"$f":"SUM(E144:E145)","v":0},null,0,0,0,0,null,"La cuenta Provisiones y reservas técnicas a largo plazo, representa el 0,00% del total del Pasivo, que comparado al periodo anterior genera una variación absoluta de 0 000,00 que corresponde a un Aumento del 0,00% de recursos disponibles."]
["2.2.4.01.","Provisiones a largo plazo",null,{"$f":"IFERROR(VLOOKUP(A144,BC_ACTUAL!B:G,6,0)/1000,0)","v":0},{"$f":"IFERROR(VLOOKUP(A144,BC_ANTERIOR!B:G,6,0)/1000,0)","v":0},null,0,0,0,0,null,"La cuenta Provisiones a largo plazo, representa el 0,00% del total del Pasivo, que comparado al periodo anterior genera una variación absoluta de 0 000,00 que corresponde a un Aumento del 0,00% de recursos disponibles."]
["2.2.4.02.","Reservas técnicas a largo plazo",null,{"$f":"IFERROR(VLOOKUP(A145,BC_ACTUAL!B:G,6,0)/1000,0)","v":0},{"$f":"IFERROR(VLOOKUP(A145,BC_ANTERIOR!B:G,6,0)/1000,0)","v":0},null,0,0,0,0,null,"La cuenta Reservas técnicas a largo plazo, representa el 0,00% del total del Pasivo, que comparado al periodo anterior genera una variación absoluta de 0 000,00 que corresponde a un Aumento del 0,00% de recursos disponibles."]
["2.2.9.","Otros pasivos a largo plazo","23",{"$f":"SUM(D147:D149)","v":0},{"$f":"SUM(E147:E149)","v":0},null,0,0,0,0,null,"La cuenta Otros pasivos a largo plazo, representa el 0,00% del total del Pasivo, que comparado al periodo anterior genera una variación absoluta de 0 000,00 que corresponde a un Aumento del 0,00% de recursos disponibles."]
["2.2.9.01.","Ingresos a devengar a largo plazo",null,{"$f":"IFERROR(VLOOKUP(A147,BC_ACTUAL!B:G,6,0)/1000,0)","v":0},{"$f":"IFERROR(VLOOKUP(A147,BC_ANTERIOR!B:G,6,0)/1000,0)","v":0},null,0,0,0,0,null,"La cuenta Ingresos a devengar a largo plazo, representa el 0,00% del total del Pasivo, que comparado al periodo anterior genera una variación absoluta de 0 000,00 que corresponde a un Aumento del 0,00% de recursos disponibles."]
["2.2.9.02.","Instrumentos Derivados a pagar a largo plazo",null,{"$f":"IFERROR(VLOOKUP(A148,BC_ACTUAL!B:G,6,0)/1000,0)","v":0},{"$f":"IFERROR(VLOOKUP(A148,BC_ANTERIOR!B:G,6,0)/1000,0)","v":0},null,0,0,0,0,null,"La cuenta Instrumentos Derivados a pagar a largo plazo, representa el 0,00% del total del Pasivo, que comparado al periodo anterior genera una variación absoluta de 0 000,00 que corresponde a un Aumento del 0,00% de recursos disponibles."]
["2.2.9.99.","Pasivos a largo plazo sujetos a depuración contable",null,{"$f":"IFERROR(VLOOKUP(A149,BC_ACTUAL!B:G,6,0)/1000,0)","v":0},{"$f":"IFERROR(VLOOKUP(A149,BC_ANTERIOR!B:G,6,0)/1000,0)","v":0},null,0,0,0,0,null,"La cuenta Pasivos a largo plazo sujetos a depuración contable, representa el 0,00% del total del Pasivo, que comparado al periodo anterior genera una variación absoluta de 0 000,00 que corresponde a un Aumento del 0,00% de recursos disponibles."]
[null,"Total del Pasivo no Corriente",null,{"$f":"+D146+D143+D140+D136+D128","v":0},{"$f":"+E146+E143+E140+E136+E128","v":0},null,{"$f":"+G146+G143+G140+G136+G128","v":0},{"$f":"+H146+H143+H140+H136+H128","v":0},{"$f":"+I146+I143+I140+I136+I128","v":0},0]
[null,"TOTAL DEL PASIVO",null,{"$f":"+D150+D125","v":0},{"$f":"+E150+E125","v":0},null,{"$f":"+G150+G125","v":0},{"$f":"+H150+H125","v":0},{"$f":"+I150+I125","v":0},0]
[]
["3.","PATRIMONIO"]
["3.1.","Patrimonio público"]
["3.1.1.","Capital","24",{"$f":"SUM(D156:D157)","v":0},{"$f":"SUM(E156:E157)","v":0},null,{"$f":"IFERROR(D155/$D$181,0)","v":0},{"$f":"IFERROR(E155/$E$181,0)","v":0},0,0,null,"La cuenta Capital, representa el 0,00% del total del Capital, que comparado al periodo anterior genera una variación absoluta de 0 000,00 que corresponde a un Aumento del 0,00% de recursos disponibles."]
["3.1.1.01.","Capital inicial",null,{"$f":"IFERROR(VLOOKUP(A156,BC_ACTUAL!B:G,6,0)/1000,0)","v":0},{"$f":"IFERROR(VLOOKUP(A156,BC_ANTERIOR!B:G,6,0)/1000,0)","v":0},null,{"$f":"IFERROR(D156/$D$181,0)","v":0},{"$f":"IFERROR(E156/$E$181,0)","v":0},0,0,null,"La cuenta Capital inicial, representa el 0,00% del total del Capital, que comparado al periodo anterior genera una variación absoluta de 0 000,00 que corresponde a un Aumento del 0,00% de recursos disponibles."]
["3.1.1.02.","Incorporaciones al capital",null,{"$f":"IFERROR(VLOOKUP(A157,BC_ACTUAL!B:G,6,0)/1000,0)","v":0},{"$f":"IFERROR(VLOOKUP(A157,BC_ANTERIOR!B:G,6,0)/1000,0)","v":0},null,0,0,0,0,null,"La cuenta Incorporaciones al capital, representa el 0,00% del total del Capital, que comparado al periodo anterior genera una variación absoluta de 0 000,00 que corresponde a un Aumento del 0,00% de recursos disponibles."]
["3.1.2.","Transferencias de capital","25",{"$f":"SUM(D159:D160)","v":0},{"$f":"SUM(E159:E160)","v":0},null,0,0,0,0,null,"La cuenta Transferencias de capital, representa el 0,00% del total del Capital, que comparado al periodo anterior genera una variación absoluta de 0 000,00 que corresponde a un Aumento del 0,00% de recursos disponibles."]
["3.1.2.01.","Donaciones de capital",null,{"$f":"IFERROR(VLOOKUP(A159,BC_ACTUAL!B:G,6,0)/1000,0)","v":0},{"$f":"IFERROR(VLOOKUP(A159,BC_ANTERIOR!B:G,6,0)/1000,0)","v":0},null,0,0,0,0,null,"La cuenta Donaciones de capital, representa el 0,00% del total del Capital, que comparado al periodo anterior genera una variación absoluta de 0 000,00 que corresponde a un Aumento del 0,00% de recursos disponibles."]
["3.1.2.99.","Otras transferencias de capital",null,{"$f":"IFERROR(VLOOKUP(A160,BC_ACTUAL!B:G,6,0)/1000,0)","v":0},{"$f":"IFERROR(VLOOKUP(A160,BC_ANTERIOR!B:G,6,0)/1000,0)","v":0},null,0,0,0,0,null,"La cuenta Otras transferencias de capital, representa el 0,00% del total del Capital, que comparado al periodo anterior genera una variación absoluta de 0 000,00 que corresponde a un Aumento del 0,00% de recursos disponibles."]
["3.1.3.","Reservas","26",{"$f":"SUM(D162:D163)","v":0},{"$f":"SUM(E162:E163)","v":0},null,0,0,0,0,null,"La cuenta Reservas, representa el 0,00% del total del Capital, que comparado al periodo anterior genera una variación absoluta de 0 000,00 que corresponde a un Aumento del 0,00% de recursos disponibles."]
["3.1.3.01.","Revaluación de bienes",null,{"$f":"IFERROR(VLOOKUP(A162,BC_ACTUAL!B:G,6,0)/1000,0)","v":0},{"$f":"IFERROR(VLOOKUP(A162,BC_ANTERIOR!B:G,6,0)/1000,0)","v":0},null,0,0,0,0,null,"La cuenta Revaluación de bienes, representa el 0,00% del total del Capital, que comparado al periodo anterior genera una variación absoluta de 0 000,00 que corresponde a un Aumento del 0,00% de recursos disponibles."]
["3.1.3.99.","Otras reservas",null,{"$f":"IFERROR(VLOOKUP(A163,BC_ACTUAL!B:G,6,0)/1000,0)","v":0},{"$f":"IFERROR(VLOOKUP(A163,BC_ANTERIOR!B:G,6,0)/1000,0)","v":0},null,0,0,0,0,null,"La cuenta Otras reservas, representa el 0,00% del total del Capital, que comparado al periodo anterior genera una variación absoluta de 0 000,00 que corresponde a un Aumento del 0,00% de recursos disponibles."]
["3.1.4.","Variaciones no asignables a reservas","27",{"$f":"SUM(D165:D168)","v":0},{"$f":"SUM(E165:E168)","v":0},null,0,0,0,0,null,"La cuenta Variaciones no asignables a reservas, representa el 0,00% del total del Capital, que comparado al periodo anterior genera una variación absoluta de 0 000,00 que corresponde a un Aumento del 0,00% de recursos disponibles."]
["3.1.4.01.","Diferencias de conversión de moneda extranjera",null,{"$f":"IFERROR(VLOOKUP(A165,BC_ACTUAL!B:G,6,0)/1000,0)","v":0},{"$f":"IFERROR(VLOOKUP(A165,BC_ANTERIOR!B:G,6,0)/1000,0)","v":0},null,0,0,0,0,null,"La cuenta Diferencias de conversión de moneda extranjera, representa el 0,00% del total del Capital, que comparado al periodo anterior genera una variación absoluta de 0 000,00 que corresponde a un Aumento del 0,00% de recursos disponibles."]
["3.1.4.02.","Diferencias de valor razonable de activos financieros destinados a la venta",null,{"$f":"IFERROR(VLOOKUP(A166,BC_ACTUAL!B:G,6,0)/1000,0)","v":0},{"$f":"IFERROR(VLOOKUP(A166,BC_ANTERIOR!B:G,6,0)/1000,0)","v":0},null,0,0,0,0,null,"La cuenta Diferencias de valor razonable de activos financieros destinados a la venta, representa el 0,00% del total del Capital, que comparado al periodo anterior genera una variación absoluta de 0 000,00 que corresponde a un Aumento del 0,00% de recursos disponibles."]
["3.1.4.03.","Diferencias de valor razonable de instrumentos financieros designados como cobertura",null,{"$f":"IFERROR(VLOOKUP(A167,BC_ACTUAL!B:G,6,0)/1000,0)","v":0},{"$f":"IFERROR(VLOOKUP(A167,BC_ANTERIOR!B:G,6,0)/1000,0)","v":0},null,0,0,0,0,null,"La cuenta Diferencias de valor razonable de instrumentos financieros designados como cobertura, representa el 0,00% del total del Capital, que comparado al periodo anterior genera una variación absoluta de 0 000,00 que corresponde a un Aumento del 0,00% de recursos disponibles."]
["3.1.4.99.","Otras variaciones no asignables a reservas",null,{"$f":"IFERROR(VLOOKUP(A168,BC_ACTUAL!B:G,6,0)/1000,0)","v":0},{"$f":"IFERROR(VLOOKUP(A168,BC_ANTERIOR!B:G,6,0)/1000,0)","v":0},null,0,0,0,0,null,"La cuenta Otras variaciones no asignables a reservas, representa el 0,00% del total del Capital, que comparado al periodo anterior genera una variación absoluta de 0 000,00 que corresponde a un Aumento del 0,00% de recursos disponibles."]
["3.1.5.","Resultados acumulados","28",{"$f":"SUM(D170:D171)","v":0},{"$f":"SUM(E170:E171)","v":0},null,0,0,0,0,null,"La cuenta Resultados acumulados, representa el 0,00% del total del Capital, que comparado al periodo anterior genera una variación absoluta de 0 000,00 que corresponde a un Aumento del 0,00% de recursos disponibles."]
["3.1.5.01.","Resultados acumulados de ejercicios anteriores",null,{"$f":"IFERROR(VLOOKUP(A170,BC_ACTUAL!B:G,6,0)/1000,0)","v":0},{"$f":"IFERROR(VLOOKUP(A170,BC_ANTERIOR!B:G,6,0)/1000,0)","v":0},null,0,0,0,0,null,"La cuenta Resultados acumulados de ejercicios anteriores, representa el 0,00% del total del Capital, que comparado al periodo anterior genera una variación absoluta de 0 000,00 que corresponde a un Aumento del 0,00% de recursos disponibles."]
["3.1.5.02.","Resultado del ejercicio",null,{"$f":"IFERROR((VLOOKUP(\"4.\",BC_ACTUAL!B:G,6,FALSE))-(VLOOKUP(\"5.\",BC_ACTUAL!B:G,6,0)),0)/1000","v":0},{"$f":"IFERROR((VLOOKUP(\"4.\",BC_ANTERIOR!B:G,6,FALSE))-(VLOOKUP(\"5.\",BC_ANTERIOR!B:G,6,0)),0)/1000","v":0},null,0,0,0,0,null,"La cuenta Resultado del ejercicio, representa el 0,00% del total del Capital, que comparado al periodo anterior genera una variación absoluta de 0 000,00 que corresponde a un Aumento del 0,00% de recursos disponibles."]
["3.2.","Intereses minoritarios"]
["3.2.1.","Intereses minoritarios - Participaciones en el patrimonio de entidades controladas","29",{"$f":"SUM(D174:D175)","v":0},{"$f":"SUM(E174:E175)","v":0},null,{"$f":"IFERROR(D173/$D$181,0)","v":0},{"$f":"IFERROR(E173/$E$181,0)","v":0},0,0,null,"La cuenta Intereses minoritarios - Participaciones en el patrimonio de entidades controladas, representa el 0,00% del total del Capital, que comparado al periodo anterior genera una variación absoluta de 0 000,00 que corresponde a un Aumento del 0,00% de recursos disponibles."]
["3.2.1.01.","Intereses minoritarios - Participaciones en el patrimonio de entidades del sector gobierno general",null,{"$f":"IFERROR(VLOOKUP(A174,BC_ACTUAL!B:G,6,0)/1000,0)","v":0},{"$f":"IFERROR(VLOOKUP(A174,BC_ANTERIOR!B:G,6,0)/1000,0)","v":0},null,0,0,0,0,null,"La cuenta Intereses minoritarios - Participaciones en el patrimonio de entidades del sector gobierno general, representa el 0,00% del total del Capital, que comparado al periodo anterior genera una variación absoluta de 0 000,00 que corresponde a un Aumento del 0,00% de recursos disponibles."]
["3.2.1.02.","Intereses minoritarios - Participaciones en el patrimonio de empresas públicas e instituciones públicas financieras",null,{"$f":"IFERROR(VLOOKUP(A175,BC_ACTUAL!B:G,6,0)/1000,0)","v":0},{"$f":"IFERROR(VLOOKUP(A175,BC_ANTERIOR!B:G,6,0)/1000,0)","v":0},null,0,0,0,0,null,"La cuenta Intereses minoritarios - Participaciones en el patrimonio de empresas públicas e instituciones públicas financieras, representa el 0,00% del total del Capital, que comparado al periodo anterior genera una variación absoluta de 0 000,00 que corresponde a un Aumento del 0,00% de recursos disponibles."]
["3.2.2.","Intereses minoritarios - Evolución","30",{"$f":"SUM(D177:D180)","v":0},{"$f":"SUM(E177:E180)","v":0},null,0,0,0,0,null,"La cuenta Intereses minoritarios - Evolución, representa el 0,00% del total del Capital, que comparado al periodo anterior genera una variación absoluta de 0 000,00 que corresponde a un Aumento del 0,00% de recursos disponibles."]
["3.2.2.01.","Intereses minoritarios - Evolución por reservas",null,{"$f":"IFERROR(VLOOKUP(A177,BC_ACTUAL!B:G,6,0)/1000,0)","v":0},{"$f":"IFERROR(VLOOKUP(A177,BC_ANTERIOR!B:G,6,0)/1000,0)","v":0},null,0,0,0,0,null,"La cuenta Intereses minoritarios - Evolución por reservas, representa el 0,00% del total del Capital, que comparado al periodo anterior genera una variación absoluta de 0 000,00 que corresponde a un Aumento del 0,00% de recursos disponibles."]
["3.2.2.02.","Intereses minoritarios - Evolución por variaciones no asignables a reservas",null,{"$f":"IFERROR(VLOOKUP(A178,BC_ACTUAL!B:G,6,0)/1000,0)","v":0},{"$f":"IFERROR(VLOOKUP(A178,BC_ANTERIOR!B:G,6,0)/1000,0)","v":0},null,0,0,0,0,null,"La cuenta Intereses minoritarios - Evolución por variaciones no asignables a reservas, representa el 0,00% del total del Capital, que comparado al periodo anterior genera una variación absoluta de 0 000,00 que corresponde a un Aumento del 0,00% de recursos disponibles."]
["3.2.2.03.","Intereses minoritarios - Evolución por resultados acumulados",null,{"$f":"IFERROR(VLOOKUP(A179,BC_ACTUAL!B:G,6,0)/1000,0)","v":0},{"$f":"IFERROR(VLOOKUP(A179,BC_ANTERIOR!B:G,6,0)/1000,0)","v":0},null,0,0,0,0,null,"La cuenta Intereses minoritarios - Evolución por resultados acumulados, representa el 0,00% del total del Capital, que comparado al periodo anterior genera una variación absoluta de 0 000,00 que corresponde a un Aumento del 0,00% de recursos disponibles."]
["3.2.2.99.","Intereses minoritarios - Evolución por otros componentes del patrimonio",null,{"$f":"IFERROR(VLOOKUP(A180,BC_ACTUAL!B:G,6,0)/1000,0)","v":0},{"$f":"IFERROR(VLOOKUP(A180,BC_ANTERIOR!B:G,6,0)/1000,0)","v":0},null,0,0,0,0,null,"La cuenta Intereses minoritarios - Evolución por otros componentes del patrimonio, representa el 0,00% del total del Capital, que comparado al periodo anterior genera una variación absoluta de 0 000,00 que corresponde a un Aumento del 0,00% de recursos disponibles."]
[null,"TOTAL DEL PATRIMONIO",null,{"$f":"+D176+D173+D169+D164+D161+D158+D155","v":0},{"$f":"+E176+E173+E169+E164+E161+E158+E155","v":0},null,{"$f":"+G176+G173+G169+G164+G161+G158+G155","v":0},{"$f":"+H176+H173+H169+H164+H161+H158+H155","v":0},{"$f":"+I176+I173+I169+I164+I161+I158+I155","v":0},0]
[null,"TOTAL DEL PASIVO Y PATRIMONIO",null,{"$f":"+D181+D151","v":0},{"$f":"+E181+E151","v":0},null,{"$f":"+G181+G151","v":0},{"$f":"+H181+H151","v":0},{"$f":"+I181+I151","v":0},0]
[null,null,null,{"$f":"+D182-D91","v":0},{"$f":"+E182-E91","v":0},null,{"$f":"+G182-G91","v":0},{"$f":"+H182-H91","v":0},{"$f":"IFERROR(D183-E183,0)","v":0},0]

{"sheet":"EEFF_RENDIMIENTOS","index":4,"n_rows":233,"n_cols":12,"rows_kept":233,"cut":false,"hidden":false,"merged":[[0,0,0,4],[1,0,1,4],[2,0,2,4],[3,0,3,4],[0,6,0,9],[1,6,1,9],[2,6,2,9],[3,6,3,9]]}
[{"$f":"DATOS!D13","v":""}]
["Estado de Rendimiento Financiera",null,null,null,null,null,"Estado de Rendimiento Financiera"]
[{"$f":"DATOS!D15&\" \"&RIGHT(D6,4)","v":" "},null,null,null,null,null,"Análisis de Variaciones"]
["- En miles de colones -",null,null,null,null,null,{"$f":"DATOS!D15&\" \"&RIGHT(D6,4)","v":" "}]
[]
["Cuenta","Descripción","Nota",{"$f":"PROPER(DATOS!D17)","v":""},{"$f":"PROPER(DATOS!D18)","v":""},null,"Análisis Vertical (%)","%","Monto Variación\nAbsoluta"," Variación relativa (%)"]
[]
["4.","INGRESOS"]
["4.1.","Impuestos"]
["4.1.1.","Impuestos sobre los ingresos, las utilidades y las ganancias de capital",31,{"$f":"SUM(D11:D14)","v":0},{"$f":"SUM(E11:E14)","v":0},null,{"$f":"IFERROR(D10/$D$133,0)","v":0},{"$f":"IFERROR(E10/$E$133,0)","v":0},{"$f":"IFERROR(D10-E10,0)","v":0},{"$f":"IFERROR(I10/E10,0)","v":0},null,{"$f":"\"La\"&\" \"&\"cuenta\"&\" \"&B10&\",\"&\" \"&\"representa\"&\" \"&\"el\"&\" \"&TEXT(G10,\"0,00%\")&\" \"&\"del\"&\" \"&\"total\"&\" \"&\"del\"&\" \"&IF(MID(A10,1,2)=\"1.\",\"Activo\",IF(MID(A10,1,2)=\"2.\",\"Pasivo\",IF(MID(A10,1,2)=\"3.\",\"Capital\",IF(MID(A10,1,2)=\"4.\",\"Ingresos\",IF(MID(A10,1,2)=\"5.\",\"Gastos\",\"\")))))&\",\"&\" \"&\"que\"&\" \"&\"comparado\"&\" \"&\"al\"&\" \"&\"periodo\"&\" \"&\"anterior\"&\" \"&\"genera\"&\" \"&\"una\"&\" \"&\"variación\"&\" \"&\"absoluta\"&\" \"&\"de\"&\" \"&TEXT(I10,\"0 000,00\")&\" \"&\"que\"&\" \"&\"corresponde\"&\" \"&\"a\"&\" \"&\"un\"&\" \"&IF(I10<0,\"Disminución\",\"Aumento\")&\" \"&\"del\"&\" \"&TEXT(J10,\"0,00%\")&\" \"&\"de\"&\" \"&\"recursos\"&\" \"&\"disponibles\"&\".\"","v":"La cuenta Impuestos sobre los ingresos, las utilidades y las ganancias de capital, representa el 0,00% del total del Ingresos, que comparado al periodo anterior genera una variación absoluta de 0 000,00 que corresponde a un Aumento del 0,00% de recursos disponibles."}]
["4.1.1.01.","Impuestos sobre los ingresos y utilidades de personas físicas",null,{"$f":"IFERROR(VLOOKUP(A11,BC_ACTUAL!B:G,6,0)/1000,0)","v":0},{"$f":"IFERROR(VLOOKUP(A11,BC_ANTERIOR!B:G,6,0)/1000,0)","v":0},null,{"$f":"IFERROR(D11/$D$133,0)","v":0},{"$f":"IFERROR(E11/$E$133,0)","v":0},{"$f":"IFERROR(D11-E11,0)","v":0},{"$f":"IFERROR(I11/E11,0)","v":0},null,{"$f":"\"La\"&\" \"&\"cuenta\"&\" \"&B11&\",\"&\" \"&\"representa\"&\" \"&\"el\"&\" \"&TEXT(G11,\"0,00%\")&\" \"&\"del\"&\" \"&\"total\"&\" \"&\"del\"&\" \"&IF(MID(A11,1,2)=\"1.\",\"Activo\",IF(MID(A11,1,2)=\"2.\",\"Pasivo\",IF(MID(A11,1,2)=\"3.\",\"Capital\",IF(MID(A11,1,2)=\"4.\",\"Ingresos\",IF(MID(A11,1,2)=\"5.\",\"Gastos\",\"\")))))&\",\"&\" \"&\"que\"&\" \"&\"comparado\"&\" \"&\"al\"&\" \"&\"periodo\"&\" \"&\"anterior\"&\" \"&\"genera\"&\" \"&\"una\"&\" \"&\"variación\"&\" \"&\"absoluta\"&\" \"&\"de\"&\" \"&TEXT(I11,\"0 000,00\")&\" \"&\"que\"&\" \"&\"corresponde\"&\" \"&\"a\"&\" \"&\"un\"&\" \"&IF(I11<0,\"Disminución\",\"Aumento\")&\" \"&\"del\"&\" \"&TEXT(J11,\"0,00%\")&\" \"&\"de\"&\" \"&\"recursos\"&\" \"&\"disponibles\"&\".\"","v":"La cuenta Impuestos sobre los ingresos y utilidades de personas físicas, representa el 0,00% del total del Ingresos, que comparado al periodo anterior genera una variación absoluta de 0 000,00 que corresponde a un Aumento del 0,00% de recursos disponibles."}]
["4.1.1.02.","Impuestos sobre los ingresos y utilidades de personas jurídicas",null,{"$f":"IFERROR(VLOOKUP(A12,BC_ACTUAL!B:G,6,0)/1000,0)","v":0},{"$f":"IFERROR(VLOOKUP(A12,BC_ANTERIOR!B:G,6,0)/1000,0)","v":0},null,0,0,0,0,null,"La cuenta Impuestos sobre los ingresos y utilidades de personas jurídicas, representa el 0,00% del total del Ingresos, que comparado al periodo anterior genera una variación absoluta de 0 000,00 que corresponde a un Aumento del 0,00% de recursos disponibles."]
["4.1.1.03.","Impuestos sobre Rentas de Capital",null,{"$f":"IFERROR(VLOOKUP(A13,BC_ACTUAL!B:G,6,0)/1000,0)","v":0},{"$f":"IFERROR(VLOOKUP(A13,BC_ANTERIOR!B:G,6,0)/1000,0)","v":0},null,0,0,0,0,null,"La cuenta Impuestos sobre Rentas de Capital, representa el 0,00% del total del Ingresos, que comparado al periodo anterior genera una variación absoluta de 0 000,00 que corresponde a un Aumento del 0,00% de recursos disponibles."]
["4.1.1.99.","Otros impuestos sobre los ingresos, las utilidades y las ganancias de capital",null,{"$f":"IFERROR(VLOOKUP(A14,BC_ACTUAL!B:G,6,0)/1000,0)","v":0},{"$f":"IFERROR(VLOOKUP(A14,BC_ANTERIOR!B:G,6,0)/1000,0)","v":0},null,0,0,0,0,null,"La cuenta Otros impuestos sobre los ingresos, las utilidades y las ganancias de capital, representa el 0,00% del total del Ingresos, que comparado al periodo anterior genera una variación absoluta de 0 000,00 que corresponde a un Aumento del 0,00% de recursos disponibles."]
["4.1.2.","Impuestos sobre la propiedad","32",{"$f":"SUM(D16:D21)","v":0},{"$f":"SUM(E16:E21)","v":0},null,0,0,0,{"$f":"IFERROR(I15/E15,0)","v":0},null,"La cuenta Impuestos sobre la propiedad, representa el 0,00% del total del Ingresos, que comparado al periodo anterior genera una variación absoluta de 0 000,00 que corresponde a un Aumento del 0,00% de recursos disponibles."]
["4.1.2.01.","Impuesto sobre la propiedad de bienes inmuebles",null,{"$f":"IFERROR(VLOOKUP(A16,BC_ACTUAL!B:G,6,0)/1000,0)","v":0},{"$f":"IFERROR(VLOOKUP(A16,BC_ANTERIOR!B:G,6,0)/1000,0)","v":0},null,0,{"$f":"IFERROR(E16/$E$133,0)","v":0},0,0,null,"La cuenta Impuesto sobre la propiedad de bienes inmuebles, representa el 0,00% del total del Ingresos, que comparado al periodo anterior genera una variación absoluta de 0 000,00 que corresponde a un Aumento del 0,00% de recursos disponibles."]
["4.1.2.02.","Impuesto sobre la propiedad de vehículos, aeronaves y embarcaciones",null,{"$f":"IFERROR(VLOOKUP(A17,BC_ACTUAL!B:G,6,0)/1000,0)","v":0},{"$f":"IFERROR(VLOOKUP(A17,BC_ANTERIOR!B:G,6,0)/1000,0)","v":0},null,0,0,0,0,null,"La cuenta Impuesto sobre la propiedad de vehículos, aeronaves y embarcaciones, representa el 0,00% del total del Ingresos, que comparado al periodo anterior genera una variación absoluta de 0 000,00 que corresponde a un Aumento del 0,00% de recursos disponibles."]
["4.1.2.03.","Impuesto sobre el patrimonio",null,{"$f":"IFERROR(VLOOKUP(A18,BC_ACTUAL!B:G,6,0)/1000,0)","v":0},{"$f":"IFERROR(VLOOKUP(A18,BC_ANTERIOR!B:G,6,0)/1000,0)","v":0},null,0,0,0,0,null,"La cuenta Impuesto sobre el patrimonio, representa el 0,00% del total del Ingresos, que comparado al periodo anterior genera una variación absoluta de 0 000,00 que corresponde a un Aumento del 0,00% de recursos disponibles."]
["4.1.2.04.","Impuesto sobre los traspasos de bienes inmuebles",null,{"$f":"IFERROR(VLOOKUP(A19,BC_ACTUAL!B:G,6,0)/1000,0)","v":0},{"$f":"IFERROR(VLOOKUP(A19,BC_ANTERIOR!B:G,6,0)/1000,0)","v":0},null,0,0,0,0,null,"La cuenta Impuesto sobre los traspasos de bienes inmuebles, representa el 0,00% del total del Ingresos, que comparado al periodo anterior genera una variación absoluta de 0 000,00 que corresponde a un Aumento del 0,00% de recursos disponibles."]
["4.1.2.05.","Impuesto a los traspasos de vehículos, aeronaves y embarcaciones",null,{"$f":"IFERROR(VLOOKUP(A20,BC_ACTUAL!B:G,6,0)/1000,0)","v":0},{"$f":"IFERROR(VLOOKUP(A20,BC_ANTERIOR!B:G,6,0)/1000,0)","v":0},null,0,0,0,0,null,"La cuenta Impuesto a los traspasos de vehículos, aeronaves y embarcaciones, representa el 0,00% del total del Ingresos, que comparado al periodo anterior genera una variación absoluta de 0 000,00 que corresponde a un Aumento del 0,00% de recursos disponibles."]
["4.1.2.99.","Otros impuestos a la propiedad",null,{"$f":"IFERROR(VLOOKUP(A21,BC_ACTUAL!B:G,6,0)/1000,0)","v":0},{"$f":"IFERROR(VLOOKUP(A21,BC_ANTERIOR!B:G,6,0)/1000,0)","v":0},null,0,0,0,0,null,"La cuenta Otros impuestos a la propiedad, representa el 0,00% del total del Ingresos, que comparado al periodo anterior genera una variación absoluta de 0 000,00 que corresponde a un Aumento del 0,00% de recursos disponibles."]
["4.1.3.","Impuestos sobre bienes y servicios","33",{"$f":"SUM(D23:D25)","v":0},{"$f":"SUM(E23:E25)","v":0},null,0,0,0,0,null,"La cuenta Impuestos sobre bienes y servicios, representa el 0,00% del total del Ingresos, que comparado al periodo anterior genera una variación absoluta de 0 000,00 que corresponde a un Aumento del 0,00% de recursos disponibles."]
["4.1.3.01.","Impuestos generales y selectivos sobre ventas y consumo",null,{"$f":"IFERROR(VLOOKUP(A23,BC_ACTUAL!B:G,6,0)/1000,0)","v":0},{"$f":"IFERROR(VLOOKUP(A23,BC_ANTERIOR!B:G,6,0)/1000,0)","v":0},null,0,0,0,{"$f":"IFERROR(I23/E23,0)","v":0},null,"La cuenta Impuestos generales y selectivos sobre ventas y consumo, representa el 0,00% del total del Ingresos, que comparado al periodo anterior genera una variación absoluta de 0 000,00 que corresponde a un Aumento del 0,00% de recursos disponibles."]
["4.1.3.02.","Impuestos específicos sobre la producción y consumo de bienes y servicios",null,{"$f":"IFERROR(VLOOKUP(A24,BC_ACTUAL!B:G,6,0)/1000,0)","v":0},{"$f":"IFERROR(VLOOKUP(A24,BC_ANTERIOR!B:G,6,0)/1000,0)","v":0},null,0,0,0,0,null,"La cuenta Impuestos específicos sobre la producción y consumo de bienes y servicios, representa el 0,00% del total del Ingresos, que comparado al periodo anterior genera una variación absoluta de 0 000,00 que corresponde a un Aumento del 0,00% de recursos disponibles."]
["4.1.3.99.","Otros impuestos sobre bienes y servicios",null,{"$f":"IFERROR(VLOOKUP(A25,BC_ACTUAL!B:G,6,0)/1000,0)","v":0},{"$f":"IFERROR(VLOOKUP(A25,BC_ANTERIOR!B:G,6,0)/1000,0)","v":0},null,0,0,0,0,null,"La cuenta Otros impuestos sobre bienes y servicios, representa el 0,00% del total del Ingresos, que comparado al periodo anterior genera una variación absoluta de 0 000,00 que corresponde a un Aumento del 0,00% de recursos disponibles."]
["4.1.4.","Impuestos sobre el comercio exterior y transacciones internacionales","34",{"$f":"SUM(D27:D29)","v":0},{"$f":"SUM(E27:E29)","v":0},null,0,0,0,0,null,"La cuenta Impuestos sobre el comercio exterior y transacciones internacionales, representa el 0,00% del total del Ingresos, que comparado al periodo anterior genera una variación absoluta de 0 000,00 que corresponde a un Aumento del 0,00% de recursos disponibles."]
["4.1.4.01.","Impuestos a las importaciones",null,{"$f":"IFERROR(VLOOKUP(A27,BC_ACTUAL!B:G,6,0)/1000,0)","v":0},{"$f":"IFERROR(VLOOKUP(A27,BC_ANTERIOR!B:G,6,0)/1000,0)","v":0},null,0,0,0,0,null,"La cuenta Impuestos a las importaciones, representa el 0,00% del total del Ingresos, que comparado al periodo anterior genera una variación absoluta de 0 000,00 que corresponde a un Aumento del 0,00% de recursos disponibles."]
["4.1.4.02.","Impuestos a las exportaciones",null,{"$f":"IFERROR(VLOOKUP(A28,BC_ACTUAL!B:G,6,0)/1000,0)","v":0},{"$f":"IFERROR(VLOOKUP(A28,BC_ANTERIOR!B:G,6,0)/1000,0)","v":0},null,0,0,0,0,null,"La cuenta Impuestos a las exportaciones, representa el 0,00% del total del Ingresos, que comparado al periodo anterior genera una variación absoluta de 0 000,00 que corresponde a un Aumento del 0,00% de recursos disponibles."]
["4.1.4.99.","Otros impuestos sobre el comercio exterior y transacciones internacionales",null,{"$f":"IFERROR(VLOOKUP(A29,BC_ACTUAL!B:G,6,0)/1000,0)","v":0},{"$f":"IFERROR(VLOOKUP(A29,BC_ANTERIOR!B:G,6,0)/1000,0)","v":0},null,0,0,0,0,null,"La cuenta Otros impuestos sobre el comercio exterior y transacciones internacionales, representa el 0,00% del total del Ingresos, que comparado al periodo anterior genera una variación absoluta de 0 000,00 que corresponde a un Aumento del 0,00% de recursos disponibles."]
["4.1.9.","Otros impuestos","35",{"$f":"SUM(D31)","v":0},{"$f":"SUM(E31)","v":0},null,0,0,0,0,null,"La cuenta Otros impuestos, representa el 0,00% del total del Ingresos, que comparado al periodo anterior genera una variación absoluta de 0 000,00 que corresponde a un Aumento del 0,00% de recursos disponibles."]
["4.1.9.99.","Otros impuestos sin discriminar",null,{"$f":"IFERROR(VLOOKUP(A31,BC_ACTUAL!B:G,6,0)/1000,0)","v":0},{"$f":"IFERROR(VLOOKUP(A31,BC_ANTERIOR!B:G,6,0)/1000,0)","v":0},null,0,0,0,0,null,"La cuenta Otros impuestos sin discriminar, representa el 0,00% del total del Ingresos, que comparado al periodo anterior genera una variación absoluta de 0 000,00 que corresponde a un Aumento del 0,00% de recursos disponibles."]
["4.2.","Contribuciones sociales"]
["4.2.1.","Contribuciones a la seguridad social","36",{"$f":"SUM(D34:D36)","v":0},{"$f":"SUM(E34:E36)","v":0},null,{"$f":"IFERROR(D33/$D$133,0)","v":0},{"$f":"IFERROR(E33/$E$133,0)","v":0},{"$f":"IFERROR(D33-E33,0)","v":0},0,null,"La cuenta Contribuciones a la seguridad social, representa el 0,00% del total del Ingresos, que comparado al periodo anterior genera una variación absoluta de 0 000,00 que corresponde a un Aumento del 0,00% de recursos disponibles."]
["4.2.1.01.","Contribuciones al seguro de pensiones",null,{"$f":"IFERROR(VLOOKUP(A34,BC_ACTUAL!B:G,6,0)/1000,0)","v":0},{"$f":"IFERROR(VLOOKUP(A34,BC_ANTERIOR!B:G,6,0)/1000,0)","v":0},null,0,0,0,0,null,"La cuenta Contribuciones al seguro de pensiones, representa el 0,00% del total del Ingresos, que comparado al periodo anterior genera una variación absoluta de 0 000,00 que corresponde a un Aumento del 0,00% de recursos disponibles."]
["4.2.1.02.","Contribuciones a regímenes especiales de pensiones",null,{"$f":"IFERROR(VLOOKUP(A35,BC_ACTUAL!B:G,6,0)/1000,0)","v":0},{"$f":"IFERROR(VLOOKUP(A35,BC_ANTERIOR!B:G,6,0)/1000,0)","v":0},null,0,0,0,0,null,"La cuenta Contribuciones a regímenes especiales de pensiones, representa el 0,00% del total del Ingresos, que comparado al periodo anterior genera una variación absoluta de 0 000,00 que corresponde a un Aumento del 0,00% de recursos disponibles."]
["4.2.1.03.","Contribuciones al seguro de salud",null,{"$f":"IFERROR(VLOOKUP(A36,BC_ACTUAL!B:G,6,0)/1000,0)","v":0},{"$f":"IFERROR(VLOOKUP(A36,BC_ANTERIOR!B:G,6,0)/1000,0)","v":0},null,0,0,0,0,null,"La cuenta Contribuciones al seguro de salud, representa el 0,00% del total del Ingresos, que comparado al periodo anterior genera una variación absoluta de 0 000,00 que corresponde a un Aumento del 0,00% de recursos disponibles."]
["4.2.9.","Contribuciones sociales diversas","37",{"$f":"SUM(D38)","v":0},{"$f":"SUM(E38)","v":0},null,0,0,0,0,null,"La cuenta Contribuciones sociales diversas, representa el 0,00% del total del Ingresos, que comparado al periodo anterior genera una variación absoluta de 0 000,00 que corresponde a un Aumento del 0,00% de recursos disponibles."]
["4.2.9.99.","Otras contribuciones sociales",null,{"$f":"IFERROR(VLOOKUP(A38,BC_ACTUAL!B:G,6,0)/1000,0)","v":0},{"$f":"IFERROR(VLOOKUP(A38,BC_ANTERIOR!B:G,6,0)/1000,0)","v":0},null,0,0,0,0,null,"La cuenta Otras contribuciones sociales, representa el 0,00% del total del Ingresos, que comparado al periodo anterior genera una variación absoluta de 0 000,00 que corresponde a un Aumento del 0,00% de recursos disponibles."]
["4.3.","Multas, sanciones, remates y confiscaciones de origen no tributario"]
["4.3.1.","Multas y sanciones administrativas","38",{"$f":"SUM(D41:D44)","v":0},{"$f":"SUM(E41:E44)","v":0},null,{"$f":"IFERROR(D40/$D$133,0)","v":0},{"$f":"IFERROR(E40/$E$133,0)","v":0},{"$f":"IFERROR(D40-E40,0)","v":0},0,null,"La cuenta Multas y sanciones administrativas, representa el 0,00% del total del Ingresos, que comparado al periodo anterior genera una variación absoluta de 0 000,00 que corresponde a un Aumento del 0,00% de recursos disponibles."]
["4.3.1.01.","Multas de tránsito",null,{"$f":"IFERROR(VLOOKUP(A41,BC_ACTUAL!B:G,6,0)/1000,0)","v":0},{"$f":"IFERROR(VLOOKUP(A41,BC_ANTERIOR!B:G,6,0)/1000,0)","v":0},null,0,0,0,0,null,"La cuenta Multas de tránsito, representa el 0,00% del total del Ingresos, que comparado al periodo anterior genera una variación absoluta de 0 000,00 que corresponde a un Aumento del 0,00% de recursos disponibles."]
["4.3.1.02.","Multas por atraso en el pago de bienes y servicios",null,{"$f":"IFERROR(VLOOKUP(A42,BC_ACTUAL!B:G,6,0)/1000,0)","v":0},{"$f":"IFERROR(VLOOKUP(A42,BC_ANTERIOR!B:G,6,0)/1000,0)","v":0},null,0,0,0,0,null,"La cuenta Multas por atraso en el pago de bienes y servicios, representa el 0,00% del total del Ingresos, que comparado al periodo anterior genera una variación absoluta de 0 000,00 que corresponde a un Aumento del 0,00% de recursos disponibles."]
["4.3.1.03.","Sanciones administrativas",null,{"$f":"IFERROR(VLOOKUP(A43,BC_ACTUAL!B:G,6,0)/1000,0)","v":0},{"$f":"IFERROR(VLOOKUP(A43,BC_ANTERIOR!B:G,6,0)/1000,0)","v":0},null,0,0,0,0,null,"La cuenta Sanciones administrativas, representa el 0,00% del total del Ingresos, que comparado al periodo anterior genera una variación absoluta de 0 000,00 que corresponde a un Aumento del 0,00% de recursos disponibles."]
["4.3.1.99.","Otras multas",null,{"$f":"IFERROR(VLOOKUP(A44,BC_ACTUAL!B:G,6,0)/1000,0)","v":0},{"$f":"IFERROR(VLOOKUP(A44,BC_ANTERIOR!B:G,6,0)/1000,0)","v":0},null,0,0,0,0,null,"La cuenta Otras multas, representa el 0,00% del total del Ingresos, que comparado al periodo anterior genera una variación absoluta de 0 000,00 que corresponde a un Aumento del 0,00% de recursos disponibles."]
["4.3.2.","Remates y confiscaciones de origen no tributario","39",{"$f":"SUM(D46)","v":0},{"$f":"SUM(E46)","v":0},null,0,0,0,0,null,"La cuenta Remates y confiscaciones de origen no tributario, representa el 0,00% del total del Ingresos, que comparado al periodo anterior genera una variación absoluta de 0 000,00 que corresponde a un Aumento del 0,00% de recursos disponibles."]
["4.3.2.99.","Otros remates y confiscaciones de origen no tributario",null,{"$f":"IFERROR(VLOOKUP(A46,BC_ACTUAL!B:G,6,0)/1000,0)","v":0},{"$f":"IFERROR(VLOOKUP(A46,BC_ANTERIOR!B:G,6,0)/1000,0)","v":0},null,0,0,0,0,null,"La cuenta Otros remates y confiscaciones de origen no tributario, representa el 0,00% del total del Ingresos, que comparado al periodo anterior genera una variación absoluta de 0 000,00 que corresponde a un Aumento del 0,00% de recursos disponibles."]
["4.3.3.","Intereses Moratorios","40",{"$f":"SUM(D48:D49)","v":0},{"$f":"SUM(E48:E49)","v":0},null,0,0,0,0,null,"La cuenta Intereses Moratorios, representa el 0,00% del total del Ingresos, que comparado al periodo anterior genera una variación absoluta de 0 000,00 que corresponde a un Aumento del 0,00% de recursos disponibles."]
["4.3.3.01.","Otros remates y confiscaciones de origen no tributario",null,{"$f":"IFERROR(VLOOKUP(A48,BC_ACTUAL!B:G,6,0)/1000,0)","v":0},{"$f":"IFERROR(VLOOKUP(A48,BC_ANTERIOR!B:G,6,0)/1000,0)","v":0},null,0,0,0,0,null,"La cuenta Otros remates y confiscaciones de origen no tributario, representa el 0,00% del total del Ingresos, que comparado al periodo anterior genera una variación absoluta de 0 000,00 que corresponde a un Aumento del 0,00% de recursos disponibles."]
["4.3.3.02.","Intereses moratorios por atraso en el pago de multas de transito",null,{"$f":"IFERROR(VLOOKUP(A49,BC_ACTUAL!B:G,6,0)/1000,0)","v":0},{"$f":"IFERROR(VLOOKUP(A49,BC_ANTERIOR!B:G,6,0)/1000,0)","v":0},null,0,0,0,0,null,"La cuenta Intereses moratorios por atraso en el pago de multas de transito, representa el 0,00% del total del Ingresos, que comparado al periodo anterior genera una variación absoluta de 0 000,00 que corresponde a un Aumento del 0,00% de recursos disponibles."]
["4.4.","Ingresos y resultados positivos por ventas"]
["4.4.1.","Ventas de bienes y servicios","41",{"$f":"SUM(D52:D53)","v":0},{"$f":"SUM(E52:E53)","v":0},null,{"$f":"IFERROR(D51/$D$133,0)","v":0},{"$f":"IFERROR(E51/$E$133,0)","v":0},{"$f":"IFERROR(D51-E51,0)","v":0},0,null,"La cuenta Ventas de bienes y servicios, representa el 0,00% del total del Ingresos, que comparado al periodo anterior genera una variación absoluta de 0 000,00 que corresponde a un Aumento del 0,00% de recursos disponibles."]
["4.4.1.01.","Ventas de bienes",null,{"$f":"IFERROR(VLOOKUP(A52,BC_ACTUAL!B:G,6,0)/1000,0)","v":0},{"$f":"IFERROR(VLOOKUP(A52,BC_ANTERIOR!B:G,6,0)/1000,0)","v":0},null,0,0,0,0,null,"La cuenta Ventas de bienes, representa el 0,00% del total del Ingresos, que comparado al periodo anterior genera una variación absoluta de 0 000,00 que corresponde a un Aumento del 0,00% de recursos disponibles."]
["4.4.1.02.","Ventas de servicios",null,{"$f":"IFERROR(VLOOKUP(A53,BC_ACTUAL!B:G,6,0)/1000,0)","v":0},{"$f":"IFERROR(VLOOKUP(A53,BC_ANTERIOR!B:G,6,0)/1000,0)","v":0},null,0,0,0,0,null,"La cuenta Ventas de servicios, representa el 0,00% del total del Ingresos, que comparado al periodo anterior genera una variación absoluta de 0 000,00 que corresponde a un Aumento del 0,00% de recursos disponibles."]
["4.4.2.","Derechos administrativos","42",{"$f":"SUM(D55:D56)","v":0},{"$f":"SUM(E55:E56)","v":0},null,0,0,0,0,null,"La cuenta Derechos administrativos, representa el 0,00% del total del Ingresos, que comparado al periodo anterior genera una variación absoluta de 0 000,00 que corresponde a un Aumento del 0,00% de recursos disponibles."]
["4.4.2.01.","Derechos administrativos a los servicios de transporte",null,{"$f":"IFERROR(VLOOKUP(A55,BC_ACTUAL!B:G,6,0)/1000,0)","v":0},{"$f":"IFERROR(VLOOKUP(A55,BC_ANTERIOR!B:G,6,0)/1000,0)","v":0},null,0,0,0,0,null,"La cuenta Derechos administrativos a los servicios de transporte, representa el 0,00% del total del Ingresos, que comparado al periodo anterior genera una variación absoluta de 0 000,00 que corresponde a un Aumento del 0,00% de recursos disponibles."]
["4.4.2.99.","Otros derechos administrativos",null,{"$f":"IFERROR(VLOOKUP(A56,BC_ACTUAL!B:G,6,0)/1000,0)","v":0},{"$f":"IFERROR(VLOOKUP(A56,BC_ANTERIOR!B:G,6,0)/1000,0)","v":0},null,0,0,0,0,null,"La cuenta Otros derechos administrativos, representa el 0,00% del total del Ingresos, que comparado al periodo anterior genera una variación absoluta de 0 000,00 que corresponde a un Aumento del 0,00% de recursos disponibles."]
["4.4.3.","Comisiones por préstamos","43",{"$f":"SUM(D58:D60)","v":0},{"$f":"SUM(E58:E60)","v":0},null,0,0,0,0,null,"La cuenta Comisiones por préstamos, representa el 0,00% del total del Ingresos, que comparado al periodo anterior genera una variación absoluta de 0 000,00 que corresponde a un Aumento del 0,00% de recursos disponibles."]
["4.4.3.01.","Comisiones por préstamos al sector privado interno",null,{"$f":"IFERROR(VLOOKUP(A58,BC_ACTUAL!B:G,6,0)/1000,0)","v":0},{"$f":"IFERROR(VLOOKUP(A58,BC_ANTERIOR!B:G,6,0)/1000,0)","v":0},null,0,0,0,0,null,"La cuenta Comisiones por préstamos al sector privado interno, representa el 0,00% del total del Ingresos, que comparado al periodo anterior genera una variación absoluta de 0 000,00 que corresponde a un Aumento del 0,00% de recursos disponibles."]
["4.4.3.02.","Comisiones por préstamos al sector público interno",null,{"$f":"IFERROR(VLOOKUP(A59,BC_ACTUAL!B:G,6,0)/1000,0)","v":0},{"$f":"IFERROR(VLOOKUP(A59,BC_ANTERIOR!B:G,6,0)/1000,0)","v":0},null,0,0,0,0,null,"La cuenta Comisiones por préstamos al sector público interno, representa el 0,00% del total del Ingresos, que comparado al periodo anterior genera una variación absoluta de 0 000,00 que corresponde a un Aumento del 0,00% de recursos disponibles."]
["4.4.3.03.","Comisiones por préstamos al sector externo",null,{"$f":"IFERROR(VLOOKUP(A60,BC_ACTUAL!B:G,6,0)/1000,0)","v":0},{"$f":"IFERROR(VLOOKUP(A60,BC_ANTERIOR!B:G,6,0)/1000,0)","v":0},null,0,0,0,0,null,"La cuenta Comisiones por préstamos al sector externo, representa el 0,00% del total del Ingresos, que comparado al periodo anterior genera una variación absoluta de 0 000,00 que corresponde a un Aumento del 0,00% de recursos disponibles."]
["4.4.4.","Resultados positivos por ventas de inversiones","44",{"$f":"SUM(D62:D63)","v":0},{"$f":"SUM(E62:E63)","v":0},null,0,0,0,0,null,"La cuenta Resultados positivos por ventas de inversiones, representa el 0,00% del total del Ingresos, que comparado al periodo anterior genera una variación absoluta de 0 000,00 que corresponde a un Aumento del 0,00% de recursos disponibles."]
["4.4.4.01.","Resultados positivos por ventas de inversiones patrimoniales - Método de participación",null,{"$f":"IFERROR(VLOOKUP(A62,BC_ACTUAL!B:G,6,0),0)","v":0},{"$f":"IFERROR(VLOOKUP(A62,BC_ANTERIOR!B:G,6,0),0)","v":0},null,0,0,0,0,null,"La cuenta Resultados positivos por ventas de inversiones patrimoniales - Método de participación, representa el 0,00% del total del Ingresos, que comparado al periodo anterior genera una variación absoluta de 0 000,00 que corresponde a un Aumento del 0,00% de recursos disponibles."]
["4.4.4.98.","Resultados positivos por ventas de otras inversiones ",null,{"$f":"IFERROR(VLOOKUP(A63,BC_ACTUAL!B:G,6,0),0)","v":0},{"$f":"IFERROR(VLOOKUP(A63,BC_ANTERIOR!B:G,6,0),0)","v":0},null,0,0,0,0,null,"La cuenta Resultados positivos por ventas de otras inversiones , representa el 0,00% del total del Ingresos, que comparado al periodo anterior genera una variación absoluta de 0 000,00 que corresponde a un Aumento del 0,00% de recursos disponibles."]
["4.4.5.","Resultados positivos por ventas e intercambio de bienes","45",{"$f":"SUM(D65:D74)","v":0},{"$f":"SUM(E65:E74)","v":0},null,0,0,0,0,null,"La cuenta Resultados positivos por ventas e intercambio de bienes, representa el 0,00% del total del Ingresos, que comparado al periodo anterior genera una variación absoluta de 0 000,00 que corresponde a un Aumento del 0,00% de recursos disponibles."]
["4.4.5.01.","Resultados positivos por ventas de construcciones terminadas",null,{"$f":"IFERROR(VLOOKUP(A65,BC_ACTUAL!B:G,6,0)/1000,0)","v":0},{"$f":"IFERROR(VLOOKUP(A65,BC_ANTERIOR!B:G,6,0)/1000,0)","v":0},null,0,0,0,0,null,"La cuenta Resultados positivos por ventas de construcciones terminadas, representa el 0,00% del total del Ingresos, que comparado al periodo anterior genera una variación absoluta de 0 000,00 que corresponde a un Aumento del 0,00% de recursos disponibles."]
["4.4.5.02.","Resultados positivos por ventas de propiedades, planta y equipo",null,{"$f":"IFERROR(VLOOKUP(A66,BC_ACTUAL!B:G,6,0)/1000,0)","v":0},{"$f":"IFERROR(VLOOKUP(A66,BC_ANTERIOR!B:G,6,0)/1000,0)","v":0},null,0,0,0,0,null,"La cuenta Resultados positivos por ventas de propiedades, planta y equipo, representa el 0,00% del total del Ingresos, que comparado al periodo anterior genera una variación absoluta de 0 000,00 que corresponde a un Aumento del 0,00% de recursos disponibles."]
["4.4.5.03.","Resultados positivos por ventas de activos biológicos",null,{"$f":"IFERROR(VLOOKUP(A67,BC_ACTUAL!B:G,6,0)/1000,0)","v":0},{"$f":"IFERROR(VLOOKUP(A67,BC_ANTERIOR!B:G,6,0)/1000,0)","v":0},null,0,0,0,0,null,"La cuenta Resultados positivos por ventas de activos biológicos, representa el 0,00% del total del Ingresos, que comparado al periodo anterior genera una variación absoluta de 0 000,00 que corresponde a un Aumento del 0,00% de recursos disponibles."]
["4.4.5.04.","Resultados positivos por ventas de bienes intangibles",null,{"$f":"IFERROR(VLOOKUP(A68,BC_ACTUAL!B:G,6,0)/1000,0)","v":0},{"$f":"IFERROR(VLOOKUP(A68,BC_ANTERIOR!B:G,6,0)/1000,0)","v":0},null,0,0,0,0,null,"La cuenta Resultados positivos por ventas de bienes intangibles, representa el 0,00% del total del Ingresos, que comparado al periodo anterior genera una variación absoluta de 0 000,00 que corresponde a un Aumento del 0,00% de recursos disponibles."]
["4.4.5.05.","Resultados positivos por ventas por arrendamientos financieros",null,{"$f":"IFERROR(VLOOKUP(A69,BC_ACTUAL!B:G,6,0)/1000,0)","v":0},{"$f":"IFERROR(VLOOKUP(A69,BC_ANTERIOR!B:G,6,0)/1000,0)","v":0},null,0,0,0,0,null,"La cuenta Resultados positivos por ventas por arrendamientos financieros, representa el 0,00% del total del Ingresos, que comparado al periodo anterior genera una variación absoluta de 0 000,00 que corresponde a un Aumento del 0,00% de recursos disponibles."]
["4.4.5.06.","Resultados positivos por intercambio de propiedades, planta y equipo",null,{"$f":"IFERROR(VLOOKUP(A70,BC_ACTUAL!B:G,6,0)/1000,0)","v":0},{"$f":"IFERROR(VLOOKUP(A70,BC_ANTERIOR!B:G,6,0)/1000,0)","v":0},null,0,0,0,0,null,"La cuenta Resultados positivos por intercambio de propiedades, planta y equipo, representa el 0,00% del total del Ingresos, que comparado al periodo anterior genera una variación absoluta de 0 000,00 que corresponde a un Aumento del 0,00% de recursos disponibles."]
["4.4.5.07.","Resultados positivos por intercambio de bienes intangibles",null,{"$f":"IFERROR(VLOOKUP(A71,BC_ACTUAL!B:G,6,0)/1000,0)","v":0},{"$f":"IFERROR(VLOOKUP(A71,BC_ANTERIOR!B:G,6,0)/1000,0)","v":0},null,0,0,0,0,null,"La cuenta Resultados positivos por intercambio de bienes intangibles, representa el 0,00% del total del Ingresos, que comparado al periodo anterior genera una variación absoluta de 0 000,00 que corresponde a un Aumento del 0,00% de recursos disponibles."]
["4.4.5.08.","Resultados positivos por intercambio de Inventario",null,{"$f":"IFERROR(VLOOKUP(A72,BC_ACTUAL!B:G,6,0)/1000,0)","v":0},{"$f":"IFERROR(VLOOKUP(A72,BC_ANTERIOR!B:G,6,0)/1000,0)","v":0},null,0,0,0,0,null,"La cuenta Resultados positivos por intercambio de Inventario, representa el 0,00% del total del Ingresos, que comparado al periodo anterior genera una variación absoluta de 0 000,00 que corresponde a un Aumento del 0,00% de recursos disponibles."]
["4.4.5.09.","Resultados positivos por la entrega de activos como medio de pago de impuestos",null,{"$f":"IFERROR(VLOOKUP(A73,BC_ACTUAL!B:G,6,0)/1000,0)","v":0},{"$f":"IFERROR(VLOOKUP(A73,BC_ANTERIOR!B:G,6,0)/1000,0)","v":0},null,0,0,0,0,null,"La cuenta Resultados positivos por la entrega de activos como medio de pago de impuestos, representa el 0,00% del total del Ingresos, que comparado al periodo anterior genera una variación absoluta de 0 000,00 que corresponde a un Aumento del 0,00% de recursos disponibles."]
["4.4.5.10.","Resultados positivos por intercambio de bienes de infraestructura",null,{"$f":"IFERROR(VLOOKUP(A74,BC_ACTUAL!B:G,6,0)/1000,0)","v":0},{"$f":"IFERROR(VLOOKUP(A74,BC_ANTERIOR!B:G,6,0)/1000,0)","v":0},null,{"$f":"IFERROR(D74/$D$133,0)","v":0},{"$f":"IFERROR(E74/$E$133,0)","v":0},{"$f":"IFERROR(D74-E74,0)","v":0},{"$f":"IFERROR(I74/E74,0)","v":0},null,{"$f":"\"La\"&\" \"&\"cuenta\"&\" \"&B74&\",\"&\" \"&\"representa\"&\" \"&\"el\"&\" \"&TEXT(G74,\"0,00%\")&\" \"&\"del\"&\" \"&\"total\"&\" \"&\"del\"&\" \"&IF(MID(A74,1,2)=\"1.\",\"Activo\",IF(MID(A74,1,2)=\"2.\",\"Pasivo\",IF(MID(A74,1,2)=\"3.\",\"Capital\",IF(MID(A74,1,2)=\"4.\",\"Ingresos\",IF(MID(A74,1,2)=\"5.\",\"Gastos\",\"\")))))&\",\"&\" \"&\"que\"&\" \"&\"comparado\"&\" \"&\"al\"&\" \"&\"periodo\"&\" \"&\"anterior\"&\" \"&\"genera\"&\" \"&\"una\"&\" \"&\"variación\"&\" \"&\"absoluta\"&\" \"&\"de\"&\" \"&TEXT(I74,\"0 000,00\")&\" \"&\"que\"&\" \"&\"corresponde\"&\" \"&\"a\"&\" \"&\"un\"&\" \"&IF(I74<0,\"Disminución\",\"Aumento\")&\" \"&\"del\"&\" \"&TEXT(J74,\"0,00%\")&\" \"&\"de\"&\" \"&\"recursos\"&\" \"&\"disponibles\"&\".\"","v":"La cuenta Resultados positivos por intercambio de bienes de infraestructura, representa el 0,00% del total del Ingresos, que comparado al periodo anterior genera una variación absoluta de 0 000,00 que corresponde a un Aumento del 0,00% de recursos disponibles."}]
["4.4.6.","Resultados positivos por la recuperación de dinero mal acreditado de periodos anteriores","46",{"$f":"SUM(D76)","v":0},{"$f":"SUM(E76)","v":0},null,{"$f":"IFERROR(D75/$D$133,0)","v":0},{"$f":"IFERROR(E75/$E$133,0)","v":0},{"$f":"IFERROR(D75-E75,0)","v":0},0,null,"La cuenta Resultados positivos por la recuperación de dinero mal acreditado de periodos anteriores, representa el 0,00% del total del Ingresos, que comparado al periodo anterior genera una variación absoluta de 0 000,00 que corresponde a un Aumento del 0,00% de recursos disponibles."]
["4.4.6.01.","Resultados positivos por la recuperación de sumas de periodos anteriores",null,{"$f":"IFERROR(VLOOKUP(A76,BC_ACTUAL!B:G,6,0)/1000,0)","v":0},{"$f":"IFERROR(VLOOKUP(A76,BC_ANTERIOR!B:G,6,0)/1000,0)","v":0},null,{"$f":"IFERROR(D76/$D$133,0)","v":0},{"$f":"IFERROR(E76/$E$133,0)","v":0},0,{"$f":"IFERROR(I76/E76,0)","v":0},null,{"$f":"\"La\"&\" \"&\"cuenta\"&\" \"&B76&\",\"&\" \"&\"representa\"&\" \"&\"el\"&\" \"&TEXT(G76,\"0,00%\")&\" \"&\"del\"&\" \"&\"total\"&\" \"&\"del\"&\" \"&IF(MID(A76,1,2)=\"1.\",\"Activo\",IF(MID(A76,1,2)=\"2.\",\"Pasivo\",IF(MID(A76,1,2)=\"3.\",\"Capital\",IF(MID(A76,1,2)=\"4.\",\"Ingresos\",IF(MID(A76,1,2)=\"5.\",\"Gastos\",\"\")))))&\",\"&\" \"&\"que\"&\" \"&\"comparado\"&\" \"&\"al\"&\" \"&\"periodo\"&\" \"&\"anterior\"&\" \"&\"genera\"&\" \"&\"una\"&\" \"&\"variación\"&\" \"&\"absoluta\"&\" \"&\"de\"&\" \"&TEXT(I76,\"0 000,00\")&\" \"&\"que\"&\" \"&\"corresponde\"&\" \"&\"a\"&\" \"&\"un\"&\" \"&IF(I76<0,\"Disminución\",\"Aumento\")&\" \"&\"del\"&\" \"&TEXT(J76,\"0,00%\")&\" \"&\"de\"&\" \"&\"recursos\"&\" \"&\"disponibles\"&\".\"","v":"La cuenta Resultados positivos por la recuperación de sumas de periodos anteriores, representa el 0,00% del total del Ingresos, que comparado al periodo anterior genera una variación absoluta de 0 000,00 que corresponde a un Aumento del 0,00% de recursos disponibles."}]
["4.5.","Ingresos de la propiedad"]
["4.5.1.","Rentas de inversiones y de colocación de efectivo","47",{"$f":"SUM(D79:D81)","v":0},{"$f":"SUM(E79:E81)","v":0},null,{"$f":"IFERROR(D78/$D$133,0)","v":0},{"$f":"IFERROR(E78/$E$133,0)","v":0},{"$f":"IFERROR(D78-E78,0)","v":0},{"$f":"IFERROR(I78/E78,0)","v":0},null,"La cuenta Rentas de inversiones y de colocación de efectivo, representa el 0,00% del total del Ingresos, que comparado al periodo anterior genera una variación absoluta de 0 000,00 que corresponde a un Aumento del 0,00% de recursos disponibles."]
["4.5.1.01.","Intereses por equivalentes de efectivo",null,{"$f":"IFERROR(VLOOKUP(A79,BC_ACTUAL!B:G,6,0)/1000,0)","v":0},{"$f":"IFERROR(VLOOKUP(A79,BC_ANTERIOR!B:G,6,0)/1000,0)","v":0},null,0,0,0,0,null,"La cuenta Intereses por equivalentes de efectivo, representa el 0,00% del total del Ingresos, que comparado al periodo anterior genera una variación absoluta de 0 000,00 que corresponde a un Aumento del 0,00% de recursos disponibles."]
["4.5.1.02.","Intereses por títulos y valores a costo amortizado",null,{"$f":"IFERROR(VLOOKUP(A80,BC_ACTUAL!B:G,6,0)/1000,0)","v":0},{"$f":"IFERROR(VLOOKUP(A80,BC_ANTERIOR!B:G,6,0)/1000,0)","v":0},null,0,0,0,{"$f":"IFERROR(I80/E80,0)","v":0},null,"La cuenta Intereses por títulos y valores a costo amortizado, representa el 0,00% del total del Ingresos, que comparado al periodo anterior genera una variación absoluta de 0 000,00 que corresponde a un Aumento del 0,00% de recursos disponibles."]
["4.5.1.98.","Resultados positivos de otras inversiones",null,{"$f":"IFERROR(VLOOKUP(A81,BC_ACTUAL!B:G,6,0)/1000,0)","v":0},{"$f":"IFERROR(VLOOKUP(A81,BC_ANTERIOR!B:G,6,0)/1000,0)","v":0},null,0,0,0,0,null,"La cuenta Resultados positivos de otras inversiones, representa el 0,00% del total del Ingresos, que comparado al periodo anterior genera una variación absoluta de 0 000,00 que corresponde a un Aumento del 0,00% de recursos disponibles."]
["4.5.2.","Alquileres y derechos sobre bienes","48",{"$f":"SUM(D83:D85)","v":0},{"$f":"SUM(E83:E85)","v":0},null,0,0,0,0,null,"La cuenta Alquileres y derechos sobre bienes, representa el 0,00% del total del Ingresos, que comparado al periodo anterior genera una variación absoluta de 0 000,00 que corresponde a un Aumento del 0,00% de recursos disponibles."]
["4.5.2.01.","Alquileres",null,{"$f":"IFERROR(VLOOKUP(A83,BC_ACTUAL!B:G,6,0)/1000,0)","v":0},{"$f":"IFERROR(VLOOKUP(A83,BC_ANTERIOR!B:G,6,0)/1000,0)","v":0},null,0,0,0,0,null,"La cuenta Alquileres, representa el 0,00% del total del Ingresos, que comparado al periodo anterior genera una variación absoluta de 0 000,00 que corresponde a un Aumento del 0,00% de recursos disponibles."]
["4.5.2.02.","Ingresos por concesiones",null,{"$f":"IFERROR(VLOOKUP(A84,BC_ACTUAL!B:G,6,0)/1000,0)","v":0},{"$f":"IFERROR(VLOOKUP(A84,BC_ANTERIOR!B:G,6,0)/1000,0)","v":0},null,0,0,0,0,null,"La cuenta Ingresos por concesiones, representa el 0,00% del total del Ingresos, que comparado al periodo anterior genera una variación absoluta de 0 000,00 que corresponde a un Aumento del 0,00% de recursos disponibles."]
["4.5.2.03.","Derechos sobre bienes intangibles",null,{"$f":"IFERROR(VLOOKUP(A85,BC_ACTUAL!B:G,6,0)/1000,0)","v":0},{"$f":"IFERROR(VLOOKUP(A85,BC_ANTERIOR!B:G,6,0)/1000,0)","v":0},null,0,0,0,0,null,"La cuenta Derechos sobre bienes intangibles, representa el 0,00% del total del Ingresos, que comparado al periodo anterior genera una variación absoluta de 0 000,00 que corresponde a un Aumento del 0,00% de recursos disponibles."]
["4.5.9.","Otros ingresos de la propiedad","49",{"$f":"SUM(D87:D92)","v":0},{"$f":"SUM(E87:E92)","v":0},null,0,0,0,0,null,"La cuenta Otros ingresos de la propiedad, representa el 0,00% del total del Ingresos, que comparado al periodo anterior genera una variación absoluta de 0 000,00 que corresponde a un Aumento del 0,00% de recursos disponibles."]
["4.5.9.03.","Intereses por ventas",null,{"$f":"IFERROR(VLOOKUP(A87,BC_ACTUAL!B:G,6,0)/1000,0)","v":0},{"$f":"IFERROR(VLOOKUP(A87,BC_ANTERIOR!B:G,6,0)/1000,0)","v":0},null,0,0,0,0,null,"La cuenta Intereses por ventas, representa el 0,00% del total del Ingresos, que comparado al periodo anterior genera una variación absoluta de 0 000,00 que corresponde a un Aumento del 0,00% de recursos disponibles."]
["4.5.9.07.","Intereses por préstamos",null,{"$f":"IFERROR(VLOOKUP(A88,BC_ACTUAL!B:G,6,0)/1000,0)","v":0},{"$f":"IFERROR(VLOOKUP(A88,BC_ANTERIOR!B:G,6,0)/1000,0)","v":0},null,0,0,0,0,null,"La cuenta Intereses por préstamos, representa el 0,00% del total del Ingresos, que comparado al periodo anterior genera una variación absoluta de 0 000,00 que corresponde a un Aumento del 0,00% de recursos disponibles."]
["4.5.9.08.","Intereses por documentos a cobrar",null,{"$f":"IFERROR(VLOOKUP(A89,BC_ACTUAL!B:G,6,0)/1000,0)","v":0},{"$f":"IFERROR(VLOOKUP(A89,BC_ANTERIOR!B:G,6,0)/1000,0)","v":0},null,0,0,0,0,null,"La cuenta Intereses por documentos a cobrar, representa el 0,00% del total del Ingresos, que comparado al periodo anterior genera una variación absoluta de 0 000,00 que corresponde a un Aumento del 0,00% de recursos disponibles."]
["4.5.9.10.","Intereses por deudores por avales ejecutados",null,{"$f":"IFERROR(VLOOKUP(A90,BC_ACTUAL!B:G,6,0)/1000,0)","v":0},{"$f":"IFERROR(VLOOKUP(A90,BC_ANTERIOR!B:G,6,0)/1000,0)","v":0},null,0,0,0,0,null,"La cuenta Intereses por deudores por avales ejecutados, representa el 0,00% del total del Ingresos, que comparado al periodo anterior genera una variación absoluta de 0 000,00 que corresponde a un Aumento del 0,00% de recursos disponibles."]
["4.5.9.97.","Intereses por cuentas a cobrar en gestión judicial",null,{"$f":"IFERROR(VLOOKUP(A91,BC_ACTUAL!B:G,6,0)/1000,0)","v":0},{"$f":"IFERROR(VLOOKUP(A91,BC_ANTERIOR!B:G,6,0)/1000,0)","v":0},null,0,0,0,0,null,"La cuenta Intereses por cuentas a cobrar en gestión judicial, representa el 0,00% del total del Ingresos, que comparado al periodo anterior genera una variación absoluta de 0 000,00 que corresponde a un Aumento del 0,00% de recursos disponibles."]
["4.5.9.99.","Intereses por otras cuentas a cobrar",null,{"$f":"IFERROR(VLOOKUP(A92,BC_ACTUAL!B:G,6,0)/1000,0)","v":0},{"$f":"IFERROR(VLOOKUP(A92,BC_ANTERIOR!B:G,6,0)/1000,0)","v":0},null,0,0,0,0,null,"La cuenta Intereses por otras cuentas a cobrar, representa el 0,00% del total del Ingresos, que comparado al periodo anterior genera una variación absoluta de 0 000,00 que corresponde a un Aumento del 0,00% de recursos disponibles."]
["4.6.","Transferencias"]
["4.6.1.","Transferencias corrientes","50",{"$f":"SUM(D95:D97)","v":0},{"$f":"SUM(E95:E97)","v":0},null,{"$f":"IFERROR(D94/$D$133,0)","v":0},{"$f":"IFERROR(E94/$E$133,0)","v":0},{"$f":"IFERROR(D94-E94,0)","v":0},0,null,"La cuenta Transferencias corrientes, representa el 0,00% del total del Ingresos, que comparado al periodo anterior genera una variación absoluta de 0 000,00 que corresponde a un Aumento del 0,00% de recursos disponibles."]
["4.6.1.01.","Transferencias corrientes del sector privado interno",null,{"$f":"IFERROR(VLOOKUP(A95,BC_ACTUAL!B:G,6,0)/1000,0)","v":0},{"$f":"IFERROR(VLOOKUP(A95,BC_ANTERIOR!B:G,6,0)/1000,0)","v":0},null,0,0,0,0,null,"La cuenta Transferencias corrientes del sector privado interno, representa el 0,00% del total del Ingresos, que comparado al periodo anterior genera una variación absoluta de 0 000,00 que corresponde a un Aumento del 0,00% de recursos disponibles."]
["4.6.1.02.","Transferencias corrientes del sector público interno",null,{"$f":"IFERROR(VLOOKUP(A96,BC_ACTUAL!B:G,6,0)/1000,0)","v":0},{"$f":"IFERROR(VLOOKUP(A96,BC_ANTERIOR!B:G,6,0)/1000,0)","v":0},null,0,0,0,0,null,"La cuenta Transferencias corrientes del sector público interno, representa el 0,00% del total del Ingresos, que comparado al periodo anterior genera una variación absoluta de 0 000,00 que corresponde a un Aumento del 0,00% de recursos disponibles."]
["4.6.1.03.","Transferencias corrientes del sector externo",null,{"$f":"IFERROR(VLOOKUP(A97,BC_ACTUAL!B:G,6,0)/1000,0)","v":0},{"$f":"IFERROR(VLOOKUP(A97,BC_ANTERIOR!B:G,6,0)/1000,0)","v":0},null,0,0,0,0,null,"La cuenta Transferencias corrientes del sector externo, representa el 0,00% del total del Ingresos, que comparado al periodo anterior genera una variación absoluta de 0 000,00 que corresponde a un Aumento del 0,00% de recursos disponibles."]
["4.6.2.","Transferencias de capital","51",{"$f":"SUM(D99:D101)","v":0},{"$f":"SUM(E99:E101)","v":0},null,0,0,0,0,null,"La cuenta Transferencias de capital, representa el 0,00% del total del Ingresos, que comparado al periodo anterior genera una variación absoluta de 0 000,00 que corresponde a un Aumento del 0,00% de recursos disponibles."]
["4.6.2.01.","Transferencias de capital del sector privado interno",null,{"$f":"IFERROR(VLOOKUP(A99,BC_ACTUAL!B:G,6,0)/1000,0)","v":0},{"$f":"IFERROR(VLOOKUP(A99,BC_ANTERIOR!B:G,6,0)/1000,0)","v":0},null,0,0,0,0,null,"La cuenta Transferencias de capital del sector privado interno, representa el 0,00% del total del Ingresos, que comparado al periodo anterior genera una variación absoluta de 0 000,00 que corresponde a un Aumento del 0,00% de recursos disponibles."]
["4.6.2.02.","Transferencias de capital del sector público interno",null,{"$f":"IFERROR(VLOOKUP(A100,BC_ACTUAL!B:G,6,0)/1000,0)","v":0},{"$f":"IFERROR(VLOOKUP(A100,BC_ANTERIOR!B:G,6,0)/1000,0)","v":0},null,0,0,0,0,null,"La cuenta Transferencias de capital del sector público interno, representa el 0,00% del total del Ingresos, que comparado al periodo anterior genera una variación absoluta de 0 000,00 que corresponde a un Aumento del 0,00% de recursos disponibles."]
["4.6.2.03.","Transferencias de capital del sector externo",null,{"$f":"IFERROR(VLOOKUP(A101,BC_ACTUAL!B:G,6,0)/1000,0)","v":0},{"$f":"IFERROR(VLOOKUP(A101,BC_ANTERIOR!B:G,6,0)/1000,0)","v":0},null,0,0,0,0,null,"La cuenta Transferencias de capital del sector externo, representa el 0,00% del total del Ingresos, que comparado al periodo anterior genera una variación absoluta de 0 000,00 que corresponde a un Aumento del 0,00% de recursos disponibles."]
["4.9.","Otros ingresos"]
["4.9.1.","Resultados positivos por tenencia y por exposición a la inflación","52",{"$f":"SUM(D104:D109)","v":0},{"$f":"SUM(E104:E109)","v":0},null,{"$f":"IFERROR(D103/$D$133,0)","v":0},{"$f":"IFERROR(E103/$E$133,0)","v":0},{"$f":"IFERROR(D103-E103,0)","v":0},0,null,"La cuenta Resultados positivos por tenencia y por exposición a la inflación, representa el 0,00% del total del Ingresos, que comparado al periodo anterior genera una variación absoluta de 0 000,00 que corresponde a un Aumento del 0,00% de recursos disponibles."]
["4.9.1.01.","Diferencias de cambio positivas por activos",null,{"$f":"IFERROR(VLOOKUP(A104,BC_ACTUAL!B:G,6,0)/1000,0)","v":0},{"$f":"IFERROR(VLOOKUP(A104,BC_ANTERIOR!B:G,6,0)/1000,0)","v":0},null,0,0,0,0,null,"La cuenta Diferencias de cambio positivas por activos, representa el 0,00% del total del Ingresos, que comparado al periodo anterior genera una variación absoluta de 0 000,00 que corresponde a un Aumento del 0,00% de recursos disponibles."]
["4.9.1.02.","Diferencias de cambio positivas por pasivos",null,{"$f":"IFERROR(VLOOKUP(A105,BC_ACTUAL!B:G,6,0)/1000,0)","v":0},{"$f":"IFERROR(VLOOKUP(A105,BC_ANTERIOR!B:G,6,0)/1000,0)","v":0},null,0,0,0,0,null,"La cuenta Diferencias de cambio positivas por pasivos, representa el 0,00% del total del Ingresos, que comparado al periodo anterior genera una variación absoluta de 0 000,00 que corresponde a un Aumento del 0,00% de recursos disponibles."]
["4.9.1.03.","Resultados positivos por tenencia de activos no derivados",null,{"$f":"IFERROR(VLOOKUP(A106,BC_ACTUAL!B:G,6,0)/1000,0)","v":0},{"$f":"IFERROR(VLOOKUP(A106,BC_ANTERIOR!B:G,6,0)/1000,0)","v":0},null,0,0,0,0,null,"La cuenta Resultados positivos por tenencia de activos no derivados, representa el 0,00% del total del Ingresos, que comparado al periodo anterior genera una variación absoluta de 0 000,00 que corresponde a un Aumento del 0,00% de recursos disponibles."]
["4.9.1.04.","Resultados positivos por tenencia de pasivos no derivados",null,{"$f":"IFERROR(VLOOKUP(A107,BC_ACTUAL!B:G,6,0)/1000,0)","v":0},{"$f":"IFERROR(VLOOKUP(A107,BC_ANTERIOR!B:G,6,0)/1000,0)","v":0},null,0,0,0,0,null,"La cuenta Resultados positivos por tenencia de pasivos no derivados, representa el 0,00% del total del Ingresos, que comparado al periodo anterior genera una variación absoluta de 0 000,00 que corresponde a un Aumento del 0,00% de recursos disponibles."]
["4.9.1.05.","Resultados positivos por tenencia de instrumentos financieros derivados",null,{"$f":"IFERROR(VLOOKUP(A108,BC_ACTUAL!B:G,6,0)/1000,0)","v":0},{"$f":"IFERROR(VLOOKUP(A108,BC_ANTERIOR!B:G,6,0)/1000,0)","v":0},null,0,0,0,0,null,"La cuenta Resultados positivos por tenencia de instrumentos financieros derivados, representa el 0,00% del total del Ingresos, que comparado al periodo anterior genera una variación absoluta de 0 000,00 que corresponde a un Aumento del 0,00% de recursos disponibles."]
["4.9.1.06.","Resultado positivo por exposición a la inflación",null,{"$f":"IFERROR(VLOOKUP(A109,BC_ACTUAL!B:G,6,0)/1000,0)","v":0},{"$f":"IFERROR(VLOOKUP(A109,BC_ANTERIOR!B:G,6,0)/1000,0)","v":0},null,0,0,0,0,null,"La cuenta Resultado positivo por exposición a la inflación, representa el 0,00% del total del Ingresos, que comparado al periodo anterior genera una variación absoluta de 0 000,00 que corresponde a un Aumento del 0,00% de recursos disponibles."]
["4.9.2.","Reversión de consumo de bienes","53",{"$f":"SUM(D111:D112)","v":0},{"$f":"SUM(E111:E112)","v":0},null,0,0,0,0,null,"La cuenta Reversión de consumo de bienes, representa el 0,00% del total del Ingresos, que comparado al periodo anterior genera una variación absoluta de 0 000,00 que corresponde a un Aumento del 0,00% de recursos disponibles."]
["4.9.2.01.","Reversión de consumo de bienes no concesionados",null,{"$f":"IFERROR(VLOOKUP(A111,BC_ACTUAL!B:G,6,0)/1000,0)","v":0},{"$f":"IFERROR(VLOOKUP(A111,BC_ANTERIOR!B:G,6,0)/1000,0)","v":0},null,0,0,0,0,null,"La cuenta Reversión de consumo de bienes no concesionados, representa el 0,00% del total del Ingresos, que comparado al periodo anterior genera una variación absoluta de 0 000,00 que corresponde a un Aumento del 0,00% de recursos disponibles."]
["4.9.2.02.","Reversión de consumo de bienes concesionados",null,{"$f":"IFERROR(VLOOKUP(A112,BC_ACTUAL!B:G,6,0)/1000,0)","v":0},{"$f":"IFERROR(VLOOKUP(A112,BC_ANTERIOR!B:G,6,0)/1000,0)","v":0},null,0,0,0,0,null,"La cuenta Reversión de consumo de bienes concesionados, representa el 0,00% del total del Ingresos, que comparado al periodo anterior genera una variación absoluta de 0 000,00 que corresponde a un Aumento del 0,00% de recursos disponibles."]
["4.9.3.","Reversión de pérdidas por deterioro y desvalorización de bienes","54",{"$f":"SUM(D114:D118)","v":0},{"$f":"SUM(E114:E118)","v":0},null,0,0,0,0,null,"La cuenta Reversión de pérdidas por deterioro y desvalorización de bienes, representa el 0,00% del total del Ingresos, que comparado al periodo anterior genera una variación absoluta de 0 000,00 que corresponde a un Aumento del 0,00% de recursos disponibles."]
["4.9.3.01.","Reversión de deterioro y desvalorización de bienes no concesionados",null,{"$f":"IFERROR(VLOOKUP(A114,BC_ACTUAL!B:G,6,0)/1000,0)","v":0},{"$f":"IFERROR(VLOOKUP(A114,BC_ANTERIOR!B:G,6,0)/1000,0)","v":0},null,0,0,0,0,null,"La cuenta Reversión de deterioro y desvalorización de bienes no concesionados, representa el 0,00% del total del Ingresos, que comparado al periodo anterior genera una variación absoluta de 0 000,00 que corresponde a un Aumento del 0,00% de recursos disponibles."]
["4.9.3.02.","Reversión de deterioro y desvalorización de bienes concesionados",null,{"$f":"IFERROR(VLOOKUP(A115,BC_ACTUAL!B:G,6,0)/1000,0)","v":0},{"$f":"IFERROR(VLOOKUP(A115,BC_ANTERIOR!B:G,6,0)/1000,0)","v":0},null,0,0,0,0,null,"La cuenta Reversión de deterioro y desvalorización de bienes concesionados, representa el 0,00% del total del Ingresos, que comparado al periodo anterior genera una variación absoluta de 0 000,00 que corresponde a un Aumento del 0,00% de recursos disponibles."]
["4.9.3.03.","Reversión de deterioro y desvalorización de inventarios por materiales y suministros para consumo y prestación de servicios ",null,{"$f":"IFERROR(VLOOKUP(A116,BC_ACTUAL!B:G,6,0)/1000,0)","v":0},{"$f":"IFERROR(VLOOKUP(A116,BC_ANTERIOR!B:G,6,0)/1000,0)","v":0},null,0,0,0,0,null,"La cuenta Reversión de deterioro y desvalorización de inventarios por materiales y suministros para consumo y prestación de servicios , representa el 0,00% del total del Ingresos, que comparado al periodo anterior genera una variación absoluta de 0 000,00 que corresponde a un Aumento del 0,00% de recursos disponibles."]
["4.9.3.04.","Reversión de deterioro y desvalorización de inventarios por bienes para la venta",null,{"$f":"IFERROR(VLOOKUP(A117,BC_ACTUAL!B:G,6,0)/1000,0)","v":0},{"$f":"IFERROR(VLOOKUP(A117,BC_ANTERIOR!B:G,6,0)/1000,0)","v":0},null,0,0,0,0,null,"La cuenta Reversión de deterioro y desvalorización de inventarios por bienes para la venta, representa el 0,00% del total del Ingresos, que comparado al periodo anterior genera una variación absoluta de 0 000,00 que corresponde a un Aumento del 0,00% de recursos disponibles."]
["4.9.3.05.","Reversión de deterioro y desvalorización de inventarios por materias primas y bienes en producción",null,{"$f":"IFERROR(VLOOKUP(A118,BC_ACTUAL!B:G,6,0)/1000,0)","v":0},{"$f":"IFERROR(VLOOKUP(A118,BC_ANTERIOR!B:G,6,0)/1000,0)","v":0},null,0,0,0,0,null,"La cuenta Reversión de deterioro y desvalorización de inventarios por materias primas y bienes en producción, representa el 0,00% del total del Ingresos, que comparado al periodo anterior genera una variación absoluta de 0 000,00 que corresponde a un Aumento del 0,00% de recursos disponibles."]
["4.9.4.","Recuperación de previsiones","55",{"$f":"SUM(D120:D122)","v":0},{"$f":"SUM(E120:E122)","v":0},null,0,0,0,0,null,"La cuenta Recuperación de previsiones, representa el 0,00% del total del Ingresos, que comparado al periodo anterior genera una variación absoluta de 0 000,00 que corresponde a un Aumento del 0,00% de recursos disponibles."]
["4.9.4.01.","Recuperación de previsiones para deterioro de inversiones",null,{"$f":"IFERROR(VLOOKUP(A120,BC_ACTUAL!B:G,6,0)/1000,0)","v":0},{"$f":"IFERROR(VLOOKUP(A120,BC_ANTERIOR!B:G,6,0)/1000,0)","v":0},null,0,0,0,0,null,"La cuenta Recuperación de previsiones para deterioro de inversiones, representa el 0,00% del total del Ingresos, que comparado al periodo anterior genera una variación absoluta de 0 000,00 que corresponde a un Aumento del 0,00% de recursos disponibles."]
["4.9.4.02.","Recuperación de previsiones para deterioro de cuentas a cobrar",null,{"$f":"IFERROR(VLOOKUP(A121,BC_ACTUAL!B:G,6,0)/1000,0)","v":0},{"$f":"IFERROR(VLOOKUP(A121,BC_ANTERIOR!B:G,6,0)/1000,0)","v":0},null,0,0,0,0,null,"La cuenta Recuperación de previsiones para deterioro de cuentas a cobrar, representa el 0,00% del total del Ingresos, que comparado al periodo anterior genera una variación absoluta de 0 000,00 que corresponde a un Aumento del 0,00% de recursos disponibles."]
["4.9.4.03.","Recuperación de previsiones para deterioro y pérdidas de inventarios",null,{"$f":"IFERROR(VLOOKUP(A122,BC_ACTUAL!B:G,6,0)/1000,0)","v":0},{"$f":"IFERROR(VLOOKUP(A122,BC_ANTERIOR!B:G,6,0)/1000,0)","v":0},null,0,0,0,0,null,"La cuenta Recuperación de previsiones para deterioro y pérdidas de inventarios, representa el 0,00% del total del Ingresos, que comparado al periodo anterior genera una variación absoluta de 0 000,00 que corresponde a un Aumento del 0,00% de recursos disponibles."]
["4.9.5.","Recuperación de provisiones y reservas técnicas","56",{"$f":"SUM(D124:D127)","v":0},{"$f":"SUM(E124:E127)","v":0},null,0,0,0,0,null,"La cuenta Recuperación de provisiones y reservas técnicas, representa el 0,00% del total del Ingresos, que comparado al periodo anterior genera una variación absoluta de 0 000,00 que corresponde a un Aumento del 0,00% de recursos disponibles."]
["4.9.5.01.","Recuperación de provisiones para litigios y demandas",null,{"$f":"IFERROR(VLOOKUP(A124,BC_ACTUAL!B:G,6,0)/1000,0)","v":0},{"$f":"IFERROR(VLOOKUP(A124,BC_ANTERIOR!B:G,6,0)/1000,0)","v":0},null,0,0,0,0,null,"La cuenta Recuperación de provisiones para litigios y demandas, representa el 0,00% del total del Ingresos, que comparado al periodo anterior genera una variación absoluta de 0 000,00 que corresponde a un Aumento del 0,00% de recursos disponibles."]
["4.9.5.02.","Recuperación de provisiones para reestructuración",null,{"$f":"IFERROR(VLOOKUP(A125,BC_ACTUAL!B:G,6,0)/1000,0)","v":0},{"$f":"IFERROR(VLOOKUP(A125,BC_ANTERIOR!B:G,6,0)/1000,0)","v":0},null,0,0,0,0,null,"La cuenta Recuperación de provisiones para reestructuración, representa el 0,00% del total del Ingresos, que comparado al periodo anterior genera una variación absoluta de 0 000,00 que corresponde a un Aumento del 0,00% de recursos disponibles."]
["4.9.5.03.","Recuperación de provisiones para beneficios a los empleados",null,{"$f":"IFERROR(VLOOKUP(A126,BC_ACTUAL!B:G,6,0)/1000,0)","v":0},{"$f":"IFERROR(VLOOKUP(A126,BC_ANTERIOR!B:G,6,0)/1000,0)","v":0},null,0,0,0,0,null,"La cuenta Recuperación de provisiones para beneficios a los empleados, representa el 0,00% del total del Ingresos, que comparado al periodo anterior genera una variación absoluta de 0 000,00 que corresponde a un Aumento del 0,00% de recursos disponibles."]
["4.9.5.99.","Recuperación de otras provisiones y reservas técnicas",null,{"$f":"IFERROR(VLOOKUP(A127,BC_ACTUAL!B:G,6,0)/1000,0)","v":0},{"$f":"IFERROR(VLOOKUP(A127,BC_ANTERIOR!B:G,6,0)/1000,0)","v":0},null,0,0,0,0,null,"La cuenta Recuperación de otras provisiones y reservas técnicas, representa el 0,00% del total del Ingresos, que comparado al periodo anterior genera una variación absoluta de 0 000,00 que corresponde a un Aumento del 0,00% de recursos disponibles."]
["4.9.6.","Resultados positivos de inversiones patrimoniales y participación de los intereses minoritarios","57",{"$f":"SUM(D129:D130)","v":0},{"$f":"SUM(E129:E130)","v":0},null,0,0,0,0,null,"La cuenta Resultados positivos de inversiones patrimoniales y participación de los intereses minoritarios, representa el 0,00% del total del Ingresos, que comparado al periodo anterior genera una variación absoluta de 0 000,00 que corresponde a un Aumento del 0,00% de recursos disponibles."]
["4.9.6.01.","Resultados positivos de inversiones patrimoniales",null,{"$f":"IFERROR(VLOOKUP(A129,BC_ACTUAL!B:G,6,0)/1000,0)","v":0},{"$f":"IFERROR(VLOOKUP(A129,BC_ANTERIOR!B:G,6,0)/1000,0)","v":0},null,0,0,0,0,null,"La cuenta Resultados positivos de inversiones patrimoniales, representa el 0,00% del total del Ingresos, que comparado al periodo anterior genera una variación absoluta de 0 000,00 que corresponde a un Aumento del 0,00% de recursos disponibles."]
["4.9.6.02.","Participación de los intereses minoritarios en el resultado neto negativo",null,{"$f":"IFERROR(VLOOKUP(A130,BC_ACTUAL!B:G,6,0)/1000,0)","v":0},{"$f":"IFERROR(VLOOKUP(A130,BC_ANTERIOR!B:G,6,0)/1000,0)","v":0},null,0,0,0,0,null,"La cuenta Participación de los intereses minoritarios en el resultado neto negativo, representa el 0,00% del total del Ingresos, que comparado al periodo anterior genera una variación absoluta de 0 000,00 que corresponde a un Aumento del 0,00% de recursos disponibles."]
["4.9.9.","Otros ingresos y resultados positivos","58",{"$f":"SUM(D132)","v":0},{"$f":"SUM(E132)","v":0},null,0,0,0,0,null,"La cuenta Otros ingresos y resultados positivos, representa el 0,00% del total del Ingresos, que comparado al periodo anterior genera una variación absoluta de 0 000,00 que corresponde a un Aumento del 0,00% de recursos disponibles."]
["4.9.9.99.","Ingresos y resultados positivos varios",null,{"$f":"IFERROR(VLOOKUP(A132,BC_ACTUAL!B:G,6,0)/1000,0)","v":0},{"$f":"IFERROR(VLOOKUP(A132,BC_ANTERIOR!B:G,6,0)/1000,0)","v":0},null,0,0,0,0,null,"La cuenta Ingresos y resultados positivos varios, representa el 0,00% del total del Ingresos, que comparado al periodo anterior genera una variación absoluta de 0 000,00 que corresponde a un Aumento del 0,00% de recursos disponibles."]
[null,"TOTAL DE INGRESOS",null,{"$f":"+D131+D128+D123+D119+D113+D110+D103+D98+D94+D86+D82+D78+D75+D64+D61+D57+D54+D51+D45+D40+D37+D33+D30+D26+D22+D15+D10","v":0},{"$f":"+E131+E128+E123+E119+E113+E110+E103+E98+E94+E86+E82+E78+E75+E64+E61+E57+E54+E51+E45+E40+E37+E33+E30+E26+E22+E15+E10","v":0},null,{"$f":"+G131+G128+G123+G119+G113+G110+G103+G98+G94+G86+G82+G78+G75+G64+G61+G57+G54+G51+G45+G40+G37+G33+G30+G26+G22+G15+G10","v":0},{"$f":"+H131+H128+H123+H119+H113+H110+H103+H98+H94+H86+H82+H78+H75+H64+H61+H57+H54+H51+H45+H40+H37+H33+H30+H26+H22+H15+H10","v":0},{"$f":"IFERROR(D133-E133,0)","v":0},0]
[]
["5.","GASTOS"]
["5.1.","Gastos de funcionamiento"]
["5.1.1.","Gastos en personal","59",{"$f":"SUM(D138:D145)","v":0},{"$f":"SUM(E138:E145)","v":0},null,{"$f":"IFERROR(D137/$D$232,0)","v":0},{"$f":"IFERROR(E137/$E$232,0)","v":0},{"$f":"IFERROR(D137-E137,0)","v":0},0,null,"La cuenta Gastos en personal, representa el 0,00% del total del Gastos, que comparado al periodo anterior genera una variación absoluta de 0 000,00 que corresponde a un Aumento del 0,00% de recursos disponibles."]
["5.1.1.01.","Remuneraciones Básicas",null,{"$f":"IFERROR(VLOOKUP(A138,BC_ACTUAL!B:G,6,0)/1000,0)","v":0},{"$f":"IFERROR(VLOOKUP(A138,BC_ANTERIOR!B:G,6,0)/1000,0)","v":0},null,{"$f":"IFERROR(D138/$D$232,0)","v":0},{"$f":"IFERROR(E138/$E$232,0)","v":0},0,0,null,"La cuenta Remuneraciones Básicas, representa el 0,00% del total del Gastos, que comparado al periodo anterior genera una variación absoluta de 0 000,00 que corresponde a un Aumento del 0,00% de recursos disponibles."]
["5.1.1.02.","Remuneraciones eventuales",null,{"$f":"IFERROR(VLOOKUP(A139,BC_ACTUAL!B:G,6,0)/1000,0)","v":0},{"$f":"IFERROR(VLOOKUP(A139,BC_ANTERIOR!B:G,6,0)/1000,0)","v":0},null,{"$f":"IFERROR(D139/$D$232,0)","v":0},{"$f":"IFERROR(E139/$E$232,0)","v":0},0,0,null,"La cuenta Remuneraciones eventuales, representa el 0,00% del total del Gastos, que comparado al periodo anterior genera una variación absoluta de 0 000,00 que corresponde a un Aumento del 0,00% de recursos disponibles."]
["5.1.1.03.","Incentivos salariales",null,{"$f":"IFERROR(VLOOKUP(A140,BC_ACTUAL!B:G,6,0)/1000,0)","v":0},{"$f":"IFERROR(VLOOKUP(A140,BC_ANTERIOR!B:G,6,0)/1000,0)","v":0},null,0,{"$f":"IFERROR(E140/$E$232,0)","v":0},{"$f":"IFERROR(D140-E140,0)","v":0},{"$f":"IFERROR(I140/E140,0)","v":0},null,{"$f":"\"La\"&\" \"&\"cuenta\"&\" \"&B140&\",\"&\" \"&\"representa\"&\" \"&\"el\"&\" \"&TEXT(G140,\"0,00%\")&\" \"&\"del\"&\" \"&\"total\"&\" \"&\"del\"&\" \"&IF(MID(A140,1,2)=\"1.\",\"Activo\",IF(MID(A140,1,2)=\"2.\",\"Pasivo\",IF(MID(A140,1,2)=\"3.\",\"Capital\",IF(MID(A140,1,2)=\"4.\",\"Ingresos\",IF(MID(A140,1,2)=\"5.\",\"Gastos\",\"\")))))&\",\"&\" \"&\"que\"&\" \"&\"comparado\"&\" \"&\"al\"&\" \"&\"periodo\"&\" \"&\"anterior\"&\" \"&\"genera\"&\" \"&\"una\"&\" \"&\"variación\"&\" \"&\"absoluta\"&\" \"&\"de\"&\" \"&TEXT(I140,\"0 000,00\")&\" \"&\"que\"&\" \"&\"corresponde\"&\" \"&\"a\"&\" \"&\"un\"&\" \"&IF(I140<0,\"Disminución\",\"Aumento\")&\" \"&\"del\"&\" \"&TEXT(J140,\"0,00%\")&\" \"&\"de\"&\" \"&\"recursos\"&\" \"&\"disponibles\"&\".\"","v":"La cuenta Incentivos salariales, representa el 0,00% del total del Gastos, que comparado al periodo anterior genera una variación absoluta de 0 000,00 que corresponde a un Aumento del 0,00% de recursos disponibles."}]
["5.1.1.04.","Contribuciones patronales al desarrollo y la seguridad social",null,{"$f":"IFERROR(VLOOKUP(A141,BC_ACTUAL!B:G,6,0)/1000,0)","v":0},{"$f":"IFERROR(VLOOKUP(A141,BC_ANTERIOR!B:G,6,0)/1000,0)","v":0},null,0,{"$f":"IFERROR(E141/$E$232,0)","v":0},0,{"$f":"IFERROR(I141/E141,0)","v":0},null,"La cuenta Contribuciones patronales al desarrollo y la seguridad social, representa el 0,00% del total del Gastos, que comparado al periodo anterior genera una variación absoluta de 0 000,00 que corresponde a un Aumento del 0,00% de recursos disponibles."]
["5.1.1.05.","Contribuciones patronales a fondos de pensiones y a otros fondos de capitalización",null,{"$f":"IFERROR(VLOOKUP(A142,BC_ACTUAL!B:G,6,0)/1000,0)","v":0},{"$f":"IFERROR(VLOOKUP(A142,BC_ANTERIOR!B:G,6,0)/1000,0)","v":0},null,0,{"$f":"IFERROR(E142/$E$232,0)","v":0},0,0,null,"La cuenta Contribuciones patronales a fondos de pensiones y a otros fondos de capitalización, representa el 0,00% del total del Gastos, que comparado al periodo anterior genera una variación absoluta de 0 000,00 que corresponde a un Aumento del 0,00% de recursos disponibles."]
["5.1.1.06.","Asistencia social y beneficios al personal",null,{"$f":"IFERROR(VLOOKUP(A143,BC_ACTUAL!B:G,6,0)/1000,0)","v":0},{"$f":"IFERROR(VLOOKUP(A143,BC_ANTERIOR!B:G,6,0)/1000,0)","v":0},null,0,0,0,0,null,"La cuenta Asistencia social y beneficios al personal, representa el 0,00% del total del Gastos, que comparado al periodo anterior genera una variación absoluta de 0 000,00 que corresponde a un Aumento del 0,00% de recursos disponibles."]
["5.1.1.07.","Contribuciones estatales a la seguridad social",null,{"$f":"IFERROR(VLOOKUP(A144,BC_ACTUAL!B:G,6,0)/1000,0)","v":0},{"$f":"IFERROR(VLOOKUP(A144,BC_ANTERIOR!B:G,6,0)/1000,0)","v":0},null,0,0,0,0,null,"La cuenta Contribuciones estatales a la seguridad social, representa el 0,00% del total del Gastos, que comparado al periodo anterior genera una variación absoluta de 0 000,00 que corresponde a un Aumento del 0,00% de recursos disponibles."]
["5.1.1.99.","Otros gastos en personal",null,{"$f":"IFERROR(VLOOKUP(A145,BC_ACTUAL!B:G,6,0)/1000,0)","v":0},{"$f":"IFERROR(VLOOKUP(A145,BC_ANTERIOR!B:G,6,0)/1000,0)","v":0},null,0,0,0,0,null,"La cuenta Otros gastos en personal, representa el 0,00% del total del Gastos, que comparado al periodo anterior genera una variación absoluta de 0 000,00 que corresponde a un Aumento del 0,00% de recursos disponibles."]
["5.1.2.","Servicios","60",{"$f":"SUM(D147:D155)","v":0},{"$f":"SUM(E147:E155)","v":0},null,{"$f":"IFERROR(D146/$D$232,0)","v":0},0,0,0,null,"La cuenta Servicios, representa el 0,00% del total del Gastos, que comparado al periodo anterior genera una variación absoluta de 0 000,00 que corresponde a un Aumento del 0,00% de recursos disponibles."]
["5.1.2.01.","Alquileres y derechos sobre bienes",null,{"$f":"IFERROR(VLOOKUP(A147,BC_ACTUAL!B:G,6,0)/1000,0)","v":0},{"$f":"IFERROR(VLOOKUP(A147,BC_ANTERIOR!B:G,6,0)/1000,0)","v":0},null,{"$f":"IFERROR(D147/$D$232,0)","v":0},0,0,0,null,"La cuenta Alquileres y derechos sobre bienes, representa el 0,00% del total del Gastos, que comparado al periodo anterior genera una variación absoluta de 0 000,00 que corresponde a un Aumento del 0,00% de recursos disponibles."]
["5.1.2.02.","Servicios básicos",null,{"$f":"IFERROR(VLOOKUP(A148,BC_ACTUAL!B:G,6,0)/1000,0)","v":0},{"$f":"IFERROR(VLOOKUP(A148,BC_ANTERIOR!B:G,6,0)/1000,0)","v":0},null,0,0,0,0,null,"La cuenta Servicios básicos, representa el 0,00% del total del Gastos, que comparado al periodo anterior genera una variación absoluta de 0 000,00 que corresponde a un Aumento del 0,00% de recursos disponibles."]
["5.1.2.03.","Servicios comerciales y financieros",null,{"$f":"IFERROR(VLOOKUP(A149,BC_ACTUAL!B:G,6,0)/1000,0)","v":0},{"$f":"IFERROR(VLOOKUP(A149,BC_ANTERIOR!B:G,6,0)/1000,0)","v":0},null,0,0,0,0,null,"La cuenta Servicios comerciales y financieros, representa el 0,00% del total del Gastos, que comparado al periodo anterior genera una variación absoluta de 0 000,00 que corresponde a un Aumento del 0,00% de recursos disponibles."]
["5.1.2.04.","Servicios de gestión y apoyo",null,{"$f":"IFERROR(VLOOKUP(A150,BC_ACTUAL!B:G,6,0)/1000,0)","v":0},{"$f":"IFERROR(VLOOKUP(A150,BC_ANTERIOR!B:G,6,0)/1000,0)","v":0},null,0,0,0,0,null,"La cuenta Servicios de gestión y apoyo, representa el 0,00% del total del Gastos, que comparado al periodo anterior genera una variación absoluta de 0 000,00 que corresponde a un Aumento del 0,00% de recursos disponibles."]
["5.1.2.05.","Gastos de viaje y transporte",null,{"$f":"IFERROR(VLOOKUP(A151,BC_ACTUAL!B:G,6,0)/1000,0)","v":0},{"$f":"IFERROR(VLOOKUP(A151,BC_ANTERIOR!B:G,6,0)/1000,0)","v":0},null,0,0,0,0,null,"La cuenta Gastos de viaje y transporte, representa el 0,00% del total del Gastos, que comparado al periodo anterior genera una variación absoluta de 0 000,00 que corresponde a un Aumento del 0,00% de recursos disponibles."]
["5.1.2.06.","Seguros, reaseguros y otras obligaciones",null,{"$f":"IFERROR(VLOOKUP(A152,BC_ACTUAL!B:G,6,0)/1000,0)","v":0},{"$f":"IFERROR(VLOOKUP(A152,BC_ANTERIOR!B:G,6,0)/1000,0)","v":0},null,0,0,0,0,null,"La cuenta Seguros, reaseguros y otras obligaciones, representa el 0,00% del total del Gastos, que comparado al periodo anterior genera una variación absoluta de 0 000,00 que corresponde a un Aumento del 0,00% de recursos disponibles."]
["5.1.2.07.","Capacitación y protocolo",null,{"$f":"IFERROR(VLOOKUP(A153,BC_ACTUAL!B:G,6,0)/1000,0)","v":0},{"$f":"IFERROR(VLOOKUP(A153,BC_ANTERIOR!B:G,6,0)/1000,0)","v":0},null,0,0,0,0,null,"La cuenta Capacitación y protocolo, representa el 0,00% del total del Gastos, que comparado al periodo anterior genera una variación absoluta de 0 000,00 que corresponde a un Aumento del 0,00% de recursos disponibles."]
["5.1.2.08.","Mantenimiento y reparaciones",null,{"$f":"IFERROR(VLOOKUP(A154,BC_ACTUAL!B:G,6,0)/1000,0)","v":0},{"$f":"IFERROR(VLOOKUP(A154,BC_ANTERIOR!B:G,6,0)/1000,0)","v":0},null,0,0,0,0,null,"La cuenta Mantenimiento y reparaciones, representa el 0,00% del total del Gastos, que comparado al periodo anterior genera una variación absoluta de 0 000,00 que corresponde a un Aumento del 0,00% de recursos disponibles."]
["5.1.2.99.","Otros servicios",null,{"$f":"IFERROR(VLOOKUP(A155,BC_ACTUAL!B:G,6,0)/1000,0)","v":0},{"$f":"IFERROR(VLOOKUP(A155,BC_ANTERIOR!B:G,6,0)/1000,0)","v":0},null,0,0,0,0,null,"La cuenta Otros servicios, representa el 0,00% del total del Gastos, que comparado al periodo anterior genera una variación absoluta de 0 000,00 que corresponde a un Aumento del 0,00% de recursos disponibles."]
["5.1.3.","Materiales y suministros consumidos","61",{"$f":"SUM(D157:D161)","v":0},{"$f":"SUM(E157:E161)","v":0},null,{"$f":"IFERROR(D156/$D$232,0)","v":0},0,0,0,null,"La cuenta Materiales y suministros consumidos, representa el 0,00% del total del Gastos, que comparado al periodo anterior genera una variación absoluta de 0 000,00 que corresponde a un Aumento del 0,00% de recursos disponibles."]
["5.1.3.01.","Productos químicos y conexos",null,{"$f":"IFERROR(VLOOKUP(A157,BC_ACTUAL!B:G,6,0)/1000,0)","v":0},{"$f":"IFERROR(VLOOKUP(A157,BC_ANTERIOR!B:G,6,0)/1000,0)","v":0},null,0,0,0,0,null,"La cuenta Productos químicos y conexos, representa el 0,00% del total del Gastos, que comparado al periodo anterior genera una variación absoluta de 0 000,00 que corresponde a un Aumento del 0,00% de recursos disponibles."]
["5.1.3.02.","Alimentos y productos agropecuarios",null,{"$f":"IFERROR(VLOOKUP(A158,BC_ACTUAL!B:G,6,0)/1000,0)","v":0},{"$f":"IFERROR(VLOOKUP(A158,BC_ANTERIOR!B:G,6,0)/1000,0)","v":0},null,{"$f":"IFERROR(D158/$D$232,0)","v":0},0,0,0,null,"La cuenta Alimentos y productos agropecuarios, representa el 0,00% del total del Gastos, que comparado al periodo anterior genera una variación absoluta de 0 000,00 que corresponde a un Aumento del 0,00% de recursos disponibles."]
["5.1.3.03.","Materiales y productos de uso en la construcción y mantenimiento",null,{"$f":"IFERROR(VLOOKUP(A159,BC_ACTUAL!B:G,6,0)/1000,0)","v":0},{"$f":"IFERROR(VLOOKUP(A159,BC_ANTERIOR!B:G,6,0)/1000,0)","v":0},null,0,0,0,0,null,"La cuenta Materiales y productos de uso en la construcción y mantenimiento, representa el 0,00% del total del Gastos, que comparado al periodo anterior genera una variación absoluta de 0 000,00 que corresponde a un Aumento del 0,00% de recursos disponibles."]
["5.1.3.04.","Herramientas, repuestos y accesorios",null,{"$f":"IFERROR(VLOOKUP(A160,BC_ACTUAL!B:G,6,0)/1000,0)","v":0},{"$f":"IFERROR(VLOOKUP(A160,BC_ANTERIOR!B:G,6,0)/1000,0)","v":0},null,0,0,0,0,null,"La cuenta Herramientas, repuestos y accesorios, representa el 0,00% del total del Gastos, que comparado al periodo anterior genera una variación absoluta de 0 000,00 que corresponde a un Aumento del 0,00% de recursos disponibles."]
["5.1.3.99.","Útiles, materiales y suministros diversos",null,{"$f":"IFERROR(VLOOKUP(A161,BC_ACTUAL!B:G,6,0)/1000,0)","v":0},{"$f":"IFERROR(VLOOKUP(A161,BC_ANTERIOR!B:G,6,0)/1000,0)","v":0},null,0,0,0,0,null,"La cuenta Útiles, materiales y suministros diversos, representa el 0,00% del total del Gastos, que comparado al periodo anterior genera una variación absoluta de 0 000,00 que corresponde a un Aumento del 0,00% de recursos disponibles."]
["5.1.4.","Consumo de bienes distintos de inventarios","62",{"$f":"SUM(D163:D164)","v":0},{"$f":"SUM(E163:E164)","v":0},null,0,0,0,0,null,"La cuenta Consumo de bienes distintos de inventarios, representa el 0,00% del total del Gastos, que comparado al periodo anterior genera una variación absoluta de 0 000,00 que corresponde a un Aumento del 0,00% de recursos disponibles."]
["5.1.4.01.","Consumo de bienes no concesionados",null,{"$f":"IFERROR(VLOOKUP(A163,BC_ACTUAL!B:G,6,0)/1000,0)","v":0},{"$f":"IFERROR(VLOOKUP(A163,BC_ANTERIOR!B:G,6,0)/1000,0)","v":0},null,0,0,0,0,null,"La cuenta Consumo de bienes no concesionados, representa el 0,00% del total del Gastos, que comparado al periodo anterior genera una variación absoluta de 0 000,00 que corresponde a un Aumento del 0,00% de recursos disponibles."]
["5.1.4.02.","Consumo de bienes concesionados",null,{"$f":"IFERROR(VLOOKUP(A164,BC_ACTUAL!B:G,6,0)/1000,0)","v":0},{"$f":"IFERROR(VLOOKUP(A164,BC_ANTERIOR!B:G,6,0)/1000,0)","v":0},null,0,0,0,0,null,"La cuenta Consumo de bienes concesionados, representa el 0,00% del total del Gastos, que comparado al periodo anterior genera una variación absoluta de 0 000,00 que corresponde a un Aumento del 0,00% de recursos disponibles."]
["5.1.5.","Pérdidas por deterioro y desvalorización de bienes ","63",{"$f":"SUM(D166:D167)","v":0},{"$f":"SUM(E166:E167)","v":0},null,0,0,0,0,null,"La cuenta Pérdidas por deterioro y desvalorización de bienes , representa el 0,00% del total del Gastos, que comparado al periodo anterior genera una variación absoluta de 0 000,00 que corresponde a un Aumento del 0,00% de recursos disponibles."]
["5.1.5.01.","Deterioro y desvalorización de bienes no concesionados",null,{"$f":"IFERROR(VLOOKUP(A166,BC_ACTUAL!B:G,6,0)/1000,0)","v":0},{"$f":"IFERROR(VLOOKUP(A166,BC_ANTERIOR!B:G,6,0)/1000,0)","v":0},null,0,0,0,0,null,"La cuenta Deterioro y desvalorización de bienes no concesionados, representa el 0,00% del total del Gastos, que comparado al periodo anterior genera una variación absoluta de 0 000,00 que corresponde a un Aumento del 0,00% de recursos disponibles."]
["5.1.5.02.","Deterioro y desvalorización de bienes concesionados",null,{"$f":"IFERROR(VLOOKUP(A167,BC_ACTUAL!B:G,6,0)/1000,0)","v":0},{"$f":"IFERROR(VLOOKUP(A167,BC_ANTERIOR!B:G,6,0)/1000,0)","v":0},null,0,0,0,0,null,"La cuenta Deterioro y desvalorización de bienes concesionados, representa el 0,00% del total del Gastos, que comparado al periodo anterior genera una variación absoluta de 0 000,00 que corresponde a un Aumento del 0,00% de recursos disponibles."]
["5.1.6.","Deterioro y pérdidas de inventarios","64",{"$f":"SUM(D169:D171)","v":0},{"$f":"SUM(E169:E171)","v":0},null,0,0,0,0,null,"La cuenta Deterioro y pérdidas de inventarios, representa el 0,00% del total del Gastos, que comparado al periodo anterior genera una variación absoluta de 0 000,00 que corresponde a un Aumento del 0,00% de recursos disponibles."]
["5.1.6.01.","Deterioro y pérdidas de inventarios por materiales y suministros para consumo y prestación de servicios",null,{"$f":"IFERROR(VLOOKUP(A169,BC_ACTUAL!B:G,6,0)/1000,0)","v":0},{"$f":"IFERROR(VLOOKUP(A169,BC_ANTERIOR!B:G,6,0)/1000,0)","v":0},null,0,0,0,0,null,"La cuenta Deterioro y pérdidas de inventarios por materiales y suministros para consumo y prestación de servicios, representa el 0,00% del total del Gastos, que comparado al periodo anterior genera una variación absoluta de 0 000,00 que corresponde a un Aumento del 0,00% de recursos disponibles."]
["5.1.6.02.","Deterioro y pérdidas de inventarios por bienes para la venta",null,{"$f":"IFERROR(VLOOKUP(A170,BC_ACTUAL!B:G,6,0)/1000,0)","v":0},{"$f":"IFERROR(VLOOKUP(A170,BC_ANTERIOR!B:G,6,0)/1000,0)","v":0},null,0,0,0,0,null,"La cuenta Deterioro y pérdidas de inventarios por bienes para la venta, representa el 0,00% del total del Gastos, que comparado al periodo anterior genera una variación absoluta de 0 000,00 que corresponde a un Aumento del 0,00% de recursos disponibles."]
["5.1.6.03.","Deterioro y pérdidas de inventarios por materias primas y bienes en producción",null,{"$f":"IFERROR(VLOOKUP(A171,BC_ACTUAL!B:G,6,0)/1000,0)","v":0},{"$f":"IFERROR(VLOOKUP(A171,BC_ANTERIOR!B:G,6,0)/1000,0)","v":0},null,0,0,0,0,null,"La cuenta Deterioro y pérdidas de inventarios por materias primas y bienes en producción, representa el 0,00% del total del Gastos, que comparado al periodo anterior genera una variación absoluta de 0 000,00 que corresponde a un Aumento del 0,00% de recursos disponibles."]
["5.1.7.","Deterioro de inversiones y cuentas a cobrar","65",{"$f":"SUM(D173:D174)","v":0},{"$f":"SUM(E173:E174)","v":0},null,0,0,0,0,null,"La cuenta Deterioro de inversiones y cuentas a cobrar, representa el 0,00% del total del Gastos, que comparado al periodo anterior genera una variación absoluta de 0 000,00 que corresponde a un Aumento del 0,00% de recursos disponibles."]
["5.1.7.01.","Deterioro de inversiones",null,{"$f":"IFERROR(VLOOKUP(A173,BC_ACTUAL!B:G,6,0)/1000,0)","v":0},{"$f":"IFERROR(VLOOKUP(A173,BC_ANTERIOR!B:G,6,0)/1000,0)","v":0},null,0,0,0,0,null,"La cuenta Deterioro de inversiones, representa el 0,00% del total del Gastos, que comparado al periodo anterior genera una variación absoluta de 0 000,00 que corresponde a un Aumento del 0,00% de recursos disponibles."]
["5.1.7.02.","Deterioro de cuentas a cobrar",null,{"$f":"IFERROR(VLOOKUP(A174,BC_ACTUAL!B:G,6,0)/1000,0)","v":0},{"$f":"IFERROR(VLOOKUP(A174,BC_ANTERIOR!B:G,6,0)/1000,0)","v":0},null,0,0,0,0,null,"La cuenta Deterioro de cuentas a cobrar, representa el 0,00% del total del Gastos, que comparado al periodo anterior genera una variación absoluta de 0 000,00 que corresponde a un Aumento del 0,00% de recursos disponibles."]
["5.1.8.","Cargos por provisiones y reservas técnicas","66",{"$f":"SUM(D176:D179)","v":0},{"$f":"SUM(E176:E179)","v":0},null,0,0,0,0,null,"La cuenta Cargos por provisiones y reservas técnicas, representa el 0,00% del total del Gastos, que comparado al periodo anterior genera una variación absoluta de 0 000,00 que corresponde a un Aumento del 0,00% de recursos disponibles."]
["5.1.8.01.","Cargos por litigios y demandas",null,{"$f":"IFERROR(VLOOKUP(A176,BC_ACTUAL!B:G,6,0)/1000,0)","v":0},{"$f":"IFERROR(VLOOKUP(A176,BC_ANTERIOR!B:G,6,0)/1000,0)","v":0},null,{"$f":"IFERROR(D176/$D$232,0)","v":0},0,0,0,null,"La cuenta Cargos por litigios y demandas, representa el 0,00% del total del Gastos, que comparado al periodo anterior genera una variación absoluta de 0 000,00 que corresponde a un Aumento del 0,00% de recursos disponibles."]
["5.1.8.02.","Cargos por reestructuración",null,{"$f":"IFERROR(VLOOKUP(A177,BC_ACTUAL!B:G,6,0)/1000,0)","v":0},{"$f":"IFERROR(VLOOKUP(A177,BC_ANTERIOR!B:G,6,0)/1000,0)","v":0},null,0,0,0,0,null,"La cuenta Cargos por reestructuración, representa el 0,00% del total del Gastos, que comparado al periodo anterior genera una variación absoluta de 0 000,00 que corresponde a un Aumento del 0,00% de recursos disponibles."]
["5.1.8.03.","Cargos por beneficios a los empleados",null,{"$f":"IFERROR(VLOOKUP(A178,BC_ACTUAL!B:G,6,0)/1000,0)","v":0},{"$f":"IFERROR(VLOOKUP(A178,BC_ANTERIOR!B:G,6,0)/1000,0)","v":0},null,0,0,0,0,null,"La cuenta Cargos por beneficios a los empleados, representa el 0,00% del total del Gastos, que comparado al periodo anterior genera una variación absoluta de 0 000,00 que corresponde a un Aumento del 0,00% de recursos disponibles."]
["5.1.8.99.","Cargos por otras provisiones y reservas técnicas",null,{"$f":"IFERROR(VLOOKUP(A179,BC_ACTUAL!B:G,6,0)/1000,0)","v":0},{"$f":"IFERROR(VLOOKUP(A179,BC_ANTERIOR!B:G,6,0)/1000,0)","v":0},null,0,0,0,0,null,"La cuenta Cargos por otras provisiones y reservas técnicas, representa el 0,00% del total del Gastos, que comparado al periodo anterior genera una variación absoluta de 0 000,00 que corresponde a un Aumento del 0,00% de recursos disponibles."]
["5.2.","Gastos financieros",null,null,null,null,null,0]
["5.2.1.","Intereses sobre endeudamiento público","67",{"$f":"SUM(D182:D185)","v":0},{"$f":"SUM(E182:E185)","v":0},null,0,0,{"$f":"IFERROR(D181-E181,0)","v":0},0,null,"La cuenta Intereses sobre endeudamiento público, representa el 0,00% del total del Gastos, que comparado al periodo anterior genera una variación absoluta de 0 000,00 que corresponde a un Aumento del 0,00% de recursos disponibles."]
["5.2.1.01.","Intereses sobre títulos y valores de la deuda pública",null,{"$f":"IFERROR(VLOOKUP(A182,BC_ACTUAL!B:G,6,0)/1000,0)","v":0},{"$f":"IFERROR(VLOOKUP(A182,BC_ANTERIOR!B:G,6,0)/1000,0)","v":0},null,0,0,0,0,null,"La cuenta Intereses sobre títulos y valores de la deuda pública, representa el 0,00% del total del Gastos, que comparado al periodo anterior genera una variación absoluta de 0 000,00 que corresponde a un Aumento del 0,00% de recursos disponibles."]
["5.2.1.02.","Intereses sobre préstamos",null,{"$f":"IFERROR(VLOOKUP(A183,BC_ACTUAL!B:G,6,0)/1000,0)","v":0},{"$f":"IFERROR(VLOOKUP(A183,BC_ANTERIOR!B:G,6,0)/1000,0)","v":0},null,0,0,0,0,null,"La cuenta Intereses sobre préstamos, representa el 0,00% del total del Gastos, que comparado al periodo anterior genera una variación absoluta de 0 000,00 que corresponde a un Aumento del 0,00% de recursos disponibles."]
["5.2.1.03.","Intereses sobre deudas asumidas",null,{"$f":"IFERROR(VLOOKUP(A184,BC_ACTUAL!B:G,6,0)/1000,0)","v":0},{"$f":"IFERROR(VLOOKUP(A184,BC_ANTERIOR!B:G,6,0)/1000,0)","v":0},null,0,0,0,0,null,"La cuenta Intereses sobre deudas asumidas, representa el 0,00% del total del Gastos, que comparado al periodo anterior genera una variación absoluta de 0 000,00 que corresponde a un Aumento del 0,00% de recursos disponibles."]
["5.2.1.04.","Intereses sobre endeudamiento de Tesorería",null,{"$f":"IFERROR(VLOOKUP(A185,BC_ACTUAL!B:G,6,0)/1000,0)","v":0},{"$f":"IFERROR(VLOOKUP(A185,BC_ANTERIOR!B:G,6,0)/1000,0)","v":0},null,0,0,0,0,null,"La cuenta Intereses sobre endeudamiento de Tesorería, representa el 0,00% del total del Gastos, que comparado al periodo anterior genera una variación absoluta de 0 000,00 que corresponde a un Aumento del 0,00% de recursos disponibles."]
["5.2.9.","Otros gastos financieros","68",{"$f":"SUM(D187:D191)","v":0},{"$f":"SUM(E187:E191)","v":0},null,0,0,0,0,null,"La cuenta Otros gastos financieros, representa el 0,00% del total del Gastos, que comparado al periodo anterior genera una variación absoluta de 0 000,00 que corresponde a un Aumento del 0,00% de recursos disponibles."]
["5.2.9.01.","Intereses por deudas comerciales",null,{"$f":"IFERROR(VLOOKUP(A187,BC_ACTUAL!B:G,6,0)/1000,0)","v":0},{"$f":"IFERROR(VLOOKUP(A187,BC_ANTERIOR!B:G,6,0)/1000,0)","v":0},null,0,0,0,0,null,"La cuenta Intereses por deudas comerciales, representa el 0,00% del total del Gastos, que comparado al periodo anterior genera una variación absoluta de 0 000,00 que corresponde a un Aumento del 0,00% de recursos disponibles."]
["5.2.9.02.","Intereses por deudas sociales y fiscales",null,{"$f":"IFERROR(VLOOKUP(A188,BC_ACTUAL!B:G,6,0)/1000,0)","v":0},{"$f":"IFERROR(VLOOKUP(A188,BC_ANTERIOR!B:G,6,0)/1000,0)","v":0},null,0,0,0,0,null,"La cuenta Intereses por deudas sociales y fiscales, representa el 0,00% del total del Gastos, que comparado al periodo anterior genera una variación absoluta de 0 000,00 que corresponde a un Aumento del 0,00% de recursos disponibles."]
["5.2.9.04.","Intereses por documentos a pagar",null,{"$f":"IFERROR(VLOOKUP(A189,BC_ACTUAL!B:G,6,0)/1000,0)","v":0},{"$f":"IFERROR(VLOOKUP(A189,BC_ANTERIOR!B:G,6,0)/1000,0)","v":0},null,0,0,0,0,null,"La cuenta Intereses por documentos a pagar, representa el 0,00% del total del Gastos, que comparado al periodo anterior genera una variación absoluta de 0 000,00 que corresponde a un Aumento del 0,00% de recursos disponibles."]
["5.2.9.06.","Intereses sobre deudas por avales ejecutados",null,{"$f":"IFERROR(VLOOKUP(A190,BC_ACTUAL!B:G,6,0)/1000,0)","v":0},{"$f":"IFERROR(VLOOKUP(A190,BC_ANTERIOR!B:G,6,0)/1000,0)","v":0},null,0,0,0,0,null,"La cuenta Intereses sobre deudas por avales ejecutados, representa el 0,00% del total del Gastos, que comparado al periodo anterior genera una variación absoluta de 0 000,00 que corresponde a un Aumento del 0,00% de recursos disponibles."]
["5.2.9.99.","Otros gastos financieros varios",null,{"$f":"IFERROR(VLOOKUP(A191,BC_ACTUAL!B:G,6,0)/1000,0)","v":0},{"$f":"IFERROR(VLOOKUP(A191,BC_ANTERIOR!B:G,6,0)/1000,0)","v":0},null,0,0,0,0,null,"La cuenta Otros gastos financieros varios, representa el 0,00% del total del Gastos, que comparado al periodo anterior genera una variación absoluta de 0 000,00 que corresponde a un Aumento del 0,00% de recursos disponibles."]
["5.3.","Gastos y resultados negativos por ventas",null,null,null,null,null,{"$f":"IFERROR(E192/$E$232,0)","v":0},null,null,null,"La cuenta Gastos y resultados negativos por ventas, representa el 0,00% del total del Gastos, que comparado al periodo anterior genera una variación absoluta de 0 000,00 que corresponde a un Aumento del 0,00% de recursos disponibles."]
["5.3.1.","Costo de ventas de bienes y servicios","69",{"$f":"SUM(D194:D195)","v":0},{"$f":"SUM(E194:E195)","v":0},null,0,0,{"$f":"IFERROR(D193-E193,0)","v":0},0,null,"La cuenta Costo de ventas de bienes y servicios, representa el 0,00% del total del Gastos, que comparado al periodo anterior genera una variación absoluta de 0 000,00 que corresponde a un Aumento del 0,00% de recursos disponibles."]
["5.3.1.01.","Costo de ventas de bienes",null,{"$f":"IFERROR(VLOOKUP(A194,BC_ACTUAL!B:G,6,0)/1000,0)","v":0},{"$f":"IFERROR(VLOOKUP(A194,BC_ANTERIOR!B:G,6,0)/1000,0)","v":0},null,{"$f":"IFERROR(D194/$D$232,0)","v":0},0,0,0,null,"La cuenta Costo de ventas de bienes, representa el 0,00% del total del Gastos, que comparado al periodo anterior genera una variación absoluta de 0 000,00 que corresponde a un Aumento del 0,00% de recursos disponibles."]
["5.3.1.02.","Costo de ventas de servicios",null,{"$f":"IFERROR(VLOOKUP(A195,BC_ACTUAL!B:G,6,0)/1000,0)","v":0},{"$f":"IFERROR(VLOOKUP(A195,BC_ANTERIOR!B:G,6,0)/1000,0)","v":0},null,0,0,0,0,null,"La cuenta Costo de ventas de servicios, representa el 0,00% del total del Gastos, que comparado al periodo anterior genera una variación absoluta de 0 000,00 que corresponde a un Aumento del 0,00% de recursos disponibles."]
["5.3.2.","Resultados negativos por ventas de inversiones","70",{"$f":"SUM(D197:D198)","v":0},{"$f":"SUM(E197:E198)","v":0},null,0,0,0,0,null,"La cuenta Resultados negativos por ventas de inversiones, representa el 0,00% del total del Gastos, que comparado al periodo anterior genera una variación absoluta de 0 000,00 que corresponde a un Aumento del 0,00% de recursos disponibles."]
["5.3.2.02.","Resultados negativos por ventas de inversiones patrimoniales - Método de participación",null,{"$f":"IFERROR(VLOOKUP(A197,BC_ACTUAL!B:G,6,0)/1000,0)","v":0},{"$f":"IFERROR(VLOOKUP(A197,BC_ANTERIOR!B:G,6,0)/1000,0)","v":0},null,0,0,0,0,null,"La cuenta Resultados negativos por ventas de inversiones patrimoniales - Método de participación, representa el 0,00% del total del Gastos, que comparado al periodo anterior genera una variación absoluta de 0 000,00 que corresponde a un Aumento del 0,00% de recursos disponibles."]
["5.3.2.99.","Resultados negativos por ventas de otras inversiones",null,{"$f":"IFERROR(VLOOKUP(A198,BC_ACTUAL!B:G,6,0)/1000,0)","v":0},{"$f":"IFERROR(VLOOKUP(A198,BC_ANTERIOR!B:G,6,0)/1000,0)","v":0},null,0,0,0,0,null,"La cuenta Resultados negativos por ventas de otras inversiones, representa el 0,00% del total del Gastos, que comparado al periodo anterior genera una variación absoluta de 0 000,00 que corresponde a un Aumento del 0,00% de recursos disponibles."]
["5.3.3.","Resultados negativos por ventas e intercambio de bienes","71",{"$f":"SUM(D200:D207)","v":0},{"$f":"SUM(E200:E207)","v":0},null,{"$f":"IFERROR(D199/$D$232,0)","v":0},0,0,0,null,"La cuenta Resultados negativos por ventas e intercambio de bienes, representa el 0,00% del total del Gastos, que comparado al periodo anterior genera una variación absoluta de 0 000,00 que corresponde a un Aumento del 0,00% de recursos disponibles."]
["5.3.3.01.","Resultados negativos por ventas de construcciones terminadas",null,{"$f":"IFERROR(VLOOKUP(A200,BC_ACTUAL!B:G,6,0)/1000,0)","v":0},{"$f":"IFERROR(VLOOKUP(A200,BC_ANTERIOR!B:G,6,0)/1000,0)","v":0},null,0,0,0,0,null,"La cuenta Resultados negativos por ventas de construcciones terminadas, representa el 0,00% del total del Gastos, que comparado al periodo anterior genera una variación absoluta de 0 000,00 que corresponde a un Aumento del 0,00% de recursos disponibles."]
["5.3.3.02.","Resultados negativos por ventas de propiedades, planta y equipo",null,{"$f":"IFERROR(VLOOKUP(A201,BC_ACTUAL!B:G,6,0)/1000,0)","v":0},{"$f":"IFERROR(VLOOKUP(A201,BC_ANTERIOR!B:G,6,0)/1000,0)","v":0},null,0,0,0,0,null,"La cuenta Resultados negativos por ventas de propiedades, planta y equipo, representa el 0,00% del total del Gastos, que comparado al periodo anterior genera una variación absoluta de 0 000,00 que corresponde a un Aumento del 0,00% de recursos disponibles."]
["5.3.3.03.","Resultados negativos por ventas de activos biológicos",null,{"$f":"IFERROR(VLOOKUP(A202,BC_ACTUAL!B:G,6,0)/1000,0)","v":0},{"$f":"IFERROR(VLOOKUP(A202,BC_ANTERIOR!B:G,6,0)/1000,0)","v":0},null,0,{"$f":"IFERROR(E202/$E$232,0)","v":0},0,0,null,"La cuenta Resultados negativos por ventas de activos biológicos, representa el 0,00% del total del Gastos, que comparado al periodo anterior genera una variación absoluta de 0 000,00 que corresponde a un Aumento del 0,00% de recursos disponibles."]
["5.3.3.04.","Resultados negativos por ventas de bienes intangibles",null,{"$f":"IFERROR(VLOOKUP(A203,BC_ACTUAL!B:G,6,0)/1000,0)","v":0},{"$f":"IFERROR(VLOOKUP(A203,BC_ANTERIOR!B:G,6,0)/1000,0)","v":0},null,{"$f":"IFERROR(D203/$D$232,0)","v":0},0,0,0,null,"La cuenta Resultados negativos por ventas de bienes intangibles, representa el 0,00% del total del Gastos, que comparado al periodo anterior genera una variación absoluta de 0 000,00 que corresponde a un Aumento del 0,00% de recursos disponibles."]
["5.3.3.05.","Resultados negativos por ventas por arrendamientos financieros",null,{"$f":"IFERROR(VLOOKUP(A204,BC_ACTUAL!B:G,6,0)/1000,0)","v":0},{"$f":"IFERROR(VLOOKUP(A204,BC_ANTERIOR!B:G,6,0)/1000,0)","v":0},null,0,0,0,{"$f":"IFERROR(I204/E204,0)","v":0},null,{"$f":"\"La\"&\" \"&\"cuenta\"&\" \"&B204&\",\"&\" \"&\"representa\"&\" \"&\"el\"&\" \"&TEXT(G204,\"0,00%\")&\" \"&\"del\"&\" \"&\"total\"&\" \"&\"del\"&\" \"&IF(MID(A204,1,2)=\"1.\",\"Activo\",IF(MID(A204,1,2)=\"2.\",\"Pasivo\",IF(MID(A204,1,2)=\"3.\",\"Capital\",IF(MID(A204,1,2)=\"4.\",\"Ingresos\",IF(MID(A204,1,2)=\"5.\",\"Gastos\",\"\")))))&\",\"&\" \"&\"que\"&\" \"&\"comparado\"&\" \"&\"al\"&\" \"&\"periodo\"&\" \"&\"anterior\"&\" \"&\"genera\"&\" \"&\"una\"&\" \"&\"variación\"&\" \"&\"absoluta\"&\" \"&\"de\"&\" \"&TEXT(I204,\"0 000,00\")&\" \"&\"que\"&\" \"&\"corresponde\"&\" \"&\"a\"&\" \"&\"un\"&\" \"&IF(I204<0,\"Disminución\",\"Aumento\")&\" \"&\"del\"&\" \"&TEXT(J204,\"0,00%\")&\" \"&\"de\"&\" \"&\"recursos\"&\" \"&\"disponibles\"&\".\"","v":"La cuenta Resultados negativos por ventas por arrendamientos financieros, representa el 0,00% del total del Gastos, que comparado al periodo anterior genera una variación absoluta de 0 000,00 que corresponde a un Aumento del 0,00% de recursos disponibles."}]
["5.3.3.06.","Resultados negativos por intercambio de propiedades, planta y equipo",null,{"$f":"IFERROR(VLOOKUP(A205,BC_ACTUAL!B:G,6,0)/1000,0)","v":0},{"$f":"IFERROR(VLOOKUP(A205,BC_ANTERIOR!B:G,6,0)/1000,0)","v":0},null,0,0,0,0,null,"La cuenta Resultados negativos por intercambio de propiedades, planta y equipo, representa el 0,00% del total del Gastos, que comparado al periodo anterior genera una variación absoluta de 0 000,00 que corresponde a un Aumento del 0,00% de recursos disponibles."]
["5.3.3.07.","Resultados negativos por intercambio de bienes intangibles",null,{"$f":"IFERROR(VLOOKUP(A206,BC_ACTUAL!B:G,6,0)/1000,0)","v":0},{"$f":"IFERROR(VLOOKUP(A206,BC_ANTERIOR!B:G,6,0)/1000,0)","v":0},null,{"$f":"IFERROR(D206/$D$232,0)","v":0},{"$f":"IFERROR(E206/$E$232,0)","v":0},{"$f":"IFERROR(D206-E206,0)","v":0},{"$f":"IFERROR(I206/E206,0)","v":0},null,"La cuenta Resultados negativos por intercambio de bienes intangibles, representa el 0,00% del total del Gastos, que comparado al periodo anterior genera una variación absoluta de 0 000,00 que corresponde a un Aumento del 0,00% de recursos disponibles."]
["5.3.3.08.","Resultados negativos por intercambio de bienes Patrimonio Histórico Cultural",null,{"$f":"IFERROR(VLOOKUP(A207,BC_ACTUAL!B:G,6,0)/1000,0)","v":0},{"$f":"IFERROR(VLOOKUP(A207,BC_ANTERIOR!B:G,6,0)/1000,0)","v":0},null,0,0,0,0]
["5.4.","Transferencias",null,null,null,null,{"$f":"IFERROR(D208/$D$232,0)","v":0},{"$f":"IFERROR(E208/$E$232,0)","v":0},null,null,null,"La cuenta Transferencias, representa el 0,00% del total del Gastos, que comparado al periodo anterior genera una variación absoluta de 0 000,00 que corresponde a un Aumento del 0,00% de recursos disponibles."]
["5.4.1.","Transferencias corrientes","72",{"$f":"SUM(D210:D212)","v":0},{"$f":"SUM(E210:E212)","v":0},null,0,0,{"$f":"IFERROR(D209-E209,0)","v":0},0,null,"La cuenta Transferencias corrientes, representa el 0,00% del total del Gastos, que comparado al periodo anterior genera una variación absoluta de 0 000,00 que corresponde a un Aumento del 0,00% de recursos disponibles."]
["5.4.1.01.","Transferencias corrientes al sector privado interno",null,{"$f":"IFERROR(VLOOKUP(A210,BC_ACTUAL!B:G,6,0)/1000,0)","v":0},{"$f":"IFERROR(VLOOKUP(A210,BC_ANTERIOR!B:G,6,0)/1000,0)","v":0},null,0,0,0,0,null,"La cuenta Transferencias corrientes al sector privado interno, representa el 0,00% del total del Gastos, que comparado al periodo anterior genera una variación absoluta de 0 000,00 que corresponde a un Aumento del 0,00% de recursos disponibles."]
["5.4.1.02.","Transferencias corrientes al sector público interno",null,{"$f":"IFERROR(VLOOKUP(A211,BC_ACTUAL!B:G,6,0)/1000,0)","v":0},{"$f":"IFERROR(VLOOKUP(A211,BC_ANTERIOR!B:G,6,0)/1000,0)","v":0},null,0,0,0,0,null,"La cuenta Transferencias corrientes al sector público interno, representa el 0,00% del total del Gastos, que comparado al periodo anterior genera una variación absoluta de 0 000,00 que corresponde a un Aumento del 0,00% de recursos disponibles."]
["5.4.1.03.","Transferencias corrientes al sector externo",null,{"$f":"IFERROR(VLOOKUP(A212,BC_ACTUAL!B:G,6,0)/1000,0)","v":0},{"$f":"IFERROR(VLOOKUP(A212,BC_ANTERIOR!B:G,6,0)/1000,0)","v":0},null,0,0,0,0,null,"La cuenta Transferencias corrientes al sector externo, representa el 0,00% del total del Gastos, que comparado al periodo anterior genera una variación absoluta de 0 000,00 que corresponde a un Aumento del 0,00% de recursos disponibles."]
["5.4.2.","Transferencias de capital","73",{"$f":"SUM(D214:D216)","v":0},{"$f":"SUM(E214:E216)","v":0},null,0,0,0,0,null,"La cuenta Transferencias de capital, representa el 0,00% del total del Gastos, que comparado al periodo anterior genera una variación absoluta de 0 000,00 que corresponde a un Aumento del 0,00% de recursos disponibles."]
["5.4.2.01.","Transferencias de capital al sector privado interno",null,{"$f":"IFERROR(VLOOKUP(A214,BC_ACTUAL!B:G,6,0)/1000,0)","v":0},{"$f":"IFERROR(VLOOKUP(A214,BC_ANTERIOR!B:G,6,0)/1000,0)","v":0},null,0,0,0,0,null,"La cuenta Transferencias de capital al sector privado interno, representa el 0,00% del total del Gastos, que comparado al periodo anterior genera una variación absoluta de 0 000,00 que corresponde a un Aumento del 0,00% de recursos disponibles."]
["5.4.2.02.","Transferencias de capital al sector público interno",null,{"$f":"IFERROR(VLOOKUP(A215,BC_ACTUAL!B:G,6,0)/1000,0)","v":0},{"$f":"IFERROR(VLOOKUP(A215,BC_ANTERIOR!B:G,6,0)/1000,0)","v":0},null,0,0,0,0,null,"La cuenta Transferencias de capital al sector público interno, representa el 0,00% del total del Gastos, que comparado al periodo anterior genera una variación absoluta de 0 000,00 que corresponde a un Aumento del 0,00% de recursos disponibles."]
["5.4.2.03.","Transferencias de capital al sector externo",null,{"$f":"IFERROR(VLOOKUP(A216,BC_ACTUAL!B:G,6,0)/1000,0)","v":0},{"$f":"IFERROR(VLOOKUP(A216,BC_ANTERIOR!B:G,6,0)/1000,0)","v":0},null,0,0,0,0,null,"La cuenta Transferencias de capital al sector externo, representa el 0,00% del total del Gastos, que comparado al periodo anterior genera una variación absoluta de 0 000,00 que corresponde a un Aumento del 0,00% de recursos disponibles."]
["5.9.","Otros gastos",null,null,null,null,null,0]
["5.9.1.","Resultados negativos por tenencia y por exposición a la inflación","74",{"$f":"SUM(D219:D224)","v":0},{"$f":"SUM(E219:E224)","v":0},null,0,0,{"$f":"IFERROR(D218-E218,0)","v":0},0,null,"La cuenta Resultados negativos por tenencia y por exposición a la inflación, representa el 0,00% del total del Gastos, que comparado al periodo anterior genera una variación absoluta de 0 000,00 que corresponde a un Aumento del 0,00% de recursos disponibles."]
["5.9.1.01.","Diferencias de cambio negativas por activos",null,{"$f":"IFERROR(VLOOKUP(A219,BC_ACTUAL!B:G,6,0)/1000,0)","v":0},{"$f":"IFERROR(VLOOKUP(A219,BC_ANTERIOR!B:G,6,0)/1000,0)","v":0},null,0,0,0,0,null,"La cuenta Diferencias de cambio negativas por activos, representa el 0,00% del total del Gastos, que comparado al periodo anterior genera una variación absoluta de 0 000,00 que corresponde a un Aumento del 0,00% de recursos disponibles."]
["5.9.1.02.","Diferencias de cambio negativas por pasivos",null,{"$f":"IFERROR(VLOOKUP(A220,BC_ACTUAL!B:G,6,0)/1000,0)","v":0},{"$f":"IFERROR(VLOOKUP(A220,BC_ANTERIOR!B:G,6,0)/1000,0)","v":0},null,0,0,0,{"$f":"IFERROR(I220/E220,0)","v":0},null,"La cuenta Diferencias de cambio negativas por pasivos, representa el 0,00% del total del Gastos, que comparado al periodo anterior genera una variación absoluta de 0 000,00 que corresponde a un Aumento del 0,00% de recursos disponibles."]
["5.9.1.03.","Resultados negativos por tenencia de activos no derivados",null,{"$f":"IFERROR(VLOOKUP(A221,BC_ACTUAL!B:G,6,0)/1000,0)","v":0},{"$f":"IFERROR(VLOOKUP(A221,BC_ANTERIOR!B:G,6,0)/1000,0)","v":0},null,0,0,0,0,null,"La cuenta Resultados negativos por tenencia de activos no derivados, representa el 0,00% del total del Gastos, que comparado al periodo anterior genera una variación absoluta de 0 000,00 que corresponde a un Aumento del 0,00% de recursos disponibles."]
["5.9.1.04.","Resultados negativos por tenencia de pasivos no derivados",null,{"$f":"IFERROR(VLOOKUP(A222,BC_ACTUAL!B:G,6,0)/1000,0)","v":0},{"$f":"IFERROR(VLOOKUP(A222,BC_ANTERIOR!B:G,6,0)/1000,0)","v":0},null,0,0,0,0,null,"La cuenta Resultados negativos por tenencia de pasivos no derivados, representa el 0,00% del total del Gastos, que comparado al periodo anterior genera una variación absoluta de 0 000,00 que corresponde a un Aumento del 0,00% de recursos disponibles."]
["5.9.1.05.","Resultados negativos por tenencia de instrumentos financieros derivados",null,{"$f":"IFERROR(VLOOKUP(A223,BC_ACTUAL!B:G,6,0)/1000,0)","v":0},{"$f":"IFERROR(VLOOKUP(A223,BC_ANTERIOR!B:G,6,0)/1000,0)","v":0},null,0,0,0,0,null,"La cuenta Resultados negativos por tenencia de instrumentos financieros derivados, representa el 0,00% del total del Gastos, que comparado al periodo anterior genera una variación absoluta de 0 000,00 que corresponde a un Aumento del 0,00% de recursos disponibles."]
["5.9.1.06.","Resultado negativo por exposición a la inflación",null,{"$f":"IFERROR(VLOOKUP(A224,BC_ACTUAL!B:G,6,0)/1000,0)","v":0},{"$f":"IFERROR(VLOOKUP(A224,BC_ANTERIOR!B:G,6,0)/1000,0)","v":0},null,0,0,0,0,null,"La cuenta Resultado negativo por exposición a la inflación, representa el 0,00% del total del Gastos, que comparado al periodo anterior genera una variación absoluta de 0 000,00 que corresponde a un Aumento del 0,00% de recursos disponibles."]
["5.9.2.","Resultados negativos de inversiones patrimoniales y participación de los intereses minoritarios","75",{"$f":"SUM(D226:D227)","v":0},{"$f":"SUM(E226:E227)","v":0},null,0,0,0,0,null,"La cuenta Resultados negativos de inversiones patrimoniales y participación de los intereses minoritarios, representa el 0,00% del total del Gastos, que comparado al periodo anterior genera una variación absoluta de 0 000,00 que corresponde a un Aumento del 0,00% de recursos disponibles."]
["5.9.2.01.","Resultados negativos de inversiones patrimoniales",null,{"$f":"IFERROR(VLOOKUP(A226,BC_ACTUAL!B:G,6,0)/1000,0)","v":0},{"$f":"IFERROR(VLOOKUP(A226,BC_ANTERIOR!B:G,6,0)/1000,0)","v":0},null,0,{"$f":"IFERROR(E226/$E$232,0)","v":0},0,0,null,"La cuenta Resultados negativos de inversiones patrimoniales, representa el 0,00% del total del Gastos, que comparado al periodo anterior genera una variación absoluta de 0 000,00 que corresponde a un Aumento del 0,00% de recursos disponibles."]
["5.9.2.02.","Participación de los intereses minoritarios en el resultado neto positivo",null,{"$f":"IFERROR(VLOOKUP(A227,BC_ACTUAL!B:G,6,0)/1000,0)","v":0},{"$f":"IFERROR(VLOOKUP(A227,BC_ANTERIOR!B:G,6,0)/1000,0)","v":0},null,0,0,0,0,null,"La cuenta Participación de los intereses minoritarios en el resultado neto positivo, representa el 0,00% del total del Gastos, que comparado al periodo anterior genera una variación absoluta de 0 000,00 que corresponde a un Aumento del 0,00% de recursos disponibles."]
["5.9.9.","Otros gastos y resultados negativos","76",{"$f":"SUM(D229:D231)","v":0},{"$f":"SUM(E229:E231)","v":0},null,{"$f":"IFERROR(D228/$D$232,0)","v":0},0,{"$f":"IFERROR(D228-E228,0)","v":0},{"$f":"IFERROR(I228/E228,0)","v":0},null,"La cuenta Otros gastos y resultados negativos, representa el 0,00% del total del Gastos, que comparado al periodo anterior genera una variación absoluta de 0 000,00 que corresponde a un Aumento del 0,00% de recursos disponibles."]
["5.9.9.02.","Impuestos, multas y recargos moratorios",null,{"$f":"IFERROR(VLOOKUP(A229,BC_ACTUAL!B:G,6,0)/1000,0)","v":0},{"$f":"IFERROR(VLOOKUP(A229,BC_ANTERIOR!B:G,6,0)/1000,0)","v":0},null,{"$f":"IFERROR(D229/$D$232,0)","v":0},{"$f":"IFERROR(E229/$E$232,0)","v":0},0,0,null,"La cuenta Impuestos, multas y recargos moratorios, representa el 0,00% del total del Gastos, que comparado al periodo anterior genera una variación absoluta de 0 000,00 que corresponde a un Aumento del 0,00% de recursos disponibles."]
["5.9.9.03.","Devoluciones de impuestos",null,{"$f":"IFERROR(VLOOKUP(A230,BC_ACTUAL!B:G,6,0)/1000,0)","v":0},{"$f":"IFERROR(VLOOKUP(A230,BC_ANTERIOR!B:G,6,0)/1000,0)","v":0},null,0,{"$f":"IFERROR(E230/$E$232,0)","v":0},0,0,null,"La cuenta Devoluciones de impuestos, representa el 0,00% del total del Gastos, que comparado al periodo anterior genera una variación absoluta de 0 000,00 que corresponde a un Aumento del 0,00% de recursos disponibles."]
["5.9.9.99.","Gastos y resultados negativos varios",null,{"$f":"IFERROR(VLOOKUP(A231,BC_ACTUAL!B:G,6,0)/1000,0)","v":0},{"$f":"IFERROR(VLOOKUP(A231,BC_ANTERIOR!B:G,6,0)/1000,0)","v":0},null,{"$f":"IFERROR(D231/$D$232,0)","v":0},{"$f":"IFERROR(E231/$E$232,0)","v":0},0,0,null,"La cuenta Gastos y resultados negativos varios, representa el 0,00% del total del Gastos, que comparado al periodo anterior genera una variación absoluta de 0 000,00 que corresponde a un Aumento del 0,00% de recursos disponibles."]
[null,"TOTAL DE GASTOS",null,{"$f":"+D228+D225+D218+D213+D209+D199+D196+D193+D186+D181+D175+D172+D168+D165+D162+D156+D146+D137","v":0},{"$f":"+E228+E225+E218+E213+E209+E199+E196+E193+E186+E181+E175+E172+E168+E165+E162+E156+E146+E137","v":0},null,{"$f":"+G228+G225+G218+G213+G209+G199+G196+G193+G186+G181+G175+G172+G168+G165+G162+G156+G146+G137","v":0},{"$f":"+H228+H225+H218+H213+H209+H199+H196+H193+H186+H181+H175+H172+H168+H165+H162+H156+H146+H137","v":0},{"$f":"IFERROR(D232-E232,0)","v":0},0]
[null,"AHORRO y/o DESAHORRO DEL PERIODO",null,{"$f":"+D133-D232","v":0},{"$f":"+E133-E232","v":0},null,{"$f":"+G133-G232","v":0},{"$f":"+H133-H232","v":0},{"$f":"IFERROR(D233-E233,0)","v":0},0]

{"sheet":"EEFF_FLUJO","index":5,"n_rows":64,"n_cols":12,"rows_kept":64,"cut":false,"hidden":false,"merged":[[57,0,57,1],[61,0,61,1],[3,0,3,4],[51,0,51,1],[0,6,0,9],[1,6,1,9],[2,6,2,9],[0,0,0,4],[1,0,1,4],[2,0,2,4]]}
[{"$f":"DATOS!D13","v":""},null,null,null,null,null,"ESTADO DE FLUJO DE EFECTIVO"]
["ESTADO DE FLUJO DE EFECTIVO",null,null,null,null,null,"Análisis de Variaciones"]
[{"$f":"DATOS!D15&\" \"&RIGHT(D5,4)","v":" "},null,null,null,null,null,{"$f":"DATOS!D15&\" \"&RIGHT(D5,4)","v":" "}]
["En miles de colones "]
["P","Descripción","Nota Nº",{"$f":"PROPER(DATOS!D17)","v":""},{"$f":"PROPER(DATOS!D18)","v":""},null,"Análisis Vertical (%)","%","Monto Variación\nAbsoluta"," Variación relativa (%)"]
["FLUJOS DE EFECTIVO DE LAS ACTIVIDADES DE OPERACIÓN"]
["Cobros","COBROS_OPE",77,{"$f":"SUM(D8:D15)","v":0},{"$f":"SUM(E8:E15)","v":0},null,null,null,{"$f":"IFERROR(D7-E7,0)","v":0},{"$f":"IFERROR(I7/E7,0)","v":0},null,{"$f":"\"Los\"&\" \"&A7&\" \"&\"de\"&\" \"&\"los\"&\" \"&\"Flujos\"&\" \"&\"de\"&\" \"&\"Efectivo\"&\" \"&\"de\"&\" \"&\"las\"&\" \"&\"Actividades\"&\" \"&\"de\"&\" \"&\"Operación\"&\",\"&\" \"&\"comparado\"&\" \"&\"al\"&\" \"&\"periodo\"&\" \"&\"anterior\"&\" \"&\"genera\"&\" \"&\"una\"&\" \"&\"variación\"&\" \"&\"absoluta\"&\" \"&\"de\"&\" \"&TEXT(I7,\"0 000,00\")&\" \"&\"que\"&\" \"&\"corresponde\"&\" \"&\"a\"&\" \"&\"un\"&\" \"&IF(I7<0,\"Disminución\",\"Aumento\")&\" \"&\"del\"&\" \"&TEXT(J7,\"0,00%\")&\" \"&\"de\"&\" \"&\"recursos\"&\" \"&\"disponibles\"&\".\"","v":"Los Cobros de los Flujos de Efectivo de las Actividades de Operación, comparado al periodo anterior genera una variación absoluta de 0 000,00 que corresponde a un Aumento del 0,00% de recursos disponibles."}]
[null,"Cobros por impuestos",null,0,0,null,{"$f":"IFERROR(D8/$D$7,0)","v":0},{"$f":"IFERROR(E8/$E$7,0)","v":0},{"$f":"IFERROR(D8-E8,0)","v":0},{"$f":"IFERROR(I8/E8,0)","v":0}]
[null,"Cobros por contribuciones sociales",null,0,0,null,{"$f":"IFERROR(D9/$D$7,0)","v":0},{"$f":"IFERROR(E9/$E$7,0)","v":0},{"$f":"IFERROR(D9-E9,0)","v":0},{"$f":"IFERROR(I9/E9,0)","v":0}]
[null,"Cobros por multas, sanciones, remates y confiscaciones de origen no tributario",null,0,0,null,0,{"$f":"IFERROR(E10/$E$7,0)","v":0},0,0]
[null,"Cobros por ventas de inventarios, servicios y derechos administrativos",null,0,0,null,0,{"$f":"IFERROR(E11/$E$7,0)","v":0},0,0]
[null,"Cobros por ingresos de la propiedad",null,0,0,null,0,0,0,0]
[null,"Cobros por transferencias ",null,0,0,null,0,{"$f":"IFERROR(E13/$E$7,0)","v":0},0,0]
[null,"Cobros por concesiones",null,0,0,null,0,0,0,0]
[null,"Otros cobros por actividades de operación",null,0,0,null,0,0,0,0]
["Pagos","PAGOS_OPE",78,{"$f":"SUM(D17:D21)","v":0},{"$f":"SUM(E17:E21)","v":0},null,null,null,{"$f":"IFERROR(D16-E16,0)","v":0},{"$f":"IFERROR(I16/E16,0)","v":0},null,{"$f":"\"Los\"&\" \"&A16&\" \"&\"de\"&\" \"&\"los\"&\" \"&\"Flujos\"&\" \"&\"de\"&\" \"&\"Efectivo\"&\" \"&\"de\"&\" \"&\"las\"&\" \"&\"Actividades\"&\" \"&\"de\"&\" \"&\"Operación\"&\",\"&\" \"&\"comparado\"&\" \"&\"al\"&\" \"&\"periodo\"&\" \"&\"anterior\"&\" \"&\"genera\"&\" \"&\"una\"&\" \"&\"variación\"&\" \"&\"absoluta\"&\" \"&\"de\"&\" \"&TEXT(I16,\"0 000,00\")&\" \"&\"que\"&\" \"&\"corresponde\"&\" \"&\"a\"&\" \"&\"un\"&\" \"&IF(I16<0,\"Disminución\",\"Aumento\")&\" \"&\"del\"&\" \"&TEXT(J16,\"0,00%\")&\" \"&\"de\"&\" \"&\"recursos\"&\" \"&\"disponibles\"&\".\"","v":"Los Pagos de los Flujos de Efectivo de las Actividades de Operación, comparado al periodo anterior genera una variación absoluta de 0 000,00 que corresponde a un Aumento del 0,00% de recursos disponibles."}]
[null,"Pagos por beneficios al personal",null,0,0,null,{"$f":"IFERROR(D17/$D$16,0)","v":0},{"$f":"IFERROR(E17/$E$16,0)","v":0},{"$f":"IFERROR(D17-E17,0)","v":0},{"$f":"IFERROR(I17/E17,0)","v":0}]
[null,"Pagos por servicios y adquisiciones de inventarios (incluye anticipos)",null,0,0,null,{"$f":"IFERROR(D18/$D$16,0)","v":0},{"$f":"IFERROR(E18/$E$16,0)","v":0},{"$f":"IFERROR(D18-E18,0)","v":0},{"$f":"IFERROR(I18/E18,0)","v":0}]
[null,"Pagos por prestaciones de la seguridad social",null,0,0,null,0,0,0,0]
[null,"Pagos por otras transferencias ",null,0,0,null,0,0,0,0]
[null,"Otros pagos por actividades de operación",null,0,0,null,{"$f":"IFERROR(D21/$D$16,0)","v":0},0,0,0]
["Flujos netos de efectivo por actividades de operación",null,null,{"$f":"+D7-D16","v":0},{"$f":"+E7-E16","v":0},null,null,null,{"$f":"IFERROR(D22-E22,0)","v":0},{"$f":"IFERROR(I22/E22,0)","v":0}]
[]
["FLUJOS DE EFECTIVO DE LAS ACTIVIDADES DE INVERSIÓN"]
["Cobros","COBROS_INV",79,{"$f":"SUM(D26:D30)","v":0},{"$f":"SUM(E26:E30)","v":0},null,null,null,{"$f":"IFERROR(D25-E25,0)","v":0},{"$f":"IFERROR(I25/E25,0)","v":0},null,{"$f":"\"Los\"&\" \"&A25&\" \"&\"de\"&\" \"&\"los\"&\" \"&\"Flujos\"&\" \"&\"de\"&\" \"&\"Efectivo\"&\" \"&\"de\"&\" \"&\"las\"&\" \"&\"Actividades\"&\" \"&\"de\"&\" \"&\"Inversión\"&\",\"&\" \"&\"comparado\"&\" \"&\"al\"&\" \"&\"periodo\"&\" \"&\"anterior\"&\" \"&\"genera\"&\" \"&\"una\"&\" \"&\"variación\"&\" \"&\"absoluta\"&\" \"&\"de\"&\" \"&TEXT(I25,\"0 000,00\")&\" \"&\"que\"&\" \"&\"corresponde\"&\" \"&\"a\"&\" \"&\"un\"&\" \"&IF(I25<0,\"Disminución\",\"Aumento\")&\" \"&\"del\"&\" \"&TEXT(J25,\"0,00%\")&\" \"&\"de\"&\" \"&\"recursos\"&\" \"&\"disponibles\"&\".\"","v":"Los Cobros de los Flujos de Efectivo de las Actividades de Inversión, comparado al periodo anterior genera una variación absoluta de 0 000,00 que corresponde a un Aumento del 0,00% de recursos disponibles."}]
[null,"Cobros por ventas de bienes distintos de inventarios",null,0,0,null,{"$f":"IFERROR(D26/$D$25,0)","v":0},{"$f":"IFERROR(E26/$E$25,0)","v":0},{"$f":"IFERROR(D26-E26,0)","v":0},{"$f":"IFERROR(I26/E26,0)","v":0}]
[null,"Cobros por ventas y reembolso de inversiones patrimoniales",null,0,0,null,{"$f":"IFERROR(D27/$D$25,0)","v":0},{"$f":"IFERROR(E27/$E$25,0)","v":0},{"$f":"IFERROR(D27-E27,0)","v":0},{"$f":"IFERROR(I27/E27,0)","v":0}]
[null,"Cobros por ventas y reembolso de inversiones en otros instrumentos financieros",null,0,0,null,0,0,0,0]
[null,"Cobros por reembolsos de préstamos",null,0,0,null,0,0,0,0]
[null,"Otros cobros por actividades de inversión",null,0,0,null,0,0,0,0]
["Pagos","PAGOS_INV",80,{"$f":"SUM(D32:D36)","v":0},{"$f":"SUM(E32:E36)","v":0},null,null,null,{"$f":"IFERROR(D31-E31,0)","v":0},{"$f":"IFERROR(I31/E31,0)","v":0},null,{"$f":"\"Los\"&\" \"&A31&\" \"&\"de\"&\" \"&\"los\"&\" \"&\"Flujos\"&\" \"&\"de\"&\" \"&\"Efectivo\"&\" \"&\"de\"&\" \"&\"las\"&\" \"&\"Actividades\"&\" \"&\"de\"&\" \"&\"Inversión\"&\",\"&\" \"&\"comparado\"&\" \"&\"al\"&\" \"&\"periodo\"&\" \"&\"anterior\"&\" \"&\"genera\"&\" \"&\"una\"&\" \"&\"variación\"&\" \"&\"absoluta\"&\" \"&\"de\"&\" \"&TEXT(I31,\"0 000,00\")&\" \"&\"que\"&\" \"&\"corresponde\"&\" \"&\"a\"&\" \"&\"un\"&\" \"&IF(I31<0,\"Disminución\",\"Aumento\")&\" \"&\"del\"&\" \"&TEXT(J31,\"0,00%\")&\" \"&\"de\"&\" \"&\"recursos\"&\" \"&\"disponibles\"&\".\"","v":"Los Pagos de los Flujos de Efectivo de las Actividades de Inversión, comparado al periodo anterior genera una variación absoluta de 0 000,00 que corresponde a un Aumento del 0,00% de recursos disponibles."}]
[null,"Pagos por adquisición de bienes distintos de inventarios",null,0,0,null,{"$f":"IFERROR(D32/$D$31,0)","v":0},{"$f":"IFERROR(E32/$E$31,0)","v":0},{"$f":"IFERROR(D32-E32,0)","v":0},{"$f":"IFERROR(I32/E32,0)","v":0}]
[null,"Pagos por adquisición de inversiones patrimoniales",null,0,0,null,{"$f":"IFERROR(D33/$D$31,0)","v":0},{"$f":"IFERROR(E33/$E$31,0)","v":0},{"$f":"IFERROR(D33-E33,0)","v":0},{"$f":"IFERROR(I33/E33,0)","v":0}]
[null,"Pagos por adquisición de inversiones en otros instrumentos financieros",null,0,0,null,0,0,0,{"$f":"IFERROR(I34/E34,0)","v":0}]
[null,"Pagos por préstamos otorgados",null,0,0,null,0,0,0,{"$f":"IFERROR(I35/E35,0)","v":0}]
[null,"Otros pagos por actividades de inversión",null,0,0,null,0,{"$f":"IFERROR(E36/$E$31,0)","v":0},0,0]
["Flujos netos de efectivo por actividades de inversión",null,null,{"$f":"+D25-D31","v":0},{"$f":"+E25-E31","v":0},null,null,null,{"$f":"IFERROR(D37-E37,0)","v":0},{"$f":"IFERROR(I37/E37,0)","v":0}]
[]
["FLUJOS DE EFECTIVO DE LAS ACTIVIDADES DE FINANCIACIÓN"]
["Cobros","COBROS_FIN",81,{"$f":"SUM(D41:D43)","v":0},{"$f":"SUM(E41:E43)","v":0},null,null,null,{"$f":"IFERROR(D40-E40,0)","v":0},{"$f":"IFERROR(I40/E40,0)","v":0},null,{"$f":"\"Los\"&\" \"&A40&\" \"&\"de\"&\" \"&\"los\"&\" \"&\"Flujos\"&\" \"&\"de\"&\" \"&\"Efectivo\"&\" \"&\"de\"&\" \"&\"las\"&\" \"&\"Actividades\"&\" \"&\"de\"&\" \"&\"Financiamiento\"&\",\"&\" \"&\"comparado\"&\" \"&\"al\"&\" \"&\"periodo\"&\" \"&\"anterior\"&\" \"&\"genera\"&\" \"&\"una\"&\" \"&\"variación\"&\" \"&\"absoluta\"&\" \"&\"de\"&\" \"&TEXT(I40,\"0 000,00\")&\" \"&\"que\"&\" \"&\"corresponde\"&\" \"&\"a\"&\" \"&\"un\"&\" \"&IF(I40<0,\"Disminución\",\"Aumento\")&\" \"&\"del\"&\" \"&TEXT(J40,\"0,00%\")&\" \"&\"de\"&\" \"&\"recursos\"&\" \"&\"disponibles\"&\".\"","v":"Los Cobros de los Flujos de Efectivo de las Actividades de Financiamiento, comparado al periodo anterior genera una variación absoluta de 0 000,00 que corresponde a un Aumento del 0,00% de recursos disponibles."}]
[null,"Cobros por incrementos de capital y transferencias de capital",null,0,0,null,{"$f":"IFERROR(D41/$D$40,0)","v":0},{"$f":"IFERROR(E41/$E$40,0)","v":0},{"$f":"IFERROR(D41-E41,0)","v":0},{"$f":"IFERROR(I41/E41,0)","v":0}]
[null,"Cobros por endeudamiento público",null,0,0,null,{"$f":"IFERROR(D42/$D$40,0)","v":0},{"$f":"IFERROR(E42/$E$40,0)","v":0},{"$f":"IFERROR(D42-E42,0)","v":0},{"$f":"IFERROR(I42/E42,0)","v":0}]
[null,"Otros cobros por actividades de financiación",null,0,0,null,0,0,0,0]
["Pagos","PAGOS_FIN",82,{"$f":"SUM(D45:D47)","v":0},{"$f":"SUM(E45:E47)","v":0},null,null,null,{"$f":"IFERROR(D44-E44,0)","v":0},{"$f":"IFERROR(I44/E44,0)","v":0},null,{"$f":"\"Los\"&\" \"&A44&\" \"&\"de\"&\" \"&\"los\"&\" \"&\"Flujos\"&\" \"&\"de\"&\" \"&\"Efectivo\"&\" \"&\"de\"&\" \"&\"las\"&\" \"&\"Actividades\"&\" \"&\"de\"&\" \"&\"Financiamiento\"&\",\"&\" \"&\"comparado\"&\" \"&\"al\"&\" \"&\"periodo\"&\" \"&\"anterior\"&\" \"&\"genera\"&\" \"&\"una\"&\" \"&\"variación\"&\" \"&\"absoluta\"&\" \"&\"de\"&\" \"&TEXT(I44,\"0 000,00\")&\" \"&\"que\"&\" \"&\"corresponde\"&\" \"&\"a\"&\" \"&\"un\"&\" \"&IF(I44<0,\"Disminución\",\"Aumento\")&\" \"&\"del\"&\" \"&TEXT(J44,\"0,00%\")&\" \"&\"de\"&\" \"&\"recursos\"&\" \"&\"disponibles\"&\".\"","v":"Los Pagos de los Flujos de Efectivo de las Actividades de Financiamiento, comparado al periodo anterior genera una variación absoluta de 0 000,00 que corresponde a un Aumento del 0,00% de recursos disponibles."}]
[null,"Pagos por disminuciones del patrimonio que no afectan resultados",null,null,0,null,{"$f":"IFERROR(D45/$D$44,0)","v":0},{"$f":"IFERROR(E45/$E$44,0)","v":0},{"$f":"IFERROR(D45-E45,0)","v":0},{"$f":"IFERROR(I45/E45,0)","v":0}]
[null,"Pagos por amortizaciones de endeudamiento público",null,0,0,null,0,0,0,0]
[null,"Otros pagos por actividades de financiación",null,0,0,null,0,0,0,0]
["Flujos netos de efectivo por actividades de financiación",null,null,{"$f":"+D40-D44","v":0},{"$f":"+E40-E44","v":0},null,null,null,{"$f":"IFERROR(D48-E48,0)","v":0},{"$f":"IFERROR(I48/E48,0)","v":0}]
[]
["Incremento/Disminución neta de efectivo y equivalentes de efectivo por flujos de actividades",null,null,{"$f":"+D22+D37+D48","v":0},{"$f":"+E22+E37+E48","v":0},null,null,null,{"$f":"IFERROR(D50-E50,0)","v":0},{"$f":"IFERROR(I50/E50,0)","v":0}]
[]
["Incremento/Disminución neta de efectivo y equivalentes de efectivo por diferencias de cambio no realizadas",null,null,0,0,null,null,null,0,0]
["Efectivo y equivalentes de efectivo al inicio del ejercicio",null,null,0,0,null,null,null,0,0]
["Efectivo y equivalentes de efectivo al final del ejercicio",null,83,{"$f":"+D50+D52+D53","v":0},{"$f":"+E50+E52+E53","v":0},null,null,null,0,0,null,{"$f":"\"La\"&\" \"&\"cuenta\"&\" \"&A54&\",\"&\" \"&\"comparado\"&\" \"&\"al\"&\" \"&\"periodo\"&\" \"&\"anterior\"&\" \"&\"genera\"&\" \"&\"una\"&\" \"&\"variación\"&\" \"&\"absoluta\"&\" \"&\"de\"&\" \"&TEXT(I54,\"0 000,00\")&\" \"&\"que\"&\" \"&\"corresponde\"&\" \"&\"a\"&\" \"&\"un\"&\" \"&IF(I54<0,\"Disminución\",\"Aumento\")&\" \"&\"del\"&\" \"&TEXT(J54,\"0,00%\")&\" \"&\"de\"&\" \"&\"recursos\"&\" \"&\"disponibles\"&\".\"","v":"La cuenta Efectivo y equivalentes de efectivo al final del ejercicio, comparado al periodo anterior genera una variación absoluta de 0 000,00 que corresponde a un Aumento del 0,00% de recursos disponibles."}]
[]
[]
["Validaciones"]
["Balanza de comprobación periodo actual saldo final"]
["1.1.1.","Efectivo y equivalentes de efectivo",null,{"$f":"IFERROR(VLOOKUP(A59,BC_ACTUAL!B:G,6,0)/1000,0)","v":0}]
[null,"No debe haber diferencia con Efectivo y equivalentes de efectivo al final del ejercicio",null,{"$f":"+D54-D59","v":0}]
[]
["Balanza de comprobación periodo actual saldo inicial"]
["1.1.1.","Efectivo y equivalentes de efectivo",null,{"$f":"IFERROR(VLOOKUP(A63,BC_ANTERIOR!B:G,6,0)/1000,0)","v":0}]
[null,"No debe haber diferencia con Efectivo y equivalentes de efectivo al inicio del ejercicio",null,{"$f":"+D53-D63","v":0}]

{"sheet":"EEFF_CAPITAL","index":6,"n_rows":74,"n_cols":11,"rows_kept":74,"cut":false,"hidden":false,"merged":[[0,0,0,3],[1,0,1,3],[2,0,2,3],[3,0,3,3],[7,0,7,1],[1,5,1,8],[2,5,2,8],[3,5,3,8],[36,0,36,10],[38,0,42,0],[38,1,42,1],[38,2,42,2],[38,3,40,3],[38,4,40,4],[38,5,40,5],[41,8,42,8],[41,9,42,9],[41,10,42,10],[34,0,34,10],[35,0,35,10],[37,0,37,10],[38,6,40,6],[38,7,40,7],[38,8,40,8],[38,9,40,9],[38,10,40,10],[41,3,42,3],[41,4,42,4],[41,5,42,5],[41,6,42,6],[41,7,42,7]]}
[{"$f":"DATOS!D13","v":""}]
[" Estado de Cambios en el Patrimonio Comparativo",null,null,null,null,"ESTADO DE CAMBIOS EN EL PATRIMONIO"]
[{"$f":"DATOS!D15&\" \"&RIGHT(C6,4)","v":" "},null,null,null,null,"Análisis de Variaciones"]
[" En miles de colones",null,null,null,null,{"$f":"DATOS!D15&\" \"&RIGHT(C6,4)","v":" "}]
[]
["Cuenta ","Concepto",{"$f":"PROPER(DATOS!D17)","v":""},{"$f":"PROPER(DATOS!D18)","v":""},null,"Análisis Vertical (%)","%","Monto Variación\nAbsoluta"," Variación relativa (%)"]
["3.",{"$f":"\"Saldos\"&\" \"&\"al\"&\" \"&\"31\"&\" \"&\"de\"&\" \"&\"Diciembre\"&\" \"&\"del\"&\" \"&RIGHT(C6,4)&\" \"&\"y\"&\" \"&RIGHT(D6,4)","v":"Saldos al 31 de Diciembre del  y "},{"$f":"IFERROR(VLOOKUP(A7,BC_ACTUAL!B:G,3,0),0)/1000","v":0},{"$f":"IFERROR(VLOOKUP(A7,BC_ANTERIOR!B:G,3,0),0)/1000","v":0}]
["Variaciones del ejercicio "]
["3.1.1.01.","Capital inicial",{"$f":"IFERROR((VLOOKUP(A9,BC_ACTUAL!B:G,5,FALSE))-(VLOOKUP(A9,BC_ACTUAL!B:G,4,0)),0)/1000","v":0},{"$f":"IFERROR((VLOOKUP(A9,BC_ANTERIOR!B:G,6,FALSE))-(VLOOKUP(A9,BC_ANTERIOR!B:G,3,0)),0)/1000","v":0},null,{"$f":"IFERROR(C9/$C$28,0)","v":0},{"$f":"IFERROR(D9/$D$28,0)","v":0},{"$f":"IFERROR(C9-D9,0)","v":0},{"$f":"IFERROR(H9/D9,0)","v":0}]
["3.1.1.02.","Incorporaciones al capital",{"$f":"IFERROR((VLOOKUP(A10,BC_ACTUAL!B:G,5,FALSE))-(VLOOKUP(A10,BC_ACTUAL!B:G,4,0)),0)/1000","v":0},{"$f":"IFERROR((VLOOKUP(A10,BC_ANTERIOR!B:G,6,FALSE))-(VLOOKUP(A10,BC_ANTERIOR!B:G,3,0)),0)/1000","v":0},null,{"$f":"IFERROR(C10/$C$28,0)","v":0},{"$f":"IFERROR(D10/$D$28,0)","v":0},{"$f":"IFERROR(C10-D10,0)","v":0},{"$f":"IFERROR(H10/D10,0)","v":0}]
["3.1.2.01.","Donaciones de capital",{"$f":"IFERROR((VLOOKUP(A11,BC_ACTUAL!B:G,5,FALSE))-(VLOOKUP(A11,BC_ACTUAL!B:G,4,0)),0)/1000","v":0},{"$f":"IFERROR((VLOOKUP(A11,BC_ANTERIOR!B:G,6,FALSE))-(VLOOKUP(A11,BC_ANTERIOR!B:G,3,0)),0)/1000","v":0},null,0,{"$f":"IFERROR(D11/$D$28,0)","v":0},0,0]
["3.1.2.99.","Otras transferencias de capital",{"$f":"IFERROR((VLOOKUP(A12,BC_ACTUAL!B:G,5,FALSE))-(VLOOKUP(A12,BC_ACTUAL!B:G,4,0)),0)/1000","v":0},{"$f":"IFERROR((VLOOKUP(A12,BC_ANTERIOR!B:G,6,FALSE))-(VLOOKUP(A12,BC_ANTERIOR!B:G,3,0)),0)/1000","v":0},null,0,0,0,0]
["3.1.3.01.","Revaluación de bienes",{"$f":"IFERROR((VLOOKUP(A13,BC_ACTUAL!B:G,5,FALSE))-(VLOOKUP(A13,BC_ACTUAL!B:G,4,0)),0)/1000","v":0},{"$f":"IFERROR((VLOOKUP(A13,BC_ANTERIOR!B:G,6,FALSE))-(VLOOKUP(A13,BC_ANTERIOR!B:G,3,0)),0)/1000","v":0},null,0,0,0,0]
["3.1.3.99.","Otras reservas",{"$f":"IFERROR((VLOOKUP(A14,BC_ACTUAL!B:G,5,FALSE))-(VLOOKUP(A14,BC_ACTUAL!B:G,4,0)),0)/1000","v":0},{"$f":"IFERROR((VLOOKUP(A14,BC_ANTERIOR!B:G,6,FALSE))-(VLOOKUP(A14,BC_ANTERIOR!B:G,3,0)),0)/1000","v":0},null,0,0,0,0]
["3.1.4.01.","Diferencias de conversión de moneda extranjera",{"$f":"IFERROR((VLOOKUP(A15,BC_ACTUAL!B:G,5,FALSE))-(VLOOKUP(A15,BC_ACTUAL!B:G,4,0)),0)/1000","v":0},{"$f":"IFERROR((VLOOKUP(A15,BC_ANTERIOR!B:G,6,FALSE))-(VLOOKUP(A15,BC_ANTERIOR!B:G,3,0)),0)/1000","v":0},null,0,0,0,0]
["3.1.4.02.","Diferencias de valor razonable de activos financieros destinados a la venta",{"$f":"IFERROR((VLOOKUP(A16,BC_ACTUAL!B:G,5,FALSE))-(VLOOKUP(A16,BC_ACTUAL!B:G,4,0)),0)/1000","v":0},{"$f":"IFERROR((VLOOKUP(A16,BC_ANTERIOR!B:G,6,FALSE))-(VLOOKUP(A16,BC_ANTERIOR!B:G,3,0)),0)/1000","v":0},null,0,{"$f":"IFERROR(D16/$D$28,0)","v":0},0,0]
["3.1.4.03.","Diferencias de valor razonable de instrumentos financieros designados como cobertura",{"$f":"IFERROR((VLOOKUP(A17,BC_ACTUAL!B:G,5,FALSE))-(VLOOKUP(A17,BC_ACTUAL!B:G,4,0)),0)/1000","v":0},{"$f":"IFERROR((VLOOKUP(A17,BC_ANTERIOR!B:G,6,FALSE))-(VLOOKUP(A17,BC_ANTERIOR!B:G,3,0)),0)/1000","v":0},null,0,{"$f":"IFERROR(D17/$D$28,0)","v":0},0,0]
["3.1.4.99.","Otras variaciones no asignables a reservas",{"$f":"IFERROR((VLOOKUP(A18,BC_ACTUAL!B:G,5,FALSE))-(VLOOKUP(A18,BC_ACTUAL!B:G,4,0)),0)/1000","v":0},{"$f":"IFERROR((VLOOKUP(A18,BC_ANTERIOR!B:G,6,FALSE))-(VLOOKUP(A18,BC_ANTERIOR!B:G,3,0)),0)/1000","v":0},null,0,{"$f":"IFERROR(D18/$D$28,0)","v":0},0,0]
["3.1.5.01.","Resultados acumulados de ejercicios anteriores",{"$f":"IFERROR((VLOOKUP(A19,BC_ACTUAL!B:G,5,FALSE))-(VLOOKUP(A19,BC_ACTUAL!B:G,4,0)),0)/1000","v":0},{"$f":"IFERROR((VLOOKUP(A19,BC_ANTERIOR!B:G,6,FALSE))-(VLOOKUP(A19,BC_ANTERIOR!B:G,3,0)),0)/1000","v":0},null,{"$f":"IFERROR(C19/$C$28,0)","v":0},{"$f":"IFERROR(D19/$D$28,0)","v":0},0,0]
["3.1.5.02.","Resultado del ejercicio",{"$f":"IFERROR((VLOOKUP(\"4.\",BC_ACTUAL!B:G,6,FALSE))-(VLOOKUP(\"5.\",BC_ACTUAL!B:G,6,0)),0)/1000","v":0},{"$f":"(IFERROR(VLOOKUP(A20,BC_ANTERIOR!B:G,6,FALSE)-(VLOOKUP(A20,BC_ANTERIOR!B:G,3,0)),0)+IFERROR((VLOOKUP(\"4.\",BC_ANTERIOR!B:G,6,FALSE))-(VLOOKUP(\"5.\",BC_ANTERIOR!B:G,6,0)),0))/1000","v":0},null,{"$f":"IFERROR(C20/$C$28,0)","v":0},{"$f":"IFERROR(D20/$D$28,0)","v":0},0,0]
["3.2.1.01.","Intereses minoritarios - Participaciones en el patrimonio de entidades del sector gobierno general",{"$f":"IFERROR((VLOOKUP(A21,BC_ACTUAL!B:G,5,FALSE))-(VLOOKUP(A21,BC_ACTUAL!B:G,4,0)),0)/1000","v":0},{"$f":"IFERROR(VLOOKUP(A21,BC_ANTERIOR!B:G,6,0),0)","v":0},null,{"$f":"IFERROR(C21/$C$28,0)","v":0},{"$f":"IFERROR(D21/$D$28,0)","v":0},0,0]
["3.2.1.02.","Intereses minoritarios - Participaciones en el patrimonio de empresas públicas e instituciones públicas financieras",{"$f":"IFERROR((VLOOKUP(A22,BC_ACTUAL!B:G,5,FALSE))-(VLOOKUP(A22,BC_ACTUAL!B:G,4,0)),0)/1000","v":0},{"$f":"IFERROR(VLOOKUP(A22,BC_ANTERIOR!B:G,6,0),0)","v":0},null,{"$f":"IFERROR(C22/$C$28,0)","v":0},{"$f":"IFERROR(D22/$D$28,0)","v":0},0,0]
["3.2.2.01.","Intereses minoritarios - Evolución por reservas",{"$f":"IFERROR((VLOOKUP(A23,BC_ACTUAL!B:G,5,FALSE))-(VLOOKUP(A23,BC_ACTUAL!B:G,4,0)),0)/1000","v":0},{"$f":"IFERROR(VLOOKUP(A23,BC_ANTERIOR!B:G,6,0),0)","v":0},null,{"$f":"IFERROR(C23/$C$28,0)","v":0},0,{"$f":"IFERROR(C23-D23,0)","v":0},0]
["3.2.2.02.","Intereses minoritarios - Evolución por variaciones no asignables a reservas",{"$f":"IFERROR((VLOOKUP(A24,BC_ACTUAL!B:G,5,FALSE))-(VLOOKUP(A24,BC_ACTUAL!B:G,4,0)),0)/1000","v":0},{"$f":"IFERROR(VLOOKUP(A24,BC_ANTERIOR!B:G,6,0),0)","v":0},null,0,{"$f":"IFERROR(D24/$D$28,0)","v":0},0,0]
["3.2.2.03.","Intereses minoritarios - Evolución por resultados acumulados",{"$f":"IFERROR((VLOOKUP(A25,BC_ACTUAL!B:G,5,FALSE))-(VLOOKUP(A25,BC_ACTUAL!B:G,4,0)),0)/1000","v":0},{"$f":"IFERROR(VLOOKUP(A25,BC_ANTERIOR!B:G,6,0),0)","v":0},null,{"$f":"IFERROR(C25/$C$28,0)","v":0},0,0,0]
["3.2.2.99.","Intereses minoritarios - Evolución por otros componentes del patrimonio",{"$f":"IFERROR((VLOOKUP(A24,BC_ACTUAL!B:G,5,FALSE))-(VLOOKUP(A24,BC_ACTUAL!B:G,4,0)),0)/1000","v":0},{"$f":"IFERROR(VLOOKUP(A26,BC_ANTERIOR!B:G,6,0),0)","v":0},null,0,{"$f":"IFERROR(D26/$D$28,0)","v":0},{"$f":"IFERROR(C26-D26,0)","v":0},0]
[null,"Total de variaciones del ejercicio",{"$f":"SUM(C9:C26)","v":0},{"$f":"SUM(D9:D26)","v":0},null,0,{"$f":"IFERROR(D27/$D$28,0)","v":0},{"$f":"IFERROR(C27-D27,0)","v":0},0]
[84,"Saldos del período",{"$f":"+C7+C27","v":0},{"$f":"+D7+D27","v":0},null,0,{"$f":"IFERROR(D28/$D$28,0)","v":0},0,0,null,{"$f":"\"En\"&\" \"&\"el\"&\" \"&\"Estado\"&\" \"&\"de\"&\" \"&\"Cambio\"&\" \"&\"al\"&\" \"&\"Patrimonio\"&\",\"&\" \"&\"el\"&\" Saldo del periodo al 31 de diciembre 2022, \"&\"comparado\"&\" \"&\"al\"&\" \"&\"periodo\"&\" \"&\"anterior\"&\" \"&\"genera\"&\" \"&\"una\"&\" \"&\"variación\"&\" \"&\"absoluta\"&\" \"&\"de\"&\" \"&TEXT(H28,\"0 000,00\")&\" \"&\"que\"&\" \"&\"corresponde\"&\" \"&\"a\"&\" \"&\"un\"&\" \"&IF(H28<0,\"Disminución\",\"Aumento\")&\" \"&\"del\"&\" \"&TEXT(I28,\"0,00%\")&\" \"&\"de\"&\" \"&\"recursos\"&\" \"&\"disponibles\"&\".\"","v":"En el Estado de Cambio al Patrimonio, el Saldo del periodo al 31 de diciembre 2022, comparado al periodo anterior genera una variación absoluta de 0 000,00 que corresponde a un Aumento del 0,00% de recursos disponibles."}]
[null,"   (*) De uso exclusivo en Estados Contables consolidados"]
[]
[]
[]
[]
[]
[{"$f":"DATOS!D13","v":""}]
["ESTADO DE CAMBIOS EN EL PATRIMONIO NETO"]
[{"$f":"DATOS!D15","v":""}]
["En miles de colones "]
["Cuenta ","Concepto",null,"Capital","Transferencias\nde capital","Reservas","Variaciones no asignables a reservas","Resultados acumulados","Intereses Minoritarios Part. Patrimonio","Intereses Minoritarios Evolución","Total Patrimonio"]
[]
[]
[null,null,null,"3.1.1.","3.1.2.","3.1.3.","3.1.4.","3.1.5.","3.2.1.","3.2.2."]
[]
[null,{"$f":"\"Saldo\"&\" \"&\"Iniciales\"&\" \"&\"al\"&\" \"&\"31\"&\" \"&\"de\"&\" \"&\"Diciembre\"&\" \"&RIGHT(D6,4)","v":"Saldo Iniciales al 31 de Diciembre "},null,{"$f":"IFERROR(VLOOKUP(D42,BC_ACTUAL!$B:$G,3,0),0)/1000","v":0},{"$f":"IFERROR(VLOOKUP(E42,BC_ACTUAL!$B:$G,3,0),0)/1000","v":0},{"$f":"IFERROR(VLOOKUP(F42,BC_ACTUAL!$B:$G,3,0),0)/1000","v":0},{"$f":"IFERROR(VLOOKUP(G42,BC_ACTUAL!$B:$G,3,0),0)/1000","v":0},{"$f":"IFERROR(VLOOKUP(H42,BC_ACTUAL!$B:$G,3,0),0)/1000","v":0},{"$f":"IFERROR(VLOOKUP(I42,BC_ACTUAL!$B:$G,3,0),0)/1000","v":0},{"$f":"IFERROR(VLOOKUP(J42,BC_ACTUAL!$B:$G,3,0),0)/1000","v":0},{"$f":"SUM(D44:J44)","v":0}]
["Variaciones del ejercicio "]
["3.1.1.01.","Capital inicial",null,{"$f":"IFERROR((VLOOKUP(A46,BC_ACTUAL!$B:$G,6,FALSE))-(VLOOKUP(A46,BC_ACTUAL!$B:$G,3,0)),0)/1000","v":0},null,null,null,null,null,null,{"$f":"SUM(C46:J46)","v":0}]
["3.1.1.02.","Incorporaciones al capital",null,{"$f":"IFERROR((VLOOKUP(A47,BC_ACTUAL!$B:$G,6,FALSE))-(VLOOKUP(A47,BC_ACTUAL!$B:$G,3,0)),0)/1000","v":0},null,null,null,null,null,null,{"$f":"SUM(C47:J47)","v":0}]
["3.1.2.01.","Donaciones de capital",null,null,{"$f":"IFERROR((VLOOKUP(A48,BC_ACTUAL!$B:$G,6,FALSE))-(VLOOKUP(A48,BC_ACTUAL!$B:$G,3,0)),0)/1000","v":0},null,null,null,null,null,{"$f":"SUM(C48:J48)","v":0}]
["3.1.2.99.","Otras transferencias de capital",null,null,{"$f":"IFERROR((VLOOKUP(A49,BC_ACTUAL!$B:$G,6,FALSE))-(VLOOKUP(A49,BC_ACTUAL!$B:$G,3,0)),0)/1000","v":0},null,null,null,null,null,0]
["3.1.3.01.","Revaluación de bienes",null,null,null,{"$f":"IFERROR((VLOOKUP(A50,BC_ACTUAL!$B:$G,6,FALSE))-(VLOOKUP(A50,BC_ACTUAL!$B:$G,3,0)),0)/1000","v":0},null,null,null,null,0]
["3.1.3.99.","Otras reservas",null,null,null,{"$f":"IFERROR((VLOOKUP(A51,BC_ACTUAL!$B:$G,6,FALSE))-(VLOOKUP(A51,BC_ACTUAL!$B:$G,3,0)),0)/1000","v":0},null,null,null,null,0]
["3.1.4.01.","Diferencias de conversión de moneda extranjera",null,null,null,null,{"$f":"IFERROR((VLOOKUP(A52,BC_ACTUAL!$B:$G,6,FALSE))-(VLOOKUP(A52,BC_ACTUAL!$B:$G,3,0)),0)/1000","v":0},null,null,null,0]
["3.1.4.02.","Diferencias de valor razonable de activos financieros destinados a la venta",null,null,null,null,{"$f":"IFERROR((VLOOKUP(A53,BC_ACTUAL!$B:$G,6,FALSE))-(VLOOKUP(A53,BC_ACTUAL!$B:$G,3,0)),0)/1000","v":0},null,null,null,0]
["3.1.4.03.","Diferencias de valor razonable de instrumentos financieros designados como cobertura",null,null,null,null,{"$f":"IFERROR((VLOOKUP(A54,BC_ACTUAL!$B:$G,6,FALSE))-(VLOOKUP(A54,BC_ACTUAL!$B:$G,3,0)),0)/1000","v":0},null,null,null,0]
["3.1.4.99.","Otras variaciones no asignables a reservas",null,null,null,null,{"$f":"IFERROR((VLOOKUP(A55,BC_ACTUAL!$B:$G,6,FALSE))-(VLOOKUP(A55,BC_ACTUAL!$B:$G,3,0)),0)/1000","v":0},null,null,null,0]
["3.1.5.01.","Resultados acumulados de ejercicios anteriores",null,null,null,null,null,{"$f":"IFERROR((VLOOKUP(A56,BC_ACTUAL!$B:$G,6,FALSE))-(VLOOKUP(A56,BC_ACTUAL!$B:$G,3,0)),0)/1000","v":0},null,null,{"$f":"SUM(C56:J56)","v":0}]
["3.1.5.02.","Resultado del ejercicio",null,null,null,null,null,{"$f":"IFERROR((VLOOKUP(\"4.\",BC_ACTUAL!B:G,6,FALSE))-(VLOOKUP(\"5.\",BC_ACTUAL!B:G,6,0)),0)/1000","v":0},null,null,0]
["3.2.1.01.","Intereses minoritarios - Participaciones en el patrimonio de entidades del sector gobierno general",null,null,null,null,null,null,{"$f":"IFERROR((VLOOKUP(A58,BC_ACTUAL!B:G,6,FALSE))-(VLOOKUP(A58,BC_ACTUAL!B:G,3,0)),0)/1000","v":0},null,0]
["3.2.1.02.","Intereses minoritarios - Participaciones en el patrimonio de empresas públicas e instituciones públicas financieras",null,null,null,null,null,null,{"$f":"IFERROR((VLOOKUP(A59,BC_ACTUAL!B:G,6,FALSE))-(VLOOKUP(A59,BC_ACTUAL!B:G,3,0)),0)/1000","v":0},null,0]
["3.2.2.01.","Intereses minoritarios - Evolución por reservas",null,null,null,null,null,null,null,{"$f":"IFERROR((VLOOKUP(A60,BC_ACTUAL!B:G,6,FALSE))-(VLOOKUP(A60,BC_ACTUAL!B:G,3,0)),0)/1000","v":0},0]
["3.2.2.02.","Intereses minoritarios - Evolución por variaciones no asignables a reservas",null,null,null,null,null,null,null,{"$f":"IFERROR((VLOOKUP(A61,BC_ACTUAL!B:G,6,FALSE))-(VLOOKUP(A61,BC_ACTUAL!B:G,3,0)),0)/1000","v":0},0]
["3.2.2.03.","Intereses minoritarios - Evolución por resultados acumulados",null,null,null,null,null,null,null,{"$f":"IFERROR((VLOOKUP(A62,BC_ACTUAL!B:G,6,FALSE))-(VLOOKUP(A62,BC_ACTUAL!B:G,3,0)),0)/1000","v":0},0]
["3.2.2.99.","Intereses minoritarios - Evolución por otros componentes del patrimonio",null,null,null,null,null,null,null,{"$f":"IFERROR((VLOOKUP(A63,BC_ACTUAL!B:G,6,FALSE))-(VLOOKUP(A63,BC_ACTUAL!B:G,3,0)),0)/1000","v":0},0]
[null,"Total de variaciones del ejercicio",null,{"$f":"SUM(D46:D63)","v":0},{"$f":"SUM(E46:E63)","v":0},{"$f":"SUM(F46:F63)","v":0},{"$f":"SUM(G46:G63)","v":0},{"$f":"SUM(H46:H63)","v":0},{"$f":"SUM(I46:I63)","v":0},0,{"$f":"SUM(K46:K63)","v":0}]
[null,"Saldos del período",null,{"$f":"+D64+D44+D45","v":0},{"$f":"+E64+E44+E45","v":0},{"$f":"+F64+F44+F45","v":0},{"$f":"+G64+G44+G45","v":0},{"$f":"+H64+H44+H45","v":0},{"$f":"+I64+I44+I45","v":0},0,{"$f":"+K64+K44+K45","v":0}]
[null,"   (*) De uso exclusivo en Estados Contables consolidados"]
[]
["SALDOS BC_ACTUAL",null,null,{"$f":"IFERROR(VLOOKUP(D42,BC_ACTUAL!$B:$G,6,0),0)/1000","v":0},{"$f":"IFERROR(VLOOKUP(E42,BC_ACTUAL!$B:$G,6,0),0)/1000","v":0},{"$f":"IFERROR(VLOOKUP(F42,BC_ACTUAL!$B:$G,6,0),0)/1000","v":0},{"$f":"IFERROR(VLOOKUP(G42,BC_ACTUAL!$B:$G,6,0),0)/1000","v":0},{"$f":"IFERROR(VLOOKUP(H42,BC_ACTUAL!$B:$G,6,0),0)/1000","v":0},{"$f":"IFERROR(VLOOKUP(I42,BC_ACTUAL!$B:$G,6,0),0)/1000","v":0},{"$f":"IFERROR(VLOOKUP(J42,BC_ACTUAL!$B:$G,6,0),0)/1000","v":0},{"$f":"SUM(D68:J68)","v":0}]
[]
["AJUSTE_ RESULTADOS",null,null,{"$f":"D65-D68","v":0},{"$f":"E65-E68","v":0},{"$f":"F65-F68","v":0},0,{"$f":"H65-H68","v":0},0,0,{"$f":"K65-K68","v":0}]
[]
["DIFERENCIAS",null,null,null,null,null,null,{"$f":"H57","v":0},null,null,{"$f":"H57","v":0}]
[]
[null,null,null,null,null,null,null,{"$f":"H70-H72","v":0},null,null,{"$f":"K70-K72","v":0}]

{"sheet":"MATRIZ_AUTOVALUACION","index":7,"n_rows":70,"n_cols":12,"rows_kept":70,"cut":false,"hidden":false,"merged":[[67,6,67,7],[68,6,68,7],[69,3,69,7],[59,6,59,7],[60,6,60,7],[61,3,61,7],[63,6,63,7],[64,6,64,7],[65,3,65,7],[8,6,8,7],[3,3,3,11],[4,3,4,11],[5,3,5,11],[6,3,6,11],[7,3,7,11]]}
[]
[]
[]
[]
[]
[null,null,null,"RESUMEN MATRIZ DE AUTOEVALUACIÓN DEL AVANCE DE LA IMPLEMENTACIÓN NICSP VERSIÓN 2018"]
[]
[null,null,null,"VERSIÓN JUNIO 2021"]
[]
[null,null,null,"NICSP ","La norma se encuentra Vigente","La norma ha sido adoptada en el país","Aplica/No Aplica","Grado de aplicación NICSP","Plan de acción","Brechas/Acciones","% avance Plan de Acción","Transitorio"]
[null,null,null,"NICSP 1 Presentación de Estados Financieros"]
[null,null,null,"NICSP 2 Estados de Flujo de Efectivo"]
[null,null,null,"NICSP 3 Políticas Contables, Cambios en las Estimaciones Contables y Errores"]
[null,null,null,"NICSP 4  Efectos de las Variaciones en las Tasas de Cambio de la Moneda Extranjera"]
[null,null,null,"NICSP 5 Costos por Préstamos"]
[null,null,null,"NICSP 9 Ingresos Ordinarios Provenientes de Transacciones de Intercambio"]
[null,null,null,"NICSP 10 Información Financiera en Economías Hiperinflacionarias"]
[null,null,null,"NICSP 11 Contratos de Construcción"]
[null,null,null,"NICSP 12 Inventarios"]
[null,null,null,"NICSP 13  Arrendamientos"]
[null,null,null,"NICSP 14 Hechos Ocurridos Después de la Fecha de Presentación"]
[null,null,null,"NICSP 16 Propiedades de Inversión"]
[null,null,null,"NICSP 17 Propiedades, Planta y Equipo"]
[null,null,null,"NICSP 18 Información Financiera por Segmentos"]
[null,null,null,"NICSP 19 Provisiones, Activos Contingentes y Pasivos Contingentes"]
[null,null,null,"NICSP 20 Información a Revelar Sobre Partes Relacionadas"]
[null,null,null,"NICSP 21 Deterioro del Valor de Activos No Generadores de Efectivo"]
[null,null,null,"NICSP 22 Revelación de Información Financiera sobre el Sector Gobierno General"]
[null,null,null,"NICSP 23 Ingresos de Transacciones sin Contraprestación (Impuestos y Transferencias)"]
[null,null,null,"NICSP 24 Presentación de Información del Presupuesto en los Estados Financieros"]
[null,null,null,"NICSP 26 Deterioro del Valor de los Activos Generadores de Efectivo"]
[null,null,null,"NICSP 27 Agricultura"]
[null,null,null,"NICSP 28 Instrumentos Financieros: Presentación"]
[null,null,null,"NICSP 29 Instrumentos Financieros: Reconocimiento y medición"]
[null,null,null,"NICSP 30 Instrumentos Financieros: Información a Revelar"]
[null,null,null,"NICSP 31 Activos intangibles"]
[null,null,null,"NICSP 32 Acuerdos de Concesión de Servicios: La concedente"]
[null,null,null,"NICSP 33 Adopción por primera vez de las Normas Internacionales de Contabilidad del Sector Público de Base de Acumulación (o devengo) (NICSP)"]
[null,null,null,"NICSP 34 Estados Financieros Separados"]
[null,null,null,"NICSP 35 Estados Financieros Consolidados"]
[null,null,null,"NICSP 36 Inversiones en asociadas y negocios conjuntos"]
[null,null,null,"NICSP 37 Acuerdos Conjuntos"]
[null,null,null,"NICSP 38 Información a revelar sobre participaciones en otras entidades"]
[null,null,null,"NICSP 39 Beneficios a los empleados"]
[null,null,null,"NICSP 40 Combinaciones del Sector Público"]
[]
[null,null,null,"Promedio General Grado de Aplicación NICSP",null,null,null,{"$f":"IFERROR(AVERAGE(H11:H45),0)","v":0}]
[]
[null,null,null,"Promedio General de  Avance en planes de acción (Cantidad de brechas)",null,null,null,null,null,{"$f":"SUM(J11:J45)","v":0},{"$f":"+IFERROR(AVERAGE(K11:K45),0)","v":0}]
[]
[null,null,null,"Cantidad de normas aplicables / Cantidad de normas que poseen plan",{"$f":"COUNTIF($E$11:$E$45,\"SI\")","v":0},{"$f":"COUNTIF($F$11:$F$45,\"SI\")","v":0},{"$f":"COUNTIF($G$11:$G$45,\"SI\")","v":0},null,{"$f":"COUNTIF($I$11:$I$45,\"SI\")","v":0},null,null,{"$f":"COUNTIF($L$11:$L$45,\"SI\")","v":0}]
[null,null,null,"Cantidad de normas no aplicables / Cantidad de normas que no poseen plan",null,null,{"$f":"COUNTIF($G$11:$G$45,\"NO\")","v":0},null,{"$f":"COUNTIF($I$11:$I$45,\"NO\")","v":0},null,null,{"$f":"COUNTIF($L$11:$L$45,\"NO\")","v":0}]
[]
[null,null,null,"La entidad se acoge a los siguientes transitorios:"]
[]
[]
[]
[null,null,null,"TOTAL NORMAS "]
[]
[]
[null,null,null,"NOMBRE",null,null,"FIRMA"]
[null,null,null,"JERARCA MÁXIMO"]
[]
[]
[null,null,null,"NOMBRE",null,null,"FIRMA"]
[null,null,null,"DIRECTOR ADMINISTRATIVO FINANCIERO"]
[]
[]
[null,null,null,"NOMBRE",null,null,"FIRMA"]
[null,null,null,"CONTADOR"]

{"sheet":"NOTAS_POR_CUENTA","index":8,"n_rows":471,"n_cols":8,"rows_kept":471,"cut":false,"hidden":false,"merged":[[0,0,0,5],[1,0,1,5],[3,0,4,0],[3,1,4,1],[3,2,4,2],[3,3,4,3],[3,4,4,4],[7,0,8,0],[7,1,8,1],[7,2,8,2],[7,3,8,3],[7,4,8,4],[11,0,12,0],[11,1,12,1],[11,2,12,2],[11,3,12,3],[11,4,12,4],[15,0,16,0],[15,1,16,1],[15,2,16,2],[15,3,16,3],[15,4,16,4],[19,0,20,0],[19,1,20,1],[19,2,20,2],[19,3,20,3],[19,4,20,4],[23,0,24,0],[23,1,24,1],[23,2,24,2],[23,3,24,3],[23,4,24,4],[27,0,28,0],[27,1,28,1],[27,2,28,2],[27,3,28,3],[27,4,28,4],[31,0,32,0],[31,1,32,1],[31,2,32,2],[31,3,32,3],[31,4,32,4],[35,0,36,0],[35,1,36,1],[35,2,36,2],[35,3,36,3],[35,4,36,4],[39,0,40,0],[39,1,40,1],[39,2,40,2],[39,3,40,3],[39,4,40,4],[43,0,44,0],[43,1,44,1],[43,2,44,2],[43,3,44,3],[43,4,44,4],[47,0,48,0],[47,1,48,1],[47,2,48,2],[47,3,48,3],[47,4,48,4],[51,0,52,0],[51,1,52,1],[51,2,52,2],[51,3,52,3],[51,4,52,4],[55,0,56,0],[55,1,56,1],[55,2,56,2],[55,3,56,3],[55,4,56,4],[59,0,60,0],[59,1,60,1],[59,2,60,2],[59,3,60,3],[59,4,60,4],[63,0,64,0],[63,1,64,1],[63,2,64,2],[63,3,64,3],[63,4,64,4],[67,0,68,0],[67,1,68,1],[67,2,68,2],[67,3,68,3],[67,4,68,4],[71,0,72,0],[71,1,72,1],[71,2,72,2],[71,3,72,3],[71,4,72,4],[75,0,76,0],[75,1,76,1],[75,2,76,2],[75,3,76,3],[75,4,76,4],[79,0,80,0],[79,1,80,1],[79,2,80,2],[79,3,80,3],[79,4,80,4],[83,0,84,0],[83,1,84,1],[83,2,84,2],[83,3,84,3],[83,4,84,4],[87,0,88,0],[87,1,88,1],[87,2,88,2],[87,3,88,3],[87,4,88,4],[91,0,92,0],[91,1,92,1],[91,2,92,2],[91,3,92,3],[91,4,92,4],[95,0,96,0],[95,1,96,1],[95,2,96,2],[95,3,96,3],[95,4,96,4],[99,0,100,0],[99,1,100,1],[99,2,100,2],[99,3,100,3],[99,4,100,4],[112,0,112,5],[114,0,115,0],[114,1,115,1],[114,2,115,2],[114,3,115,3],[114,4,115,4],[103,0,104,0],[103,1,104,1],[103,2,104,2],[103,3,104,3],[103,4,104,4],[107,0,108,0],[107,1,108,1],[107,2,108,2],[107,3,108,3],[107,4,108,4],[118,0,119,0],[118,1,119,1],[118,2,119,2],[118,3,119,3],[118,4,119,4],[122,0,123,0],[122,1,123,1],[122,2,123,2],[122,3,123,3],[122,4,123,4],[126,0,127,0],[126,1,127,1],[126,2,127,2],[126,3,127,3],[126,4,127,4],[130,0,131,0],[130,1,131,1],[130,2,131,2],[130,3,131,3],[130,4,131,4],[134,0,135,0],[134,1,135,1],[134,2,135,2],[134,3,135,3],[134,4,135,4],[138,0,139,0],[138,1,139,1],[138,2,139,2],[138,3,139,3],[138,4,139,4],[142,0,143,0],[142,1,143,1],[142,2,143,2],[142,3,143,3],[142,4,143,4],[146,0,147,0],[146,1,147,1],[146,2,147,2],[146,3,147,3],[146,4,147,4],[150,0,151,0],[150,1,151,1],[150,2,151,2],[150,3,151,3],[150,4,151,4],[154,0,155,0],[154,1,155,1],[154,2,155,2],[154,3,155,3],[154,4,155,4],[158,0,159,0],[158,1,159,1],[158,2,159,2],[158,3,159,3],[158,4,159,4],[162,0,163,0],[162,1,163,1],[162,2,163,2],[162,3,163,3],[162,4,163,4],[175,0,175,5],[177,0,178,0],[177,1,178,1],[177,2,178,2],[177,3,178,3],[177,4,178,4],[166,0,167,0],[166,1,167,1],[166,2,167,2],[166,3,167,3],[166,4,167,4],[170,0,171,0],[170,1,171,1],[170,2,171,2],[170,3,171,3],[170,4,171,4],[181,0,182,0],[181,1,182,1],[181,2,182,2],[181,3,182,3],[181,4,182,4],[185,0,186,0],[185,1,186,1],[185,2,186,2],[185,3,186,3],[185,4,186,4],[189,0,190,0],[189,1,190,1],[189,2,190,2],[189,3,190,3],[189,4,190,4],[193,0,194,0],[193,1,194,1],[193,2,194,2],[193,3,194,3],[193,4,194,4],[197,0,198,0],[197,1,198,1],[197,2,198,2],[197,3,198,3],[197,4,198,4],[201,0,202,0],[201,1,202,1],[201,2,202,2],[201,3,202,3],[201,4,202,4],[205,0,206,0],[205,1,206,1],[205,2,206,2],[205,3,206,3],[205,4,206,4],[209,0,210,0],[209,1,210,1],[209,2,210,2],[209,3,210,3],[209,4,210,4],[223,0,223,5],[224,0,224,5],[227,0,228,0],[227,1,228,1],[227,2,228,2],[227,3,228,3],[227,4,228,4],[213,0,214,0],[213,1,214,1],[213,2,214,2],[213,3,214,3],[213,4,214,4],[217,0,218,0],[217,1,218,1],[217,2,218,2],[217,3,218,3],[217,4,218,4],[231,0,232,0],[231,1,232,1],[231,2,232,2],[231,3,232,3],[231,4,232,4],[235,0,236,0],[235,1,236,1],[235,2,236,2],[235,3,236,3],[235,4,236,4],[239,0,240,0],[239,1,240,1],[239,2,240,2],[239,3,240,3],[239,4,240,4],[243,0,244,0],[243,1,244,1],[243,2,244,2],[243,3,244,3],[243,4,244,4],[247,0,248,0],[247,1,248,1],[247,2,248,2],[247,3,248,3],[247,4,248,4],[251,0,252,0],[251,1,252,1],[251,2,252,2],[251,3,252,3],[251,4,252,4],[255,0,256,0],[255,1,256,1],[255,2,256,2],[255,3,256,3],[255,4,256,4],[259,0,260,0],[259,1,260,1],[259,2,260,2],[259,3,260,3],[259,4,260,4],[263,0,264,0],[263,1,264,1],[263,2,264,2],[263,3,264,3],[263,4,264,4],[267,0,268,0],[267,1,268,1],[267,2,268,2],[267,3,268,3],[267,4,268,4],[271,0,272,0],[271,1,272,1],[271,2,272,2],[271,3,272,3],[271,4,272,4],[275,0,276,0],[275,1,276,1],[275,2,276,2],[275,3,276,3],[275,4,276,4],[279,0,280,0],[279,1,280,1],[279,2,280,2],[279,3,280,3],[279,4,280,4],[283,0,284,0],[283,1,284,1],[283,2,284,2],[283,3,284,3],[283,4,284,4],[287,0,288,0],[287,1,288,1],[287,2,288,2],[287,3,288,3],[287,4,288,4],[291,0,292,0],[291,1,292,1],[291,2,292,2],[291,3,292,3],[291,4,292,4],[295,0,296,0],[295,1,296,1],[295,2,296,2],[295,3,296,3],[295,4,296,4],[299,0,300,0],[299,1,300,1],[299,2,300,2],[299,3,300,3],[299,4,300,4],[303,0,304,0],[303,1,304,1],[303,2,304,2],[303,3,304,3],[303,4,304,4],[307,0,308,0],[307,1,308,1],[307,2,308,2],[307,3,308,3],[307,4,308,4],[311,0,312,0],[311,1,312,1],[311,2,312,2],[311,3,312,3],[311,4,312,4],[315,0,316,0],[315,1,316,1],[315,2,316,2],[315,3,316,3],[315,4,316,4],[319,0,320,0],[319,1,320,1],[319,2,320,2],[319,3,320,3],[319,4,320,4],[323,0,324,0],[323,1,324,1],[323,2,324,2],[323,3,324,3],[323,4,324,4],[327,0,328,0],[327,1,328,1],[327,2,328,2],[327,3,328,3],[327,4,328,4],[331,0,332,0],[331,1,332,1],[331,2,332,2],[331,3,332,3],[331,4,332,4],[344,0,344,5],[346,0,347,0],[346,1,347,1],[346,2,347,2],[346,3,347,3],[346,4,347,4],[335,0,336,0],[335,1,336,1],[335,2,336,2],[335,3,336,3],[335,4,336,4],[339,0,340,0],[339,1,340,1],[339,2,340,2],[339,3,340,3],[339,4,340,4],[350,0,351,0],[350,1,351,1],[350,2,351,2],[350,3,351,3],[350,4,351,4],[354,0,355,0],[354,1,355,1],[354,2,355,2],[354,3,355,3],[354,4,355,4],[358,0,359,0],[358,1,359,1],[358,2,359,2],[358,3,359,3],[358,4,359,4],[362,0,363,0],[362,1,363,1],[362,2,363,2],[362,3,363,3],[362,4,363,4],[366,0,367,0],[366,1,367,1],[366,2,367,2],[366,3,367,3],[366,4,367,4],[370,0,371,0],[370,1,371,1],[370,2,371,2],[370,3,371,3],[370,4,371,4],[374,0,375,0],[374,1,375,1],[374,2,375,2],[374,3,375,3],[374,4,375,4],[378,0,379,0],[378,1,379,1],[378,2,379,2],[378,3,379,3],[378,4,379,4],[382,0,383,0],[382,1,383,1],[382,2,383,2],[382,3,383,3],[382,4,383,4],[386,0,387,0],[386,1,387,1],[386,2,387,2],[386,3,387,3],[386,4,387,4],[390,0,391,0],[390,1,391,1],[390,2,391,2],[390,3,391,3],[390,4,391,4],[394,0,395,0],[394,1,395,1],[394,2,395,2],[394,3,395,3],[394,4,395,4],[398,0,399,0],[398,1,399,1],[398,2,399,2],[398,3,399,3],[398,4,399,4],[402,0,403,0],[402,1,403,1],[402,2,403,2],[402,3,403,3],[402,4,403,4],[406,0,407,0],[406,1,407,1],[406,2,407,2],[406,3,407,3],[406,4,407,4],[410,0,411,0],[410,1,411,1],[410,2,411,2],[410,3,411,3],[410,4,411,4],[422,0,423,0],[422,1,423,1],[422,2,423,2],[422,3,423,3],[422,4,423,4],[427,0,427,5],[414,0,415,0],[414,1,415,1],[414,2,415,2],[414,3,415,3],[414,4,415,4],[418,0,419,0],[418,1,419,1],[418,2,419,2],[418,3,419,3],[418,4,419,4],[429,0,429,5],[440,0,440,5],[451,0,451,5],[431,4,432,4],[435,2,436,2],[435,3,436,3],[435,4,436,4],[442,2,443,2],[442,3,443,3],[442,4,443,4],[446,1,447,1],[435,1,436,1],[442,1,443,1],[431,3,432,3],[431,2,432,2],[431,1,432,1],[468,1,469,1],[466,0,466,5],[457,2,458,2],[457,3,458,3],[457,4,458,4],[461,2,462,2],[461,3,462,3],[461,4,462,4],[446,2,447,2],[446,3,447,3],[446,4,447,4],[453,2,454,2],[453,3,454,3],[453,4,454,4],[457,1,458,1],[461,1,462,1],[453,1,454,1]]}
["Notas Estado de Situación Financiera o Balance General Comparativo"]
["ACTIVO"]
[]
["Cuenta ","Descripción","Nota","Periodo Actual","Periodo Anterior","Diferencia "]
[null,null,null,null,null,"%"]
["1.1.1.",{"$f":"IFERROR(VLOOKUP(A6,EEFF_SITUACION!A:E,2,0),\"\")","v":"Efectivo y equivalentes de efectivo"},{"$f":"IFERROR(VLOOKUP(A6,EEFF_SITUACION!A:E,3,0),0)","v":"03"},{"$f":"IFERROR(VLOOKUP(A6,EEFF_SITUACION!A:J,4,0),0)","v":0},{"$f":"IFERROR(VLOOKUP(A6,EEFF_SITUACION!A:J,5,0),0)","v":0},{"$f":"IFERROR(VLOOKUP(A6,EEFF_SITUACION!A:J,10,0),0)","v":0},null,{"$f":"IFERROR(VLOOKUP(A6,EEFF_SITUACION!A:L,12,0),0)","v":"La cuenta Efectivo y equivalentes de efectivo, representa el 0,00% del total del Activo, que comparado al periodo anterior genera una variación absoluta de 0 000,00 que corresponde a un Aumento del 0,00% de recursos disponibles."}]
[]
["Cuenta ","Descripción","Nota","Periodo Actual","Periodo Anterior","Diferencia "]
[null,null,null,null,null,"%"]
["1.1.2.",{"$f":"IFERROR(VLOOKUP(A10,EEFF_SITUACION!A:E,2,0),\"\")","v":"Inversiones a corto plazo"},{"$f":"IFERROR(VLOOKUP(A10,EEFF_SITUACION!A:E,3,0),0)","v":"04"},{"$f":"IFERROR(VLOOKUP(A10,EEFF_SITUACION!A:J,4,0),0)","v":0},{"$f":"IFERROR(VLOOKUP(A10,EEFF_SITUACION!A:J,5,0),0)","v":0},{"$f":"IFERROR(VLOOKUP(A10,EEFF_SITUACION!A:J,10,0),0)","v":0},null,{"$f":"IFERROR(VLOOKUP(A10,EEFF_SITUACION!A:L,12,0),0)","v":"La cuenta Inversiones a corto plazo, representa el 0,00% del total del Activo, que comparado al periodo anterior genera una variación absoluta de 0 000,00 que corresponde a un Aumento del 0,00% de recursos disponibles."}]
[]
["Cuenta ","Descripción","Nota","Periodo Actual","Periodo Anterior","Diferencia "]
[null,null,null,null,null,"%"]
["1.1.3.",{"$f":"IFERROR(VLOOKUP(A14,EEFF_SITUACION!A:E,2,0),\"\")","v":"Cuentas a cobrar a corto plazo"},{"$f":"IFERROR(VLOOKUP(A14,EEFF_SITUACION!A:E,3,0),0)","v":"05"},{"$f":"IFERROR(VLOOKUP(A14,EEFF_SITUACION!A:J,4,0),0)","v":0},{"$f":"IFERROR(VLOOKUP(A14,EEFF_SITUACION!A:J,5,0),0)","v":0},{"$f":"IFERROR(VLOOKUP(A14,EEFF_SITUACION!A:J,10,0),0)","v":0},null,{"$f":"IFERROR(VLOOKUP(A14,EEFF_SITUACION!A:L,12,0),0)","v":"La cuenta Cuentas a cobrar a corto plazo, representa el 0,00% del total del Activo, que comparado al periodo anterior genera una variación absoluta de 0 000,00 que corresponde a un Aumento del 0,00% de recursos disponibles."}]
[]
["Cuenta ","Descripción","Nota","Periodo Actual","Periodo Anterior","Diferencia "]
[null,null,null,null,null,"%"]
["1.1.4.",{"$f":"IFERROR(VLOOKUP(A18,EEFF_SITUACION!A:E,2,0),\"\")","v":"Inventarios"},{"$f":"IFERROR(VLOOKUP(A18,EEFF_SITUACION!A:E,3,0),0)","v":"06"},{"$f":"IFERROR(VLOOKUP(A18,EEFF_SITUACION!A:J,4,0),0)","v":0},{"$f":"IFERROR(VLOOKUP(A18,EEFF_SITUACION!A:J,5,0),0)","v":0},{"$f":"IFERROR(VLOOKUP(A18,EEFF_SITUACION!A:J,10,0),0)","v":0},null,{"$f":"IFERROR(VLOOKUP(A18,EEFF_SITUACION!A:L,12,0),0)","v":"La cuenta Inventarios, representa el 0,00% del total del Activo, que comparado al periodo anterior genera una variación absoluta de 0 000,00 que corresponde a un Aumento del 0,00% de recursos disponibles."}]
[]
["Cuenta ","Descripción","Nota","Periodo Actual","Periodo Anterior","Diferencia "]
[null,null,null,null,null,"%"]
["1.1.9.",{"$f":"IFERROR(VLOOKUP(A22,EEFF_SITUACION!A:E,2,0),\"\")","v":"Otros activos a corto plazo"},{"$f":"IFERROR(VLOOKUP(A22,EEFF_SITUACION!A:E,3,0),0)","v":"07"},{"$f":"IFERROR(VLOOKUP(A22,EEFF_SITUACION!A:J,4,0),0)","v":0},{"$f":"IFERROR(VLOOKUP(A22,EEFF_SITUACION!A:J,5,0),0)","v":0},{"$f":"IFERROR(VLOOKUP(A22,EEFF_SITUACION!A:J,10,0),0)","v":0},null,{"$f":"IFERROR(VLOOKUP(A22,EEFF_SITUACION!A:L,12,0),0)","v":"La cuenta Otros activos a corto plazo, representa el 0,00% del total del Activo, que comparado al periodo anterior genera una variación absoluta de 0 000,00 que corresponde a un Aumento del 0,00% de recursos disponibles."}]
[]
["Cuenta ","Descripción","Nota","Periodo Actual","Periodo Anterior","Diferencia "]
[null,null,null,null,null,"%"]
["1.2.2.",{"$f":"IFERROR(VLOOKUP(A26,EEFF_SITUACION!A:E,2,0),\"\")","v":"Inversiones a largo plazo"},{"$f":"IFERROR(VLOOKUP(A26,EEFF_SITUACION!A:E,3,0),0)","v":"08"},{"$f":"IFERROR(VLOOKUP(A26,EEFF_SITUACION!A:J,4,0),0)","v":0},{"$f":"IFERROR(VLOOKUP(A26,EEFF_SITUACION!A:J,5,0),0)","v":0},{"$f":"IFERROR(VLOOKUP(A26,EEFF_SITUACION!A:J,10,0),0)","v":0},null,{"$f":"IFERROR(VLOOKUP(A26,EEFF_SITUACION!A:L,12,0),0)","v":"La cuenta Inversiones a largo plazo, representa el 0,00% del total del Activo, que comparado al periodo anterior genera una variación absoluta de 0 000,00 que corresponde a un Aumento del 0,00% de recursos disponibles."}]
[]
["Cuenta ","Descripción","Nota","Periodo Actual","Periodo Anterior","Diferencia "]
[null,null,null,null,null,"%"]
["1.2.3.",{"$f":"IFERROR(VLOOKUP(A30,EEFF_SITUACION!A:E,2,0),\"\")","v":"Cuentas a cobrar a largo plazo"},{"$f":"IFERROR(VLOOKUP(A30,EEFF_SITUACION!A:E,3,0),0)","v":"09"},{"$f":"IFERROR(VLOOKUP(A30,EEFF_SITUACION!A:J,4,0),0)","v":0},{"$f":"IFERROR(VLOOKUP(A30,EEFF_SITUACION!A:J,5,0),0)","v":0},{"$f":"IFERROR(VLOOKUP(A30,EEFF_SITUACION!A:J,10,0),0)","v":0},null,{"$f":"IFERROR(VLOOKUP(A30,EEFF_SITUACION!A:L,12,0),0)","v":"La cuenta Cuentas a cobrar a largo plazo, representa el 0,00% del total del Activo, que comparado al periodo anterior genera una variación absoluta de 0 000,00 que corresponde a un Aumento del 0,00% de recursos disponibles."}]
[]
["Cuenta ","Descripción","Nota","Periodo Actual","Periodo Anterior","Diferencia "]
[null,null,null,null,null,"%"]
["1.2.5.",{"$f":"IFERROR(VLOOKUP(A34,EEFF_SITUACION!A:E,2,0),\"\")","v":"Bienes no concesionados"},{"$f":"IFERROR(VLOOKUP(A34,EEFF_SITUACION!A:E,3,0),0)","v":"10"},{"$f":"IFERROR(VLOOKUP(A34,EEFF_SITUACION!A:J,4,0),0)","v":0},{"$f":"IFERROR(VLOOKUP(A34,EEFF_SITUACION!A:J,5,0),0)","v":0},{"$f":"IFERROR(VLOOKUP(A34,EEFF_SITUACION!A:J,10,0),0)","v":0},null,{"$f":"IFERROR(VLOOKUP(A34,EEFF_SITUACION!A:L,12,0),0)","v":"La cuenta Bienes no concesionados, representa el 0,00% del total del Activo, que comparado al periodo anterior genera una variación absoluta de 0 000,00 que corresponde a un Aumento del 0,00% de recursos disponibles."}]
[]
["Cuenta ","Descripción","Nota","Periodo Actual","Periodo Anterior","Diferencia "]
[null,null,null,null,null,"%"]
["1.2.5.01.",{"$f":"IFERROR(VLOOKUP(A38,EEFF_SITUACION!A:E,2,0),\"\")","v":"Propiedades, planta y equipos explotados"},{"$f":"C34","v":"10"},{"$f":"IFERROR(VLOOKUP(A38,EEFF_SITUACION!A:J,4,0),0)","v":0},{"$f":"IFERROR(VLOOKUP(A38,EEFF_SITUACION!A:J,5,0),0)","v":0},{"$f":"IFERROR(VLOOKUP(A38,EEFF_SITUACION!A:J,10,0),0)","v":0},null,{"$f":"IFERROR(VLOOKUP(A38,EEFF_SITUACION!A:L,12,0),0)","v":"La cuenta Propiedades, planta y equipos explotados, representa el 0,00% del total del Activo, que comparado al periodo anterior genera una variación absoluta de 0 000,00 que corresponde a un Aumento del 0,00% de recursos disponibles."}]
[]
["Cuenta ","Descripción","Nota","Periodo Actual","Periodo Anterior","Diferencia "]
[null,null,null,null,null,"%"]
["1.2.5.02.",{"$f":"IFERROR(VLOOKUP(A42,EEFF_SITUACION!A:E,2,0),\"\")","v":"Propiedades de inversión"},{"$f":"C34","v":"10"},{"$f":"IFERROR(VLOOKUP(A42,EEFF_SITUACION!A:J,4,0),0)","v":0},{"$f":"IFERROR(VLOOKUP(A42,EEFF_SITUACION!A:J,5,0),0)","v":0},{"$f":"IFERROR(VLOOKUP(A42,EEFF_SITUACION!A:J,10,0),0)","v":0},null,{"$f":"IFERROR(VLOOKUP(A42,EEFF_SITUACION!A:L,12,0),0)","v":"La cuenta Propiedades de inversión, representa el 0,00% del total del Activo, que comparado al periodo anterior genera una variación absoluta de 0 000,00 que corresponde a un Aumento del 0,00% de recursos disponibles."}]
[]
["Cuenta ","Descripción","Nota","Periodo Actual","Periodo Anterior","Diferencia "]
[null,null,null,null,null,"%"]
["1.2.5.03.",{"$f":"IFERROR(VLOOKUP(A46,EEFF_SITUACION!A:E,2,0),\"\")","v":"Activos biológicos no concesionados"},{"$f":"C34","v":"10"},{"$f":"IFERROR(VLOOKUP(A46,EEFF_SITUACION!A:J,4,0),0)","v":0},{"$f":"IFERROR(VLOOKUP(A46,EEFF_SITUACION!A:J,5,0),0)","v":0},{"$f":"IFERROR(VLOOKUP(A46,EEFF_SITUACION!A:J,10,0),0)","v":0},null,{"$f":"IFERROR(VLOOKUP(A46,EEFF_SITUACION!A:L,12,0),0)","v":"La cuenta Activos biológicos no concesionados, representa el 0,00% del total del Activo, que comparado al periodo anterior genera una variación absoluta de 0 000,00 que corresponde a un Aumento del 0,00% de recursos disponibles."}]
[]
["Cuenta ","Descripción","Nota","Periodo Actual","Periodo Anterior","Diferencia "]
[null,null,null,null,null,"%"]
["1.2.5.04.",{"$f":"IFERROR(VLOOKUP(A50,EEFF_SITUACION!A:E,2,0),\"\")","v":"Bienes de infraestructura y de beneficio y uso público en servicio"},{"$f":"C34","v":"10"},{"$f":"IFERROR(VLOOKUP(A50,EEFF_SITUACION!A:J,4,0),0)","v":0},{"$f":"IFERROR(VLOOKUP(A50,EEFF_SITUACION!A:J,5,0),0)","v":0},{"$f":"IFERROR(VLOOKUP(A50,EEFF_SITUACION!A:J,10,0),0)","v":0},null,{"$f":"IFERROR(VLOOKUP(A50,EEFF_SITUACION!A:L,12,0),0)","v":"La cuenta Bienes de infraestructura y de beneficio y uso público en servicio, representa el 0,00% del total del Activo, que comparado al periodo anterior genera una variación absoluta de 0 000,00 que corresponde a un Aumento del 0,00% de recursos disponibles."}]
[]
["Cuenta ","Descripción","Nota","Periodo Actual","Periodo Anterior","Diferencia "]
[null,null,null,null,null,"%"]
["1.2.5.05.",{"$f":"IFERROR(VLOOKUP(A54,EEFF_SITUACION!A:E,2,0),\"\")","v":"Bienes históricos y culturales"},{"$f":"C34","v":"10"},{"$f":"IFERROR(VLOOKUP(A54,EEFF_SITUACION!A:J,4,0),0)","v":0},{"$f":"IFERROR(VLOOKUP(A54,EEFF_SITUACION!A:J,5,0),0)","v":0},{"$f":"IFERROR(VLOOKUP(A54,EEFF_SITUACION!A:J,10,0),0)","v":0},null,{"$f":"IFERROR(VLOOKUP(A54,EEFF_SITUACION!A:L,12,0),0)","v":"La cuenta Bienes históricos y culturales, representa el 0,00% del total del Activo, que comparado al periodo anterior genera una variación absoluta de 0 000,00 que corresponde a un Aumento del 0,00% de recursos disponibles."}]
[]
["Cuenta ","Descripción","Nota","Periodo Actual","Periodo Anterior","Diferencia "]
[null,null,null,null,null,"%"]
["1.2.5.06.",{"$f":"IFERROR(VLOOKUP(A58,EEFF_SITUACION!A:E,2,0),\"\")","v":"Recursos naturales en explotación"},{"$f":"C34","v":"10"},{"$f":"IFERROR(VLOOKUP(A58,EEFF_SITUACION!A:J,4,0),0)","v":0},{"$f":"IFERROR(VLOOKUP(A58,EEFF_SITUACION!A:J,5,0),0)","v":0},{"$f":"IFERROR(VLOOKUP(A58,EEFF_SITUACION!A:J,10,0),0)","v":0},null,{"$f":"IFERROR(VLOOKUP(A58,EEFF_SITUACION!A:L,12,0),0)","v":"La cuenta Recursos naturales en explotación, representa el 0,00% del total del Activo, que comparado al periodo anterior genera una variación absoluta de 0 000,00 que corresponde a un Aumento del 0,00% de recursos disponibles."}]
[]
["Cuenta ","Descripción","Nota","Periodo Actual","Periodo Anterior","Diferencia "]
[null,null,null,null,null,"%"]
["1.2.5.07.",{"$f":"IFERROR(VLOOKUP(A62,EEFF_SITUACION!A:E,2,0),\"\")","v":"Recursos naturales en conservación"},{"$f":"C34","v":"10"},{"$f":"IFERROR(VLOOKUP(A62,EEFF_SITUACION!A:J,4,0),0)","v":0},{"$f":"IFERROR(VLOOKUP(A62,EEFF_SITUACION!A:J,5,0),0)","v":0},{"$f":"IFERROR(VLOOKUP(A62,EEFF_SITUACION!A:J,10,0),0)","v":0},null,{"$f":"IFERROR(VLOOKUP(A62,EEFF_SITUACION!A:L,12,0),0)","v":"La cuenta Recursos naturales en conservación, representa el 0,00% del total del Activo, que comparado al periodo anterior genera una variación absoluta de 0 000,00 que corresponde a un Aumento del 0,00% de recursos disponibles."}]
[]
["Cuenta ","Descripción","Nota","Periodo Actual","Periodo Anterior","Diferencia "]
[null,null,null,null,null,"%"]
["1.2.5.08.",{"$f":"IFERROR(VLOOKUP(A66,EEFF_SITUACION!A:E,2,0),\"\")","v":"Bienes intangibles no concesionados"},{"$f":"C34","v":"10"},{"$f":"IFERROR(VLOOKUP(A66,EEFF_SITUACION!A:J,4,0),0)","v":0},{"$f":"IFERROR(VLOOKUP(A66,EEFF_SITUACION!A:J,5,0),0)","v":0},{"$f":"IFERROR(VLOOKUP(A66,EEFF_SITUACION!A:J,10,0),0)","v":0},null,{"$f":"IFERROR(VLOOKUP(A66,EEFF_SITUACION!A:L,12,0),0)","v":"La cuenta Bienes intangibles no concesionados, representa el 0,00% del total del Activo, que comparado al periodo anterior genera una variación absoluta de 0 000,00 que corresponde a un Aumento del 0,00% de recursos disponibles."}]
[]
["Cuenta ","Descripción","Nota","Periodo Actual","Periodo Anterior","Diferencia "]
[null,null,null,null,null,"%"]
["1.2.5.99.",{"$f":"IFERROR(VLOOKUP(A70,EEFF_SITUACION!A:E,2,0),\"\")","v":"Bienes no concesionados en proceso de producción"},{"$f":"C34","v":"10"},{"$f":"IFERROR(VLOOKUP(A70,EEFF_SITUACION!A:J,4,0),0)","v":0},{"$f":"IFERROR(VLOOKUP(A70,EEFF_SITUACION!A:J,5,0),0)","v":0},{"$f":"IFERROR(VLOOKUP(A70,EEFF_SITUACION!A:J,10,0),0)","v":0},null,{"$f":"IFERROR(VLOOKUP(A70,EEFF_SITUACION!A:L,12,0),0)","v":"La cuenta Bienes no concesionados en proceso de producción, representa el 0,00% del total del Activo, que comparado al periodo anterior genera una variación absoluta de 0 000,00 que corresponde a un Aumento del 0,00% de recursos disponibles."}]
[]
["Cuenta ","Descripción","Nota","Periodo Actual","Periodo Anterior","Diferencia "]
[null,null,null,null,null,"%"]
["1.2.6.",{"$f":"IFERROR(VLOOKUP(A74,EEFF_SITUACION!A:E,2,0),\"\")","v":"Bienes concesionados"},{"$f":"IFERROR(VLOOKUP(A74,EEFF_SITUACION!A:E,3,0),0)","v":"11"},{"$f":"IFERROR(VLOOKUP(A74,EEFF_SITUACION!A:J,4,0),0)","v":0},{"$f":"IFERROR(VLOOKUP(A74,EEFF_SITUACION!A:J,5,0),0)","v":0},{"$f":"IFERROR(VLOOKUP(A74,EEFF_SITUACION!A:J,10,0),0)","v":0},null,{"$f":"IFERROR(VLOOKUP(A74,EEFF_SITUACION!A:L,12,0),0)","v":"La cuenta Bienes concesionados, representa el 0,00% del total del Activo, que comparado al periodo anterior genera una variación absoluta de 0 000,00 que corresponde a un Aumento del 0,00% de recursos disponibles."}]
[]
["Cuenta ","Descripción","Nota","Periodo Actual","Periodo Anterior","Diferencia "]
[null,null,null,null,null,"%"]
["1.2.6.01.",{"$f":"IFERROR(VLOOKUP(A78,EEFF_SITUACION!A:E,2,0),\"\")","v":"Propiedades, planta y equipos concesionados"},{"$f":"C74","v":"11"},{"$f":"IFERROR(VLOOKUP(A78,EEFF_SITUACION!A:J,4,0),0)","v":0},{"$f":"IFERROR(VLOOKUP(A78,EEFF_SITUACION!A:J,5,0),0)","v":0},{"$f":"IFERROR(VLOOKUP(A78,EEFF_SITUACION!A:J,10,0),0)","v":0},null,{"$f":"IFERROR(VLOOKUP(A78,EEFF_SITUACION!A:L,12,0),0)","v":"La cuenta Propiedades, planta y equipos concesionados, representa el 0,00% del total del Activo, que comparado al periodo anterior genera una variación absoluta de 0 000,00 que corresponde a un Aumento del 0,00% de recursos disponibles."}]
[]
["Cuenta ","Descripción","Nota","Periodo Actual","Periodo Anterior","Diferencia "]
[null,null,null,null,null,"%"]
["1.2.6.03.",{"$f":"IFERROR(VLOOKUP(A82,EEFF_SITUACION!A:E,2,0),\"\")","v":"Activos biológicos concesionados"},{"$f":"C74","v":"11"},{"$f":"IFERROR(VLOOKUP(A82,EEFF_SITUACION!A:J,4,0),0)","v":0},{"$f":"IFERROR(VLOOKUP(A82,EEFF_SITUACION!A:J,5,0),0)","v":0},{"$f":"IFERROR(VLOOKUP(A82,EEFF_SITUACION!A:J,10,0),0)","v":0},null,{"$f":"IFERROR(VLOOKUP(A82,EEFF_SITUACION!A:L,12,0),0)","v":"La cuenta Activos biológicos concesionados, representa el 0,00% del total del Activo, que comparado al periodo anterior genera una variación absoluta de 0 000,00 que corresponde a un Aumento del 0,00% de recursos disponibles."}]
[]
["Cuenta ","Descripción","Nota","Periodo Actual","Periodo Anterior","Diferencia "]
[null,null,null,null,null,"%"]
["1.2.6.04.",{"$f":"IFERROR(VLOOKUP(A86,EEFF_SITUACION!A:E,2,0),\"\")","v":"Bienes de infraestructura y de beneficio y uso público concesionados"},{"$f":"C74","v":"11"},{"$f":"IFERROR(VLOOKUP(A86,EEFF_SITUACION!A:J,4,0),0)","v":0},{"$f":"IFERROR(VLOOKUP(A86,EEFF_SITUACION!A:J,5,0),0)","v":0},{"$f":"IFERROR(VLOOKUP(A86,EEFF_SITUACION!A:J,10,0),0)","v":0},null,{"$f":"IFERROR(VLOOKUP(A86,EEFF_SITUACION!A:L,12,0),0)","v":"La cuenta Bienes de infraestructura y de beneficio y uso público concesionados, representa el 0,00% del total del Activo, que comparado al periodo anterior genera una variación absoluta de 0 000,00 que corresponde a un Aumento del 0,00% de recursos disponibles."}]
[]
["Cuenta ","Descripción","Nota","Periodo Actual","Periodo Anterior","Diferencia "]
[null,null,null,null,null,"%"]
["1.2.6.06.",{"$f":"IFERROR(VLOOKUP(A90,EEFF_SITUACION!A:E,2,0),\"\")","v":"Recursos naturales concesionados"},{"$f":"C74","v":"11"},{"$f":"IFERROR(VLOOKUP(A90,EEFF_SITUACION!A:J,4,0),0)","v":0},{"$f":"IFERROR(VLOOKUP(A90,EEFF_SITUACION!A:J,5,0),0)","v":0},{"$f":"IFERROR(VLOOKUP(A90,EEFF_SITUACION!A:J,10,0),0)","v":0},null,{"$f":"IFERROR(VLOOKUP(A90,EEFF_SITUACION!A:L,12,0),0)","v":"La cuenta Recursos naturales concesionados, representa el 0,00% del total del Activo, que comparado al periodo anterior genera una variación absoluta de 0 000,00 que corresponde a un Aumento del 0,00% de recursos disponibles."}]
[]
["Cuenta ","Descripción","Nota","Periodo Actual","Periodo Anterior","Diferencia "]
[null,null,null,null,null,"%"]
["1.2.6.08.",{"$f":"IFERROR(VLOOKUP(A94,EEFF_SITUACION!A:E,2,0),\"\")","v":"Bienes intangibles concesionados"},{"$f":"C74","v":"11"},{"$f":"IFERROR(VLOOKUP(A94,EEFF_SITUACION!A:J,4,0),0)","v":0},{"$f":"IFERROR(VLOOKUP(A94,EEFF_SITUACION!A:J,5,0),0)","v":0},{"$f":"IFERROR(VLOOKUP(A94,EEFF_SITUACION!A:J,10,0),0)","v":0},null,{"$f":"IFERROR(VLOOKUP(A94,EEFF_SITUACION!A:L,12,0),0)","v":"La cuenta Bienes intangibles concesionados, representa el 0,00% del total del Activo, que comparado al periodo anterior genera una variación absoluta de 0 000,00 que corresponde a un Aumento del 0,00% de recursos disponibles."}]
[]
["Cuenta ","Descripción","Nota","Periodo Actual","Periodo Anterior","Diferencia "]
[null,null,null,null,null,"%"]
["1.2.6.99.","Bienes concesionados",{"$f":"C74","v":"11"},0,0,0,null,{"$f":"IFERROR(VLOOKUP(A98,EEFF_SITUACION!A:L,12,0),0)","v":"La cuenta Bienes concesionados en proceso de producción, representa el 0,00% del total del Activo, que comparado al periodo anterior genera una variación absoluta de 0 000,00 que corresponde a un Aumento del 0,00% de recursos disponibles."}]
[]
["Cuenta ","Descripción","Nota","Periodo Actual","Periodo Anterior","Diferencia "]
[null,null,null,null,null,"%"]
["1.2.7.",{"$f":"IFERROR(VLOOKUP(A102,EEFF_SITUACION!A:E,2,0),\"\")","v":"Inversiones patrimoniales - Método de participación"},{"$f":"IFERROR(VLOOKUP(A102,EEFF_SITUACION!A:E,3,0),0)","v":"12"},{"$f":"IFERROR(VLOOKUP(A102,EEFF_SITUACION!A:J,4,0),0)","v":0},{"$f":"IFERROR(VLOOKUP(A102,EEFF_SITUACION!A:J,5,0),0)","v":0},{"$f":"IFERROR(VLOOKUP(A102,EEFF_SITUACION!A:J,10,0),0)","v":0},null,{"$f":"IFERROR(VLOOKUP(A102,EEFF_SITUACION!A:L,12,0),0)","v":"La cuenta Inversiones patrimoniales - Método de participación, representa el 0,00% del total del Activo, que comparado al periodo anterior genera una variación absoluta de 0 000,00 que corresponde a un Aumento del 0,00% de recursos disponibles."}]
[]
["Cuenta ","Descripción","Nota","Periodo Actual","Periodo Anterior","Diferencia "]
[null,null,null,null,null,"%"]
["1.2.9.",{"$f":"IFERROR(VLOOKUP(A106,EEFF_SITUACION!A:E,2,0),\"\")","v":"Otros activos a largo plazo"},{"$f":"IFERROR(VLOOKUP(A106,EEFF_SITUACION!A:E,3,0),0)","v":"13"},{"$f":"IFERROR(VLOOKUP(A106,EEFF_SITUACION!A:J,4,0),0)","v":0},{"$f":"IFERROR(VLOOKUP(A106,EEFF_SITUACION!A:J,5,0),0)","v":0},{"$f":"IFERROR(VLOOKUP(A106,EEFF_SITUACION!A:J,10,0),0)","v":0},null,{"$f":"IFERROR(VLOOKUP(A106,EEFF_SITUACION!A:L,12,0),0)","v":"La cuenta Otros activos a largo plazo, representa el 0,00% del total del Activo, que comparado al periodo anterior genera una variación absoluta de 0 000,00 que corresponde a un Aumento del 0,00% de recursos disponibles."}]
[]
["Cuenta ","Descripción","Nota","Periodo Actual","Periodo Anterior","Diferencia "]
[null,null,null,null,null,"%"]
["1.2.9.01.",{"$f":"IFERROR(VLOOKUP(A110,EEFF_SITUACION!A:E,2,0),\"\")","v":"Gastos a devengar a largo plazo"},{"$f":"C106","v":"13"},{"$f":"IFERROR(VLOOKUP(A110,EEFF_SITUACION!A:J,4,0),0)","v":0},{"$f":"IFERROR(VLOOKUP(A110,EEFF_SITUACION!A:J,5,0),0)","v":0},{"$f":"IFERROR(VLOOKUP(A110,EEFF_SITUACION!A:J,10,0),0)","v":0},null,{"$f":"IFERROR(VLOOKUP(A110,EEFF_SITUACION!A:L,12,0),0)","v":"La cuenta Gastos a devengar a largo plazo, representa el 0,00% del total del Activo, que comparado al periodo anterior genera una variación absoluta de 0 000,00 que corresponde a un Aumento del 0,00% de recursos disponibles."}]
[]
[]
["PASIVO"]
[]
["Cuenta ","Descripción","Nota","Periodo Actual","Periodo Anterior","Diferencia "]
[null,null,null,null,null,"%"]
["2.1.1.",{"$f":"IFERROR(VLOOKUP(A117,EEFF_SITUACION!A:E,2,0),\"\")","v":"Deudas a corto plazo"},{"$f":"IFERROR(VLOOKUP(A117,EEFF_SITUACION!A:E,3,0),0)","v":"14"},{"$f":"IFERROR(VLOOKUP(A117,EEFF_SITUACION!A:J,4,0),0)","v":0},{"$f":"IFERROR(VLOOKUP(A117,EEFF_SITUACION!A:J,5,0),0)","v":0},{"$f":"IFERROR(VLOOKUP(A117,EEFF_SITUACION!A:J,10,0),0)","v":0},null,{"$f":"IFERROR(VLOOKUP(A117,EEFF_SITUACION!A:L,12,0),0)","v":"La cuenta Deudas a corto plazo, representa el 0,00% del total del Pasivo, que comparado al periodo anterior genera una variación absoluta de 0 000,00 que corresponde a un Aumento del 0,00% de recursos disponibles."}]
[]
["Cuenta ","Descripción","Nota","Periodo Actual","Periodo Anterior","Diferencia "]
[null,null,null,null,null,"%"]
["2.1.2.",{"$f":"IFERROR(VLOOKUP(A121,EEFF_SITUACION!A:E,2,0),\"\")","v":"Endeudamiento público a corto plazo"},{"$f":"IFERROR(VLOOKUP(A121,EEFF_SITUACION!A:E,3,0),0)","v":"15"},{"$f":"IFERROR(VLOOKUP(A121,EEFF_SITUACION!A:J,4,0),0)","v":0},{"$f":"IFERROR(VLOOKUP(A121,EEFF_SITUACION!A:J,5,0),0)","v":0},{"$f":"IFERROR(VLOOKUP(A121,EEFF_SITUACION!A:J,10,0),0)","v":0},null,{"$f":"IFERROR(VLOOKUP(A121,EEFF_SITUACION!A:L,12,0),0)","v":"La cuenta Endeudamiento público a corto plazo, representa el 0,00% del total del Pasivo, que comparado al periodo anterior genera una variación absoluta de 0 000,00 que corresponde a un Aumento del 0,00% de recursos disponibles."}]
[]
["Cuenta ","Descripción","Nota","Periodo Actual","Periodo Anterior","Diferencia "]
[null,null,null,null,null,"%"]
["2.1.3.",{"$f":"IFERROR(VLOOKUP(A125,EEFF_SITUACION!A:E,2,0),\"\")","v":"Fondos de terceros y en garantía"},{"$f":"IFERROR(VLOOKUP(A125,EEFF_SITUACION!A:E,3,0),0)","v":"16"},{"$f":"IFERROR(VLOOKUP(A125,EEFF_SITUACION!A:J,4,0),0)","v":0},{"$f":"IFERROR(VLOOKUP(A125,EEFF_SITUACION!A:J,5,0),0)","v":0},{"$f":"IFERROR(VLOOKUP(A125,EEFF_SITUACION!A:J,10,0),0)","v":0},null,{"$f":"IFERROR(VLOOKUP(A125,EEFF_SITUACION!A:L,12,0),0)","v":"La cuenta Fondos de terceros y en garantía, representa el 0,00% del total del Pasivo, que comparado al periodo anterior genera una variación absoluta de 0 000,00 que corresponde a un Aumento del 0,00% de recursos disponibles."}]
[]
["Cuenta ","Descripción","Nota","Periodo Actual","Periodo Anterior","Diferencia "]
[null,null,null,null,null,"%"]
["2.1.3.03.",{"$f":"IFERROR(VLOOKUP(A129,EEFF_SITUACION!A:E,2,0),\"\")","v":"Depósitos en garantía"},{"$f":"C125","v":"16"},{"$f":"IFERROR(VLOOKUP(A129,EEFF_SITUACION!A:J,4,0),0)","v":0},{"$f":"IFERROR(VLOOKUP(A129,EEFF_SITUACION!A:J,5,0),0)","v":0},{"$f":"IFERROR(VLOOKUP(A129,EEFF_SITUACION!A:J,10,0),0)","v":0},null,{"$f":"IFERROR(VLOOKUP(A129,EEFF_SITUACION!A:L,12,0),0)","v":"La cuenta Depósitos en garantía, representa el 0,00% del total del Pasivo, que comparado al periodo anterior genera una variación absoluta de 0 000,00 que corresponde a un Aumento del 0,00% de recursos disponibles."}]
[]
["Cuenta ","Descripción","Nota","Periodo Actual","Periodo Anterior","Diferencia "]
[null,null,null,null,null,"%"]
["2.1.4.",{"$f":"IFERROR(VLOOKUP(A133,EEFF_SITUACION!A:E,2,0),\"\")","v":"Provisiones y reservas técnicas a corto plazo"},{"$f":"IFERROR(VLOOKUP(A133,EEFF_SITUACION!A:E,3,0),0)","v":"17"},{"$f":"IFERROR(VLOOKUP(A133,EEFF_SITUACION!A:J,4,0),0)","v":0},{"$f":"IFERROR(VLOOKUP(A133,EEFF_SITUACION!A:J,5,0),0)","v":0},{"$f":"IFERROR(VLOOKUP(A133,EEFF_SITUACION!A:J,10,0),0)","v":0},null,{"$f":"IFERROR(VLOOKUP(A133,EEFF_SITUACION!A:L,12,0),0)","v":"La cuenta Provisiones y reservas técnicas a corto plazo, representa el 0,00% del total del Pasivo, que comparado al periodo anterior genera una variación absoluta de 0 000,00 que corresponde a un Aumento del 0,00% de recursos disponibles."}]
[]
["Cuenta ","Descripción","Nota","Periodo Actual","Periodo Anterior","Diferencia "]
[null,null,null,null,null,"%"]
["2.1.4.01.",{"$f":"IFERROR(VLOOKUP(A137,EEFF_SITUACION!A:E,2,0),\"\")","v":"Provisiones a corto plazo"},{"$f":"C133","v":"17"},{"$f":"IFERROR(VLOOKUP(A137,EEFF_SITUACION!A:J,4,0),0)","v":0},{"$f":"IFERROR(VLOOKUP(A137,EEFF_SITUACION!A:J,5,0),0)","v":0},{"$f":"IFERROR(VLOOKUP(A137,EEFF_SITUACION!A:J,10,0),0)","v":0},null,{"$f":"IFERROR(VLOOKUP(A137,EEFF_SITUACION!A:L,12,0),0)","v":"La cuenta Provisiones a corto plazo, representa el 0,00% del total del Pasivo, que comparado al periodo anterior genera una variación absoluta de 0 000,00 que corresponde a un Aumento del 0,00% de recursos disponibles."}]
[]
["Cuenta ","Descripción","Nota","Periodo Actual","Periodo Anterior","Diferencia "]
[null,null,null,null,null,"%"]
["2.1.9.",{"$f":"IFERROR(VLOOKUP(A141,EEFF_SITUACION!A:E,2,0),\"\")","v":"Otros pasivos a corto plazo"},{"$f":"IFERROR(VLOOKUP(A141,EEFF_SITUACION!A:E,3,0),0)","v":"18"},{"$f":"IFERROR(VLOOKUP(A141,EEFF_SITUACION!A:J,4,0),0)","v":0},{"$f":"IFERROR(VLOOKUP(A141,EEFF_SITUACION!A:J,5,0),0)","v":0},{"$f":"IFERROR(VLOOKUP(A141,EEFF_SITUACION!A:J,10,0),0)","v":0},null,{"$f":"IFERROR(VLOOKUP(A141,EEFF_SITUACION!A:L,12,0),0)","v":"La cuenta Otros pasivos a corto plazo, representa el 0,00% del total del Pasivo, que comparado al periodo anterior genera una variación absoluta de 0 000,00 que corresponde a un Aumento del 0,00% de recursos disponibles."}]
[]
["Cuenta ","Descripción","Nota","Periodo Actual","Periodo Anterior","Diferencia "]
[null,null,null,null,null,"%"]
["2.1.9.01.",{"$f":"IFERROR(VLOOKUP(A145,EEFF_SITUACION!A:E,2,0),\"\")","v":"Ingresos a devengar a corto plazo"},{"$f":"C141","v":"18"},{"$f":"IFERROR(VLOOKUP(A145,EEFF_SITUACION!A:J,4,0),0)","v":0},{"$f":"IFERROR(VLOOKUP(A145,EEFF_SITUACION!A:J,5,0),0)","v":0},{"$f":"IFERROR(VLOOKUP(A145,EEFF_SITUACION!A:J,10,0),0)","v":0},null,{"$f":"IFERROR(VLOOKUP(A145,EEFF_SITUACION!A:L,12,0),0)","v":"La cuenta Ingresos a devengar a corto plazo, representa el 0,00% del total del Pasivo, que comparado al periodo anterior genera una variación absoluta de 0 000,00 que corresponde a un Aumento del 0,00% de recursos disponibles."}]
[]
["Cuenta ","Descripción","Nota","Periodo Actual","Periodo Anterior","Diferencia "]
[null,null,null,null,null,"%"]
["2.2.1.",{"$f":"IFERROR(VLOOKUP(A149,EEFF_SITUACION!A:E,2,0),\"\")","v":"Deudas a largo plazo"},{"$f":"IFERROR(VLOOKUP(A149,EEFF_SITUACION!A:E,3,0),0)","v":"19"},{"$f":"IFERROR(VLOOKUP(A149,EEFF_SITUACION!A:J,4,0),0)","v":0},{"$f":"IFERROR(VLOOKUP(A149,EEFF_SITUACION!A:J,5,0),0)","v":0},{"$f":"IFERROR(VLOOKUP(A149,EEFF_SITUACION!A:J,10,0),0)","v":0},null,{"$f":"IFERROR(VLOOKUP(A149,EEFF_SITUACION!A:L,12,0),0)","v":"La cuenta Deudas a largo plazo, representa el 0,00% del total del Pasivo, que comparado al periodo anterior genera una variación absoluta de 0 000,00 que corresponde a un Aumento del 0,00% de recursos disponibles."}]
[]
["Cuenta ","Descripción","Nota","Periodo Actual","Periodo Anterior","Diferencia "]
[null,null,null,null,null,"%"]
["2.2.2.",{"$f":"IFERROR(VLOOKUP(A153,EEFF_SITUACION!A:E,2,0),\"\")","v":"Endeudamiento público a largo plazo"},{"$f":"IFERROR(VLOOKUP(A153,EEFF_SITUACION!A:E,3,0),0)","v":"20"},{"$f":"IFERROR(VLOOKUP(A153,EEFF_SITUACION!A:J,4,0),0)","v":0},{"$f":"IFERROR(VLOOKUP(A153,EEFF_SITUACION!A:J,5,0),0)","v":0},{"$f":"IFERROR(VLOOKUP(A153,EEFF_SITUACION!A:J,10,0),0)","v":0},null,{"$f":"IFERROR(VLOOKUP(A153,EEFF_SITUACION!A:L,12,0),0)","v":"La cuenta Endeudamiento público a largo plazo, representa el 0,00% del total del Pasivo, que comparado al periodo anterior genera una variación absoluta de 0 000,00 que corresponde a un Aumento del 0,00% de recursos disponibles."}]
[]
["Cuenta ","Descripción","Nota","Periodo Actual","Periodo Anterior","Diferencia "]
[null,null,null,null,null,"%"]
["2.2.3.",{"$f":"IFERROR(VLOOKUP(A157,EEFF_SITUACION!A:E,2,0),\"\")","v":"Fondos de terceros y en garantía"},{"$f":"IFERROR(VLOOKUP(A157,EEFF_SITUACION!A:E,3,0),0)","v":"21"},{"$f":"IFERROR(VLOOKUP(A157,EEFF_SITUACION!A:J,4,0),0)","v":0},{"$f":"IFERROR(VLOOKUP(A157,EEFF_SITUACION!A:J,5,0),0)","v":0},{"$f":"IFERROR(VLOOKUP(A157,EEFF_SITUACION!A:J,10,0),0)","v":0},null,{"$f":"IFERROR(VLOOKUP(A157,EEFF_SITUACION!A:L,12,0),0)","v":"La cuenta Fondos de terceros y en garantía, representa el 0,00% del total del Pasivo, que comparado al periodo anterior genera una variación absoluta de 0 000,00 que corresponde a un Aumento del 0,00% de recursos disponibles."}]
[]
["Cuenta ","Descripción","Nota","Periodo Actual","Periodo Anterior","Diferencia "]
[null,null,null,null,null,"%"]
["2.2.4.",{"$f":"IFERROR(VLOOKUP(A161,EEFF_SITUACION!A:E,2,0),\"\")","v":"Provisiones y reservas técnicas a largo plazo"},{"$f":"IFERROR(VLOOKUP(A161,EEFF_SITUACION!A:E,3,0),0)","v":"22"},{"$f":"IFERROR(VLOOKUP(A161,EEFF_SITUACION!A:J,4,0),0)","v":0},{"$f":"IFERROR(VLOOKUP(A161,EEFF_SITUACION!A:J,5,0),0)","v":0},{"$f":"IFERROR(VLOOKUP(A161,EEFF_SITUACION!A:J,10,0),0)","v":0},null,{"$f":"IFERROR(VLOOKUP(A161,EEFF_SITUACION!A:L,12,0),0)","v":"La cuenta Provisiones y reservas técnicas a largo plazo, representa el 0,00% del total del Pasivo, que comparado al periodo anterior genera una variación absoluta de 0 000,00 que corresponde a un Aumento del 0,00% de recursos disponibles."}]
[]
["Cuenta ","Descripción","Nota","Periodo Actual","Periodo Anterior","Diferencia "]
[null,null,null,null,null,"%"]
["2.2.4.01.",{"$f":"IFERROR(VLOOKUP(A165,EEFF_SITUACION!A:E,2,0),\"\")","v":"Provisiones a largo plazo"},{"$f":"C161","v":"22"},{"$f":"IFERROR(VLOOKUP(A165,EEFF_SITUACION!A:J,4,0),0)","v":0},{"$f":"IFERROR(VLOOKUP(A165,EEFF_SITUACION!A:J,5,0),0)","v":0},{"$f":"IFERROR(VLOOKUP(A165,EEFF_SITUACION!A:J,10,0),0)","v":0},null,{"$f":"IFERROR(VLOOKUP(A165,EEFF_SITUACION!A:L,12,0),0)","v":"La cuenta Provisiones a largo plazo, representa el 0,00% del total del Pasivo, que comparado al periodo anterior genera una variación absoluta de 0 000,00 que corresponde a un Aumento del 0,00% de recursos disponibles."}]
[]
["Cuenta ","Descripción","Nota","Periodo Actual","Periodo Anterior","Diferencia "]
[null,null,null,null,null,"%"]
["2.2.9.",{"$f":"IFERROR(VLOOKUP(A169,EEFF_SITUACION!A:E,2,0),\"\")","v":"Otros pasivos a largo plazo"},{"$f":"IFERROR(VLOOKUP(A169,EEFF_SITUACION!A:E,3,0),0)","v":"23"},{"$f":"IFERROR(VLOOKUP(A169,EEFF_SITUACION!A:J,4,0),0)","v":0},{"$f":"IFERROR(VLOOKUP(A169,EEFF_SITUACION!A:J,5,0),0)","v":0},{"$f":"IFERROR(VLOOKUP(A169,EEFF_SITUACION!A:J,10,0),0)","v":0},null,{"$f":"IFERROR(VLOOKUP(A169,EEFF_SITUACION!A:L,12,0),0)","v":"La cuenta Otros pasivos a largo plazo, representa el 0,00% del total del Pasivo, que comparado al periodo anterior genera una variación absoluta de 0 000,00 que corresponde a un Aumento del 0,00% de recursos disponibles."}]
[]
["Cuenta ","Descripción","Nota","Periodo Actual","Periodo Anterior","Diferencia "]
[null,null,null,null,null,"%"]
["2.2.9.01.",{"$f":"IFERROR(VLOOKUP(A173,EEFF_SITUACION!A:E,2,0),\"\")","v":"Ingresos a devengar a largo plazo"},{"$f":"C169","v":"23"},{"$f":"IFERROR(VLOOKUP(A173,EEFF_SITUACION!A:J,4,0),0)","v":0},{"$f":"IFERROR(VLOOKUP(A173,EEFF_SITUACION!A:J,5,0),0)","v":0},{"$f":"IFERROR(VLOOKUP(A173,EEFF_SITUACION!A:J,10,0),0)","v":0},null,{"$f":"IFERROR(VLOOKUP(A173,EEFF_SITUACION!A:L,12,0),0)","v":"La cuenta Ingresos a devengar a largo plazo, representa el 0,00% del total del Pasivo, que comparado al periodo anterior genera una variación absoluta de 0 000,00 que corresponde a un Aumento del 0,00% de recursos disponibles."}]
[]
[]
["PATRIMONIO"]
[]
["Cuenta ","Descripción","Nota","Periodo Actual","Periodo Anterior","Diferencia "]
[null,null,null,null,null,"%"]
["3.1.1.",{"$f":"IFERROR(VLOOKUP(A180,EEFF_SITUACION!A:E,2,0),\"\")","v":"Capital"},{"$f":"IFERROR(VLOOKUP(A180,EEFF_SITUACION!A:E,3,0),0)","v":"24"},{"$f":"IFERROR(VLOOKUP(A180,EEFF_SITUACION!A:J,4,0),0)","v":0},{"$f":"IFERROR(VLOOKUP(A180,EEFF_SITUACION!A:J,5,0),0)","v":0},{"$f":"IFERROR(VLOOKUP(A180,EEFF_SITUACION!A:J,10,0),0)","v":0},null,{"$f":"IFERROR(VLOOKUP(A180,EEFF_SITUACION!A:L,12,0),0)","v":"La cuenta Capital, representa el 0,00% del total del Capital, que comparado al periodo anterior genera una variación absoluta de 0 000,00 que corresponde a un Aumento del 0,00% de recursos disponibles."}]
[]
["Cuenta ","Descripción","Nota","Periodo Actual","Periodo Anterior","Diferencia "]
[null,null,null,null,null,"%"]
["3.1.1.01.",{"$f":"IFERROR(VLOOKUP(A184,EEFF_SITUACION!A:E,2,0),\"\")","v":"Capital inicial"},{"$f":"C180","v":"24"},{"$f":"IFERROR(VLOOKUP(A184,EEFF_SITUACION!A:J,4,0),0)","v":0},{"$f":"IFERROR(VLOOKUP(A184,EEFF_SITUACION!A:J,5,0),0)","v":0},{"$f":"IFERROR(VLOOKUP(A184,EEFF_SITUACION!A:J,10,0),0)","v":0},null,{"$f":"IFERROR(VLOOKUP(A184,EEFF_SITUACION!A:L,12,0),0)","v":"La cuenta Capital inicial, representa el 0,00% del total del Capital, que comparado al periodo anterior genera una variación absoluta de 0 000,00 que corresponde a un Aumento del 0,00% de recursos disponibles."}]
[]
["Cuenta ","Descripción","Nota","Periodo Actual","Periodo Anterior","Diferencia "]
[null,null,null,null,null,"%"]
["3.1.1.02.",{"$f":"IFERROR(VLOOKUP(A188,EEFF_SITUACION!A:E,2,0),\"\")","v":"Incorporaciones al capital"},{"$f":"C180","v":"24"},{"$f":"IFERROR(VLOOKUP(A188,EEFF_SITUACION!A:J,4,0),0)","v":0},{"$f":"IFERROR(VLOOKUP(A188,EEFF_SITUACION!A:J,5,0),0)","v":0},{"$f":"IFERROR(VLOOKUP(A188,EEFF_SITUACION!A:J,10,0),0)","v":0},null,{"$f":"IFERROR(VLOOKUP(A188,EEFF_SITUACION!A:L,12,0),0)","v":"La cuenta Incorporaciones al capital, representa el 0,00% del total del Capital, que comparado al periodo anterior genera una variación absoluta de 0 000,00 que corresponde a un Aumento del 0,00% de recursos disponibles."}]
[]
["Cuenta ","Descripción","Nota","Periodo Actual","Periodo Anterior","Diferencia "]
[null,null,null,null,null,"%"]
["3.1.2.",{"$f":"IFERROR(VLOOKUP(A192,EEFF_SITUACION!A:E,2,0),\"\")","v":"Transferencias de capital"},{"$f":"IFERROR(VLOOKUP(A192,EEFF_SITUACION!A:E,3,0),0)","v":"25"},{"$f":"IFERROR(VLOOKUP(A192,EEFF_SITUACION!A:J,4,0),0)","v":0},{"$f":"IFERROR(VLOOKUP(A192,EEFF_SITUACION!A:J,5,0),0)","v":0},{"$f":"IFERROR(VLOOKUP(A192,EEFF_SITUACION!A:J,10,0),0)","v":0},null,{"$f":"IFERROR(VLOOKUP(A192,EEFF_SITUACION!A:L,12,0),0)","v":"La cuenta Transferencias de capital, representa el 0,00% del total del Capital, que comparado al periodo anterior genera una variación absoluta de 0 000,00 que corresponde a un Aumento del 0,00% de recursos disponibles."}]
[]
["Cuenta ","Descripción","Nota","Periodo Actual","Periodo Anterior","Diferencia "]
[null,null,null,null,null,"%"]
["3.1.3.",{"$f":"IFERROR(VLOOKUP(A196,EEFF_SITUACION!A:E,2,0),\"\")","v":"Reservas"},{"$f":"IFERROR(VLOOKUP(A196,EEFF_SITUACION!A:E,3,0),0)","v":"26"},{"$f":"IFERROR(VLOOKUP(A196,EEFF_SITUACION!A:J,4,0),0)","v":0},{"$f":"IFERROR(VLOOKUP(A196,EEFF_SITUACION!A:J,5,0),0)","v":0},{"$f":"IFERROR(VLOOKUP(A196,EEFF_SITUACION!A:J,10,0),0)","v":0},null,{"$f":"IFERROR(VLOOKUP(A196,EEFF_SITUACION!A:L,12,0),0)","v":"La cuenta Reservas, representa el 0,00% del total del Capital, que comparado al periodo anterior genera una variación absoluta de 0 000,00 que corresponde a un Aumento del 0,00% de recursos disponibles."}]
[]
["Cuenta ","Descripción","Nota","Periodo Actual","Periodo Anterior","Diferencia "]
[null,null,null,null,null,"%"]
["3.1.4.",{"$f":"IFERROR(VLOOKUP(A200,EEFF_SITUACION!A:E,2,0),\"\")","v":"Variaciones no asignables a reservas"},{"$f":"IFERROR(VLOOKUP(A200,EEFF_SITUACION!A:E,3,0),0)","v":"27"},{"$f":"IFERROR(VLOOKUP(A200,EEFF_SITUACION!A:J,4,0),0)","v":0},{"$f":"IFERROR(VLOOKUP(A200,EEFF_SITUACION!A:J,5,0),0)","v":0},{"$f":"IFERROR(VLOOKUP(A200,EEFF_SITUACION!A:J,10,0),0)","v":0},null,{"$f":"IFERROR(VLOOKUP(A200,EEFF_SITUACION!A:L,12,0),0)","v":"La cuenta Variaciones no asignables a reservas, representa el 0,00% del total del Capital, que comparado al periodo anterior genera una variación absoluta de 0 000,00 que corresponde a un Aumento del 0,00% de recursos disponibles."}]
[]
["Cuenta ","Descripción","Nota","Periodo Actual","Periodo Anterior","Diferencia "]
[null,null,null,null,null,"%"]
["3.1.5.",{"$f":"IFERROR(VLOOKUP(A204,EEFF_SITUACION!A:E,2,0),\"\")","v":"Resultados acumulados"},{"$f":"IFERROR(VLOOKUP(A204,EEFF_SITUACION!A:E,3,0),0)","v":"28"},{"$f":"IFERROR(VLOOKUP(A204,EEFF_SITUACION!A:J,4,0),0)","v":0},{"$f":"IFERROR(VLOOKUP(A204,EEFF_SITUACION!A:J,5,0),0)","v":0},{"$f":"IFERROR(VLOOKUP(A204,EEFF_SITUACION!A:J,10,0),0)","v":0},null,{"$f":"IFERROR(VLOOKUP(A204,EEFF_SITUACION!A:L,12,0),0)","v":"La cuenta Resultados acumulados, representa el 0,00% del total del Capital, que comparado al periodo anterior genera una variación absoluta de 0 000,00 que corresponde a un Aumento del 0,00% de recursos disponibles."}]
[]
["Cuenta ","Descripción","Nota","Periodo Actual","Periodo Anterior","Diferencia "]
[null,null,null,null,null,"%"]
["3.1.5.01.",{"$f":"IFERROR(VLOOKUP(A208,EEFF_SITUACION!A:E,2,0),\"\")","v":"Resultados acumulados de ejercicios anteriores"},{"$f":"C204","v":"28"},{"$f":"IFERROR(VLOOKUP(A208,EEFF_SITUACION!A:J,4,0),0)","v":0},{"$f":"IFERROR(VLOOKUP(A208,EEFF_SITUACION!A:J,5,0),0)","v":0},{"$f":"IFERROR(VLOOKUP(A208,EEFF_SITUACION!A:J,10,0),0)","v":0},null,{"$f":"IFERROR(VLOOKUP(A208,EEFF_SITUACION!A:L,12,0),0)","v":"La cuenta Resultados acumulados de ejercicios anteriores, representa el 0,00% del total del Capital, que comparado al periodo anterior genera una variación absoluta de 0 000,00 que corresponde a un Aumento del 0,00% de recursos disponibles."}]
[]
["Cuenta ","Descripción","Nota","Periodo Actual","Periodo Anterior","Diferencia "]
[null,null,null,null,null,"%"]
["3.1.5.02.",{"$f":"IFERROR(VLOOKUP(A212,EEFF_SITUACION!A:E,2,0),\"\")","v":"Resultado del ejercicio"},{"$f":"C204","v":"28"},{"$f":"IFERROR(VLOOKUP(A212,EEFF_SITUACION!A:J,4,0),0)","v":0},{"$f":"IFERROR(VLOOKUP(A212,EEFF_SITUACION!A:J,5,0),0)","v":0},{"$f":"IFERROR(VLOOKUP(A212,EEFF_SITUACION!A:J,10,0),0)","v":0},null,{"$f":"IFERROR(VLOOKUP(A212,EEFF_SITUACION!A:L,12,0),0)","v":"La cuenta Resultado del ejercicio, representa el 0,00% del total del Capital, que comparado al periodo anterior genera una variación absoluta de 0 000,00 que corresponde a un Aumento del 0,00% de recursos disponibles."}]
[]
["Cuenta ","Descripción","Nota","Periodo Actual","Periodo Anterior","Diferencia "]
[null,null,null,null,null,"%"]
["3.2.1.",{"$f":"IFERROR(VLOOKUP(A216,EEFF_SITUACION!A:E,2,0),\"\")","v":"Intereses minoritarios - Participaciones en el patrimonio de entidades controladas"},{"$f":"IFERROR(VLOOKUP(A216,EEFF_SITUACION!A:E,3,0),0)","v":"29"},{"$f":"IFERROR(VLOOKUP(A216,EEFF_SITUACION!A:J,4,0),0)","v":0},{"$f":"IFERROR(VLOOKUP(A216,EEFF_SITUACION!A:J,5,0),0)","v":0},{"$f":"IFERROR(VLOOKUP(A216,EEFF_SITUACION!A:J,10,0),0)","v":0},null,{"$f":"IFERROR(VLOOKUP(A216,EEFF_SITUACION!A:L,12,0),0)","v":"La cuenta Intereses minoritarios - Participaciones en el patrimonio de entidades controladas, representa el 0,00% del total del Capital, que comparado al periodo anterior genera una variación absoluta de 0 000,00 que corresponde a un Aumento del 0,00% de recursos disponibles."}]
[]
["Cuenta ","Descripción","Nota","Periodo Actual","Periodo Anterior","Diferencia "]
[null,null,null,null,null,"%"]
["3.2.2.",{"$f":"IFERROR(VLOOKUP(A220,EEFF_SITUACION!A:E,2,0),\"\")","v":"Intereses minoritarios - Evolución"},{"$f":"IFERROR(VLOOKUP(A220,EEFF_SITUACION!A:E,3,0),0)","v":"30"},{"$f":"IFERROR(VLOOKUP(A220,EEFF_SITUACION!A:J,4,0),0)","v":0},{"$f":"IFERROR(VLOOKUP(A220,EEFF_SITUACION!A:J,5,0),0)","v":0},{"$f":"IFERROR(VLOOKUP(A220,EEFF_SITUACION!A:J,10,0),0)","v":0},null,{"$f":"IFERROR(VLOOKUP(A220,EEFF_SITUACION!A:L,12,0),0)","v":"La cuenta Intereses minoritarios - Evolución, representa el 0,00% del total del Capital, que comparado al periodo anterior genera una variación absoluta de 0 000,00 que corresponde a un Aumento del 0,00% de recursos disponibles."}]
[]
[]
[]
["Notas Estado de Rendimiento Financiero Comparativo"]
["INGRESOS"]
[]
[]
["Cuenta ","Descripción","Nota","Periodo Actual","Periodo Anterior","Diferencia "]
[null,null,null,null,null,"%"]
["4.1.1.",{"$f":"IFERROR(VLOOKUP(A230,EEFF_RENDIMIENTOS!A:E,2,0),\"\")","v":"Impuestos sobre los ingresos, las utilidades y las ganancias de capital"},{"$f":"IFERROR(VLOOKUP(A230,EEFF_RENDIMIENTOS!A:E,3,0),0)","v":31},{"$f":"IFERROR(VLOOKUP(A230,EEFF_RENDIMIENTOS!A:J,4,0),0)","v":0},{"$f":"IFERROR(VLOOKUP(A230,EEFF_RENDIMIENTOS!A:J,5,0),0)","v":0},{"$f":"IFERROR(VLOOKUP(A230,EEFF_RENDIMIENTOS!A:J,10,0),0)","v":0},null,{"$f":"IFERROR(VLOOKUP(A230,EEFF_RENDIMIENTOS!A:L,12,0),0)","v":"La cuenta Impuestos sobre los ingresos, las utilidades y las ganancias de capital, representa el 0,00% del total del Ingresos, que comparado al periodo anterior genera una variación absoluta de 0 000,00 que corresponde a un Aumento del 0,00% de recursos disponibles."}]
[]
["Cuenta ","Descripción","Nota","Periodo Actual","Periodo Anterior","Diferencia "]
[null,null,null,null,null,"%"]
["4.1.2.",{"$f":"IFERROR(VLOOKUP(A234,EEFF_RENDIMIENTOS!A:E,2,0),\"\")","v":"Impuestos sobre la propiedad"},{"$f":"IFERROR(VLOOKUP(A234,EEFF_RENDIMIENTOS!A:E,3,0),0)","v":"32"},{"$f":"IFERROR(VLOOKUP(A234,EEFF_RENDIMIENTOS!A:J,4,0),0)","v":0},{"$f":"IFERROR(VLOOKUP(A234,EEFF_RENDIMIENTOS!A:J,5,0),0)","v":0},{"$f":"IFERROR(VLOOKUP(A234,EEFF_RENDIMIENTOS!A:J,10,0),0)","v":0},null,{"$f":"IFERROR(VLOOKUP(A234,EEFF_RENDIMIENTOS!A:L,12,0),0)","v":"La cuenta Impuestos sobre la propiedad, representa el 0,00% del total del Ingresos, que comparado al periodo anterior genera una variación absoluta de 0 000,00 que corresponde a un Aumento del 0,00% de recursos disponibles."}]
[]
["Cuenta ","Descripción","Nota","Periodo Actual","Periodo Anterior","Diferencia "]
[null,null,null,null,null,"%"]
["4.1.3.",{"$f":"IFERROR(VLOOKUP(A238,EEFF_RENDIMIENTOS!A:E,2,0),\"\")","v":"Impuestos sobre bienes y servicios"},{"$f":"IFERROR(VLOOKUP(A238,EEFF_RENDIMIENTOS!A:E,3,0),0)","v":"33"},{"$f":"IFERROR(VLOOKUP(A238,EEFF_RENDIMIENTOS!A:J,4,0),0)","v":0},{"$f":"IFERROR(VLOOKUP(A238,EEFF_RENDIMIENTOS!A:J,5,0),0)","v":0},{"$f":"IFERROR(VLOOKUP(A238,EEFF_RENDIMIENTOS!A:J,10,0),0)","v":0},null,{"$f":"IFERROR(VLOOKUP(A238,EEFF_RENDIMIENTOS!A:L,12,0),0)","v":"La cuenta Impuestos sobre bienes y servicios, representa el 0,00% del total del Ingresos, que comparado al periodo anterior genera una variación absoluta de 0 000,00 que corresponde a un Aumento del 0,00% de recursos disponibles."}]
[]
["Cuenta ","Descripción","Nota","Periodo Actual","Periodo Anterior","Diferencia "]
[null,null,null,null,null,"%"]
["4.1.4.",{"$f":"IFERROR(VLOOKUP(A242,EEFF_RENDIMIENTOS!A:E,2,0),\"\")","v":"Impuestos sobre el comercio exterior y transacciones internacionales"},{"$f":"IFERROR(VLOOKUP(A242,EEFF_RENDIMIENTOS!A:E,3,0),0)","v":"34"},{"$f":"IFERROR(VLOOKUP(A242,EEFF_RENDIMIENTOS!A:J,4,0),0)","v":0},{"$f":"IFERROR(VLOOKUP(A242,EEFF_RENDIMIENTOS!A:J,5,0),0)","v":0},{"$f":"IFERROR(VLOOKUP(A242,EEFF_RENDIMIENTOS!A:J,10,0),0)","v":0},null,{"$f":"IFERROR(VLOOKUP(A242,EEFF_RENDIMIENTOS!A:L,12,0),0)","v":"La cuenta Impuestos sobre el comercio exterior y transacciones internacionales, representa el 0,00% del total del Ingresos, que comparado al periodo anterior genera una variación absoluta de 0 000,00 que corresponde a un Aumento del 0,00% de recursos disponibles."}]
[]
["Cuenta ","Descripción","Nota","Periodo Actual","Periodo Anterior","Diferencia "]
[null,null,null,null,null,"%"]
["4.1.9.",{"$f":"IFERROR(VLOOKUP(A246,EEFF_RENDIMIENTOS!A:E,2,0),\"\")","v":"Otros impuestos"},{"$f":"IFERROR(VLOOKUP(A246,EEFF_RENDIMIENTOS!A:E,3,0),0)","v":"35"},{"$f":"IFERROR(VLOOKUP(A246,EEFF_RENDIMIENTOS!A:J,4,0),0)","v":0},{"$f":"IFERROR(VLOOKUP(A246,EEFF_RENDIMIENTOS!A:J,5,0),0)","v":0},{"$f":"IFERROR(VLOOKUP(A246,EEFF_RENDIMIENTOS!A:J,10,0),0)","v":0},null,{"$f":"IFERROR(VLOOKUP(A246,EEFF_RENDIMIENTOS!A:L,12,0),0)","v":"La cuenta Otros impuestos, representa el 0,00% del total del Ingresos, que comparado al periodo anterior genera una variación absoluta de 0 000,00 que corresponde a un Aumento del 0,00% de recursos disponibles."}]
[]
["Cuenta ","Descripción","Nota","Periodo Actual","Periodo Anterior","Diferencia "]
[null,null,null,null,null,"%"]
["4.2.1.",{"$f":"IFERROR(VLOOKUP(A250,EEFF_RENDIMIENTOS!A:E,2,0),\"\")","v":"Contribuciones a la seguridad social"},{"$f":"IFERROR(VLOOKUP(A250,EEFF_RENDIMIENTOS!A:E,3,0),0)","v":"36"},{"$f":"IFERROR(VLOOKUP(A250,EEFF_RENDIMIENTOS!A:J,4,0),0)","v":0},{"$f":"IFERROR(VLOOKUP(A250,EEFF_RENDIMIENTOS!A:J,5,0),0)","v":0},{"$f":"IFERROR(VLOOKUP(A250,EEFF_RENDIMIENTOS!A:J,10,0),0)","v":0},null,{"$f":"IFERROR(VLOOKUP(A250,EEFF_RENDIMIENTOS!A:L,12,0),0)","v":"La cuenta Contribuciones a la seguridad social, representa el 0,00% del total del Ingresos, que comparado al periodo anterior genera una variación absoluta de 0 000,00 que corresponde a un Aumento del 0,00% de recursos disponibles."}]
[]
["Cuenta ","Descripción","Nota","Periodo Actual","Periodo Anterior","Diferencia "]
[null,null,null,null,null,"%"]
["4.2.9.",{"$f":"IFERROR(VLOOKUP(A254,EEFF_RENDIMIENTOS!A:E,2,0),\"\")","v":"Contribuciones sociales diversas"},{"$f":"IFERROR(VLOOKUP(A254,EEFF_RENDIMIENTOS!A:E,3,0),0)","v":"37"},{"$f":"IFERROR(VLOOKUP(A254,EEFF_RENDIMIENTOS!A:J,4,0),0)","v":0},{"$f":"IFERROR(VLOOKUP(A254,EEFF_RENDIMIENTOS!A:J,5,0),0)","v":0},{"$f":"IFERROR(VLOOKUP(A254,EEFF_RENDIMIENTOS!A:J,10,0),0)","v":0},null,{"$f":"IFERROR(VLOOKUP(A254,EEFF_RENDIMIENTOS!A:L,12,0),0)","v":"La cuenta Contribuciones sociales diversas, representa el 0,00% del total del Ingresos, que comparado al periodo anterior genera una variación absoluta de 0 000,00 que corresponde a un Aumento del 0,00% de recursos disponibles."}]
[]
["Cuenta ","Descripción","Nota","Periodo Actual","Periodo Anterior","Diferencia "]
[null,null,null,null,null,"%"]
["4.3.1.",{"$f":"IFERROR(VLOOKUP(A258,EEFF_RENDIMIENTOS!A:E,2,0),\"\")","v":"Multas y sanciones administrativas"},{"$f":"IFERROR(VLOOKUP(A258,EEFF_RENDIMIENTOS!A:E,3,0),0)","v":"38"},{"$f":"IFERROR(VLOOKUP(A258,EEFF_RENDIMIENTOS!A:J,4,0),0)","v":0},{"$f":"IFERROR(VLOOKUP(A258,EEFF_RENDIMIENTOS!A:J,5,0),0)","v":0},{"$f":"IFERROR(VLOOKUP(A258,EEFF_RENDIMIENTOS!A:J,10,0),0)","v":0},null,{"$f":"IFERROR(VLOOKUP(A258,EEFF_RENDIMIENTOS!A:L,12,0),0)","v":"La cuenta Multas y sanciones administrativas, representa el 0,00% del total del Ingresos, que comparado al periodo anterior genera una variación absoluta de 0 000,00 que corresponde a un Aumento del 0,00% de recursos disponibles."}]
[]
["Cuenta ","Descripción","Nota","Periodo Actual","Periodo Anterior","Diferencia "]
[null,null,null,null,null,"%"]
["4.3.2.",{"$f":"IFERROR(VLOOKUP(A262,EEFF_RENDIMIENTOS!A:E,2,0),\"\")","v":"Remates y confiscaciones de origen no tributario"},{"$f":"IFERROR(VLOOKUP(A262,EEFF_RENDIMIENTOS!A:E,3,0),0)","v":"39"},{"$f":"IFERROR(VLOOKUP(A262,EEFF_RENDIMIENTOS!A:J,4,0),0)","v":0},{"$f":"IFERROR(VLOOKUP(A262,EEFF_RENDIMIENTOS!A:J,5,0),0)","v":0},{"$f":"IFERROR(VLOOKUP(A262,EEFF_RENDIMIENTOS!A:J,10,0),0)","v":0},null,{"$f":"IFERROR(VLOOKUP(A262,EEFF_RENDIMIENTOS!A:L,12,0),0)","v":"La cuenta Remates y confiscaciones de origen no tributario, representa el 0,00% del total del Ingresos, que comparado al periodo anterior genera una variación absoluta de 0 000,00 que corresponde a un Aumento del 0,00% de recursos disponibles."}]
[]
["Cuenta ","Descripción","Nota","Periodo Actual","Periodo Anterior","Diferencia "]
[null,null,null,null,null,"%"]
["4.3.3.",{"$f":"IFERROR(VLOOKUP(A266,EEFF_RENDIMIENTOS!A:E,2,0),\"\")","v":"Intereses Moratorios"},{"$f":"IFERROR(VLOOKUP(A266,EEFF_RENDIMIENTOS!A:E,3,0),0)","v":"40"},{"$f":"IFERROR(VLOOKUP(A266,EEFF_RENDIMIENTOS!A:J,4,0),0)","v":0},{"$f":"IFERROR(VLOOKUP(A266,EEFF_RENDIMIENTOS!A:J,5,0),0)","v":0},{"$f":"IFERROR(VLOOKUP(A266,EEFF_RENDIMIENTOS!A:J,10,0),0)","v":0},null,{"$f":"IFERROR(VLOOKUP(A266,EEFF_RENDIMIENTOS!A:L,12,0),0)","v":"La cuenta Intereses Moratorios, representa el 0,00% del total del Ingresos, que comparado al periodo anterior genera una variación absoluta de 0 000,00 que corresponde a un Aumento del 0,00% de recursos disponibles."}]
[]
["Cuenta ","Descripción","Nota","Periodo Actual","Periodo Anterior","Diferencia "]
[null,null,null,null,null,"%"]
["4.4.1.",{"$f":"IFERROR(VLOOKUP(A270,EEFF_RENDIMIENTOS!A:E,2,0),\"\")","v":"Ventas de bienes y servicios"},{"$f":"IFERROR(VLOOKUP(A270,EEFF_RENDIMIENTOS!A:E,3,0),0)","v":"41"},{"$f":"IFERROR(VLOOKUP(A270,EEFF_RENDIMIENTOS!A:J,4,0),0)","v":0},{"$f":"IFERROR(VLOOKUP(A270,EEFF_RENDIMIENTOS!A:J,5,0),0)","v":0},{"$f":"IFERROR(VLOOKUP(A270,EEFF_RENDIMIENTOS!A:J,10,0),0)","v":0},null,{"$f":"IFERROR(VLOOKUP(A270,EEFF_RENDIMIENTOS!A:L,12,0),0)","v":"La cuenta Ventas de bienes y servicios, representa el 0,00% del total del Ingresos, que comparado al periodo anterior genera una variación absoluta de 0 000,00 que corresponde a un Aumento del 0,00% de recursos disponibles."}]
[]
["Cuenta ","Descripción","Nota","Periodo Actual","Periodo Anterior","Diferencia "]
[null,null,null,null,null,"%"]
["4.4.2.",{"$f":"IFERROR(VLOOKUP(A274,EEFF_RENDIMIENTOS!A:E,2,0),\"\")","v":"Derechos administrativos"},{"$f":"IFERROR(VLOOKUP(A274,EEFF_RENDIMIENTOS!A:E,3,0),0)","v":"42"},{"$f":"IFERROR(VLOOKUP(A274,EEFF_RENDIMIENTOS!A:J,4,0),0)","v":0},{"$f":"IFERROR(VLOOKUP(A274,EEFF_RENDIMIENTOS!A:J,5,0),0)","v":0},{"$f":"IFERROR(VLOOKUP(A274,EEFF_RENDIMIENTOS!A:J,10,0),0)","v":0},null,{"$f":"IFERROR(VLOOKUP(A274,EEFF_RENDIMIENTOS!A:L,12,0),0)","v":"La cuenta Derechos administrativos, representa el 0,00% del total del Ingresos, que comparado al periodo anterior genera una variación absoluta de 0 000,00 que corresponde a un Aumento del 0,00% de recursos disponibles."}]
[]
["Cuenta ","Descripción","Nota","Periodo Actual","Periodo Anterior","Diferencia "]
[null,null,null,null,null,"%"]
["4.4.3.",{"$f":"IFERROR(VLOOKUP(A278,EEFF_RENDIMIENTOS!A:E,2,0),\"\")","v":"Comisiones por préstamos"},{"$f":"IFERROR(VLOOKUP(A278,EEFF_RENDIMIENTOS!A:E,3,0),0)","v":"43"},{"$f":"IFERROR(VLOOKUP(A278,EEFF_RENDIMIENTOS!A:J,4,0),0)","v":0},{"$f":"IFERROR(VLOOKUP(A278,EEFF_RENDIMIENTOS!A:J,5,0),0)","v":0},{"$f":"IFERROR(VLOOKUP(A278,EEFF_RENDIMIENTOS!A:J,10,0),0)","v":0},null,{"$f":"IFERROR(VLOOKUP(A278,EEFF_RENDIMIENTOS!A:L,12,0),0)","v":"La cuenta Comisiones por préstamos, representa el 0,00% del total del Ingresos, que comparado al periodo anterior genera una variación absoluta de 0 000,00 que corresponde a un Aumento del 0,00% de recursos disponibles."}]
[]
["Cuenta ","Descripción","Nota","Periodo Actual","Periodo Anterior","Diferencia "]
[null,null,null,null,null,"%"]
["4.4.4.",{"$f":"IFERROR(VLOOKUP(A282,EEFF_RENDIMIENTOS!A:E,2,0),\"\")","v":"Resultados positivos por ventas de inversiones"},{"$f":"IFERROR(VLOOKUP(A282,EEFF_RENDIMIENTOS!A:E,3,0),0)","v":"44"},{"$f":"IFERROR(VLOOKUP(A282,EEFF_RENDIMIENTOS!A:J,4,0),0)","v":0},{"$f":"IFERROR(VLOOKUP(A282,EEFF_RENDIMIENTOS!A:J,5,0),0)","v":0},{"$f":"IFERROR(VLOOKUP(A282,EEFF_RENDIMIENTOS!A:J,10,0),0)","v":0},null,{"$f":"IFERROR(VLOOKUP(A282,EEFF_RENDIMIENTOS!A:L,12,0),0)","v":"La cuenta Resultados positivos por ventas de inversiones, representa el 0,00% del total del Ingresos, que comparado al periodo anterior genera una variación absoluta de 0 000,00 que corresponde a un Aumento del 0,00% de recursos disponibles."}]
[]
["Cuenta ","Descripción","Nota","Periodo Actual","Periodo Anterior","Diferencia "]
[null,null,null,null,null,"%"]
["4.4.5.",{"$f":"IFERROR(VLOOKUP(A286,EEFF_RENDIMIENTOS!A:E,2,0),\"\")","v":"Resultados positivos por ventas e intercambio de bienes"},{"$f":"IFERROR(VLOOKUP(A286,EEFF_RENDIMIENTOS!A:E,3,0),0)","v":"45"},{"$f":"IFERROR(VLOOKUP(A286,EEFF_RENDIMIENTOS!A:J,4,0),0)","v":0},{"$f":"IFERROR(VLOOKUP(A286,EEFF_RENDIMIENTOS!A:J,5,0),0)","v":0},{"$f":"IFERROR(VLOOKUP(A286,EEFF_RENDIMIENTOS!A:J,10,0),0)","v":0},null,{"$f":"IFERROR(VLOOKUP(A286,EEFF_RENDIMIENTOS!A:L,12,0),0)","v":"La cuenta Resultados positivos por ventas e intercambio de bienes, representa el 0,00% del total del Ingresos, que comparado al periodo anterior genera una variación absoluta de 0 000,00 que corresponde a un Aumento del 0,00% de recursos disponibles."}]
[]
["Cuenta ","Descripción","Nota","Periodo Actual","Periodo Anterior","Diferencia "]
[null,null,null,null,null,"%"]
["4.4.6.",{"$f":"IFERROR(VLOOKUP(A290,EEFF_RENDIMIENTOS!A:E,2,0),\"\")","v":"Resultados positivos por la recuperación de dinero mal acreditado de periodos anteriores"},{"$f":"IFERROR(VLOOKUP(A290,EEFF_RENDIMIENTOS!A:E,3,0),0)","v":"46"},{"$f":"IFERROR(VLOOKUP(A290,EEFF_RENDIMIENTOS!A:J,4,0),0)","v":0},{"$f":"IFERROR(VLOOKUP(A290,EEFF_RENDIMIENTOS!A:J,5,0),0)","v":0},{"$f":"IFERROR(VLOOKUP(A290,EEFF_RENDIMIENTOS!A:J,10,0),0)","v":0},null,{"$f":"IFERROR(VLOOKUP(A290,EEFF_RENDIMIENTOS!A:L,12,0),0)","v":"La cuenta Resultados positivos por la recuperación de dinero mal acreditado de periodos anteriores, representa el 0,00% del total del Ingresos, que comparado al periodo anterior genera una variación absoluta de 0 000,00 que corresponde a un Aumento del 0,00% de recursos disponibles."}]
[]
["Cuenta ","Descripción","Nota","Periodo Actual","Periodo Anterior","Diferencia "]
[null,null,null,null,null,"%"]
["4.5.1.",{"$f":"IFERROR(VLOOKUP(A294,EEFF_RENDIMIENTOS!A:E,2,0),\"\")","v":"Rentas de inversiones y de colocación de efectivo"},{"$f":"IFERROR(VLOOKUP(A294,EEFF_RENDIMIENTOS!A:E,3,0),0)","v":"47"},{"$f":"IFERROR(VLOOKUP(A294,EEFF_RENDIMIENTOS!A:J,4,0),0)","v":0},{"$f":"IFERROR(VLOOKUP(A294,EEFF_RENDIMIENTOS!A:J,5,0),0)","v":0},{"$f":"IFERROR(VLOOKUP(A294,EEFF_RENDIMIENTOS!A:J,10,0),0)","v":0},null,{"$f":"IFERROR(VLOOKUP(A294,EEFF_RENDIMIENTOS!A:L,12,0),0)","v":"La cuenta Rentas de inversiones y de colocación de efectivo, representa el 0,00% del total del Ingresos, que comparado al periodo anterior genera una variación absoluta de 0 000,00 que corresponde a un Aumento del 0,00% de recursos disponibles."}]
[]
["Cuenta ","Descripción","Nota","Periodo Actual","Periodo Anterior","Diferencia "]
[null,null,null,null,null,"%"]
["4.5.2.",{"$f":"IFERROR(VLOOKUP(A298,EEFF_RENDIMIENTOS!A:E,2,0),\"\")","v":"Alquileres y derechos sobre bienes"},{"$f":"IFERROR(VLOOKUP(A298,EEFF_RENDIMIENTOS!A:E,3,0),0)","v":"48"},{"$f":"IFERROR(VLOOKUP(A298,EEFF_RENDIMIENTOS!A:J,4,0),0)","v":0},{"$f":"IFERROR(VLOOKUP(A298,EEFF_RENDIMIENTOS!A:J,5,0),0)","v":0},{"$f":"IFERROR(VLOOKUP(A298,EEFF_RENDIMIENTOS!A:J,10,0),0)","v":0},null,{"$f":"IFERROR(VLOOKUP(A298,EEFF_RENDIMIENTOS!A:L,12,0),0)","v":"La cuenta Alquileres y derechos sobre bienes, representa el 0,00% del total del Ingresos, que comparado al periodo anterior genera una variación absoluta de 0 000,00 que corresponde a un Aumento del 0,00% de recursos disponibles."}]
[]
["Cuenta ","Descripción","Nota","Periodo Actual","Periodo Anterior","Diferencia "]
[null,null,null,null,null,"%"]
["4.5.2.01.",{"$f":"IFERROR(VLOOKUP(A302,EEFF_RENDIMIENTOS!A:E,2,0),\"\")","v":"Alquileres"},{"$f":"C298","v":"48"},{"$f":"IFERROR(VLOOKUP(A302,EEFF_RENDIMIENTOS!A:J,4,0),0)","v":0},{"$f":"IFERROR(VLOOKUP(A302,EEFF_RENDIMIENTOS!A:J,5,0),0)","v":0},{"$f":"IFERROR(VLOOKUP(A302,EEFF_RENDIMIENTOS!A:J,10,0),0)","v":0},null,{"$f":"IFERROR(VLOOKUP(A302,EEFF_RENDIMIENTOS!A:L,12,0),0)","v":"La cuenta Alquileres, representa el 0,00% del total del Ingresos, que comparado al periodo anterior genera una variación absoluta de 0 000,00 que corresponde a un Aumento del 0,00% de recursos disponibles."}]
[]
["Cuenta ","Descripción","Nota","Periodo Actual","Periodo Anterior","Diferencia "]
[null,null,null,null,null,"%"]
["4.5.9.",{"$f":"IFERROR(VLOOKUP(A306,EEFF_RENDIMIENTOS!A:E,2,0),\"\")","v":"Otros ingresos de la propiedad"},{"$f":"IFERROR(VLOOKUP(A306,EEFF_RENDIMIENTOS!A:E,3,0),0)","v":"49"},{"$f":"IFERROR(VLOOKUP(A306,EEFF_RENDIMIENTOS!A:J,4,0),0)","v":0},{"$f":"IFERROR(VLOOKUP(A306,EEFF_RENDIMIENTOS!A:J,5,0),0)","v":0},{"$f":"IFERROR(VLOOKUP(A306,EEFF_RENDIMIENTOS!A:J,10,0),0)","v":0},null,{"$f":"IFERROR(VLOOKUP(A306,EEFF_RENDIMIENTOS!A:L,12,0),0)","v":"La cuenta Otros ingresos de la propiedad, representa el 0,00% del total del Ingresos, que comparado al periodo anterior genera una variación absoluta de 0 000,00 que corresponde a un Aumento del 0,00% de recursos disponibles."}]
[]
["Cuenta ","Descripción","Nota","Periodo Actual","Periodo Anterior","Diferencia "]
[null,null,null,null,null,"%"]
["4.6.1.",{"$f":"IFERROR(VLOOKUP(A310,EEFF_RENDIMIENTOS!A:E,2,0),\"\")","v":"Transferencias corrientes"},{"$f":"IFERROR(VLOOKUP(A310,EEFF_RENDIMIENTOS!A:E,3,0),0)","v":"50"},{"$f":"IFERROR(VLOOKUP(A310,EEFF_RENDIMIENTOS!A:J,4,0),0)","v":0},{"$f":"IFERROR(VLOOKUP(A310,EEFF_RENDIMIENTOS!A:J,5,0),0)","v":0},{"$f":"IFERROR(VLOOKUP(A310,EEFF_RENDIMIENTOS!A:J,10,0),0)","v":0},null,{"$f":"IFERROR(VLOOKUP(A310,EEFF_RENDIMIENTOS!A:L,12,0),0)","v":"La cuenta Transferencias corrientes, representa el 0,00% del total del Ingresos, que comparado al periodo anterior genera una variación absoluta de 0 000,00 que corresponde a un Aumento del 0,00% de recursos disponibles."}]
[]
["Cuenta ","Descripción","Nota","Periodo Actual","Periodo Anterior","Diferencia "]
[null,null,null,null,null,"%"]
["4.6.2.",{"$f":"IFERROR(VLOOKUP(A314,EEFF_RENDIMIENTOS!A:E,2,0),\"\")","v":"Transferencias de capital"},{"$f":"IFERROR(VLOOKUP(A314,EEFF_RENDIMIENTOS!A:E,3,0),0)","v":"51"},{"$f":"IFERROR(VLOOKUP(A314,EEFF_RENDIMIENTOS!A:J,4,0),0)","v":0},{"$f":"IFERROR(VLOOKUP(A314,EEFF_RENDIMIENTOS!A:J,5,0),0)","v":0},{"$f":"IFERROR(VLOOKUP(A314,EEFF_RENDIMIENTOS!A:J,10,0),0)","v":0},null,{"$f":"IFERROR(VLOOKUP(A314,EEFF_RENDIMIENTOS!A:L,12,0),0)","v":"La cuenta Transferencias de capital, representa el 0,00% del total del Ingresos, que comparado al periodo anterior genera una variación absoluta de 0 000,00 que corresponde a un Aumento del 0,00% de recursos disponibles."}]
[]
["Cuenta ","Descripción","Nota","Periodo Actual","Periodo Anterior","Diferencia "]
[null,null,null,null,null,"%"]
["4.9.1.",{"$f":"IFERROR(VLOOKUP(A318,EEFF_RENDIMIENTOS!A:E,2,0),\"\")","v":"Resultados positivos por tenencia y por exposición a la inflación"},{"$f":"IFERROR(VLOOKUP(A318,EEFF_RENDIMIENTOS!A:E,3,0),0)","v":"52"},{"$f":"IFERROR(VLOOKUP(A318,EEFF_RENDIMIENTOS!A:J,4,0),0)","v":0},{"$f":"IFERROR(VLOOKUP(A318,EEFF_RENDIMIENTOS!A:J,5,0),0)","v":0},{"$f":"IFERROR(VLOOKUP(A318,EEFF_RENDIMIENTOS!A:J,10,0),0)","v":0},null,{"$f":"IFERROR(VLOOKUP(A318,EEFF_RENDIMIENTOS!A:L,12,0),0)","v":"La cuenta Resultados positivos por tenencia y por exposición a la inflación, representa el 0,00% del total del Ingresos, que comparado al periodo anterior genera una variación absoluta de 0 000,00 que corresponde a un Aumento del 0,00% de recursos disponibles."}]
[]
["Cuenta ","Descripción","Nota","Periodo Actual","Periodo Anterior","Diferencia "]
[null,null,null,null,null,"%"]
["4.9.2.",{"$f":"IFERROR(VLOOKUP(A322,EEFF_RENDIMIENTOS!A:E,2,0),\"\")","v":"Reversión de consumo de bienes"},{"$f":"IFERROR(VLOOKUP(A322,EEFF_RENDIMIENTOS!A:E,3,0),0)","v":"53"},{"$f":"IFERROR(VLOOKUP(A322,EEFF_RENDIMIENTOS!A:J,4,0),0)","v":0},{"$f":"IFERROR(VLOOKUP(A322,EEFF_RENDIMIENTOS!A:J,5,0),0)","v":0},{"$f":"IFERROR(VLOOKUP(A322,EEFF_RENDIMIENTOS!A:J,10,0),0)","v":0},null,{"$f":"IFERROR(VLOOKUP(A322,EEFF_RENDIMIENTOS!A:L,12,0),0)","v":"La cuenta Reversión de consumo de bienes, representa el 0,00% del total del Ingresos, que comparado al periodo anterior genera una variación absoluta de 0 000,00 que corresponde a un Aumento del 0,00% de recursos disponibles."}]
[]
["Cuenta ","Descripción","Nota","Periodo Actual","Periodo Anterior","Diferencia "]
[null,null,null,null,null,"%"]
["4.9.3.",{"$f":"IFERROR(VLOOKUP(A326,EEFF_RENDIMIENTOS!A:E,2,0),\"\")","v":"Reversión de pérdidas por deterioro y desvalorización de bienes"},{"$f":"IFERROR(VLOOKUP(A326,EEFF_RENDIMIENTOS!A:E,3,0),0)","v":"54"},{"$f":"IFERROR(VLOOKUP(A326,EEFF_RENDIMIENTOS!A:J,4,0),0)","v":0},{"$f":"IFERROR(VLOOKUP(A326,EEFF_RENDIMIENTOS!A:J,5,0),0)","v":0},{"$f":"IFERROR(VLOOKUP(A326,EEFF_RENDIMIENTOS!A:J,10,0),0)","v":0},null,{"$f":"IFERROR(VLOOKUP(A326,EEFF_RENDIMIENTOS!A:L,12,0),0)","v":"La cuenta Reversión de pérdidas por deterioro y desvalorización de bienes, representa el 0,00% del total del Ingresos, que comparado al periodo anterior genera una variación absoluta de 0 000,00 que corresponde a un Aumento del 0,00% de recursos disponibles."}]
[]
["Cuenta ","Descripción","Nota","Periodo Actual","Periodo Anterior","Diferencia "]
[null,null,null,null,null,"%"]
["4.9.4.",{"$f":"IFERROR(VLOOKUP(A330,EEFF_RENDIMIENTOS!A:E,2,0),\"\")","v":"Recuperación de previsiones"},{"$f":"IFERROR(VLOOKUP(A330,EEFF_RENDIMIENTOS!A:E,3,0),0)","v":"55"},{"$f":"IFERROR(VLOOKUP(A330,EEFF_RENDIMIENTOS!A:J,4,0),0)","v":0},{"$f":"IFERROR(VLOOKUP(A330,EEFF_RENDIMIENTOS!A:J,5,0),0)","v":0},{"$f":"IFERROR(VLOOKUP(A330,EEFF_RENDIMIENTOS!A:J,10,0),0)","v":0},null,{"$f":"IFERROR(VLOOKUP(A330,EEFF_RENDIMIENTOS!A:L,12,0),0)","v":"La cuenta Recuperación de previsiones, representa el 0,00% del total del Ingresos, que comparado al periodo anterior genera una variación absoluta de 0 000,00 que corresponde a un Aumento del 0,00% de recursos disponibles."}]
[]
["Cuenta ","Descripción","Nota","Periodo Actual","Periodo Anterior","Diferencia "]
[null,null,null,null,null,"%"]
["4.9.5.",{"$f":"IFERROR(VLOOKUP(A334,EEFF_RENDIMIENTOS!A:E,2,0),\"\")","v":"Recuperación de provisiones y reservas técnicas"},{"$f":"IFERROR(VLOOKUP(A334,EEFF_RENDIMIENTOS!A:E,3,0),0)","v":"56"},{"$f":"IFERROR(VLOOKUP(A334,EEFF_RENDIMIENTOS!A:J,4,0),0)","v":0},{"$f":"IFERROR(VLOOKUP(A334,EEFF_RENDIMIENTOS!A:J,5,0),0)","v":0},{"$f":"IFERROR(VLOOKUP(A334,EEFF_RENDIMIENTOS!A:J,10,0),0)","v":0},null,{"$f":"IFERROR(VLOOKUP(A334,EEFF_RENDIMIENTOS!A:L,12,0),0)","v":"La cuenta Recuperación de provisiones y reservas técnicas, representa el 0,00% del total del Ingresos, que comparado al periodo anterior genera una variación absoluta de 0 000,00 que corresponde a un Aumento del 0,00% de recursos disponibles."}]
[]
["Cuenta ","Descripción","Nota","Periodo Actual","Periodo Anterior","Diferencia "]
[null,null,null,null,null,"%"]
["4.9.6.",{"$f":"IFERROR(VLOOKUP(A338,EEFF_RENDIMIENTOS!A:E,2,0),\"\")","v":"Resultados positivos de inversiones patrimoniales y participación de los intereses minoritarios"},{"$f":"IFERROR(VLOOKUP(A338,EEFF_RENDIMIENTOS!A:E,3,0),0)","v":"57"},{"$f":"IFERROR(VLOOKUP(A338,EEFF_RENDIMIENTOS!A:J,4,0),0)","v":0},{"$f":"IFERROR(VLOOKUP(A338,EEFF_RENDIMIENTOS!A:J,5,0),0)","v":0},{"$f":"IFERROR(VLOOKUP(A338,EEFF_RENDIMIENTOS!A:J,10,0),0)","v":0},null,{"$f":"IFERROR(VLOOKUP(A338,EEFF_RENDIMIENTOS!A:L,12,0),0)","v":"La cuenta Resultados positivos de inversiones patrimoniales y participación de los intereses minoritarios, representa el 0,00% del total del Ingresos, que comparado al periodo anterior genera una variación absoluta de 0 000,00 que corresponde a un Aumento del 0,00% de recursos disponibles."}]
[]
["Cuenta ","Descripción","Nota","Periodo Actual","Periodo Anterior","Diferencia "]
[null,null,null,null,null,"%"]
["4.9.9.",{"$f":"IFERROR(VLOOKUP(A342,EEFF_RENDIMIENTOS!A:E,2,0),\"\")","v":"Otros ingresos y resultados positivos"},{"$f":"IFERROR(VLOOKUP(A342,EEFF_RENDIMIENTOS!A:E,3,0),0)","v":"58"},{"$f":"IFERROR(VLOOKUP(A342,EEFF_RENDIMIENTOS!A:J,4,0),0)","v":0},{"$f":"IFERROR(VLOOKUP(A342,EEFF_RENDIMIENTOS!A:J,5,0),0)","v":0},{"$f":"IFERROR(VLOOKUP(A342,EEFF_RENDIMIENTOS!A:J,10,0),0)","v":0},null,{"$f":"IFERROR(VLOOKUP(A342,EEFF_RENDIMIENTOS!A:L,12,0),0)","v":"La cuenta Otros ingresos y resultados positivos, representa el 0,00% del total del Ingresos, que comparado al periodo anterior genera una variación absoluta de 0 000,00 que corresponde a un Aumento del 0,00% de recursos disponibles."}]
[]
[]
["GASTOS"]
[]
["Cuenta ","Descripción","Nota","Periodo Actual","Periodo Anterior","Diferencia "]
[null,null,null,null,null,"%"]
["5.1.1.",{"$f":"IFERROR(VLOOKUP(A349,EEFF_RENDIMIENTOS!A:E,2,0),\"\")","v":"Gastos en personal"},{"$f":"IFERROR(VLOOKUP(A349,EEFF_RENDIMIENTOS!A:E,3,0),0)","v":"59"},{"$f":"IFERROR(VLOOKUP(A349,EEFF_RENDIMIENTOS!A:J,4,0),0)","v":0},{"$f":"IFERROR(VLOOKUP(A349,EEFF_RENDIMIENTOS!A:J,5,0),0)","v":0},{"$f":"IFERROR(VLOOKUP(A349,EEFF_RENDIMIENTOS!A:J,10,0),0)","v":0},null,{"$f":"IFERROR(VLOOKUP(A349,EEFF_RENDIMIENTOS!A:L,12,0),0)","v":"La cuenta Gastos en personal, representa el 0,00% del total del Gastos, que comparado al periodo anterior genera una variación absoluta de 0 000,00 que corresponde a un Aumento del 0,00% de recursos disponibles."}]
[]
["Cuenta ","Descripción","Nota","Periodo Actual","Periodo Anterior","Diferencia "]
[null,null,null,null,null,"%"]
["5.1.2.",{"$f":"IFERROR(VLOOKUP(A353,EEFF_RENDIMIENTOS!A:E,2,0),\"\")","v":"Servicios"},{"$f":"IFERROR(VLOOKUP(A353,EEFF_RENDIMIENTOS!A:E,3,0),0)","v":"60"},{"$f":"IFERROR(VLOOKUP(A353,EEFF_RENDIMIENTOS!A:J,4,0),0)","v":0},{"$f":"IFERROR(VLOOKUP(A353,EEFF_RENDIMIENTOS!A:J,5,0),0)","v":0},{"$f":"IFERROR(VLOOKUP(A353,EEFF_RENDIMIENTOS!A:J,10,0),0)","v":0},null,{"$f":"IFERROR(VLOOKUP(A353,EEFF_RENDIMIENTOS!A:L,12,0),0)","v":"La cuenta Servicios, representa el 0,00% del total del Gastos, que comparado al periodo anterior genera una variación absoluta de 0 000,00 que corresponde a un Aumento del 0,00% de recursos disponibles."}]
[]
["Cuenta ","Descripción","Nota","Periodo Actual","Periodo Anterior","Diferencia "]
[null,null,null,null,null,"%"]
["5.1.2.01.",{"$f":"IFERROR(VLOOKUP(A357,EEFF_RENDIMIENTOS!A:E,2,0),\"\")","v":"Alquileres y derechos sobre bienes"},{"$f":"C353","v":"60"},{"$f":"IFERROR(VLOOKUP(A357,EEFF_RENDIMIENTOS!A:J,4,0),0)","v":0},{"$f":"IFERROR(VLOOKUP(A357,EEFF_RENDIMIENTOS!A:J,5,0),0)","v":0},{"$f":"IFERROR(VLOOKUP(A357,EEFF_RENDIMIENTOS!A:J,10,0),0)","v":0},null,{"$f":"IFERROR(VLOOKUP(A357,EEFF_RENDIMIENTOS!A:L,12,0),0)","v":"La cuenta Alquileres y derechos sobre bienes, representa el 0,00% del total del Gastos, que comparado al periodo anterior genera una variación absoluta de 0 000,00 que corresponde a un Aumento del 0,00% de recursos disponibles."}]
[]
["Cuenta ","Descripción","Nota","Periodo Actual","Periodo Anterior","Diferencia "]
[null,null,null,null,null,"%"]
["5.1.3.",{"$f":"IFERROR(VLOOKUP(A361,EEFF_RENDIMIENTOS!A:E,2,0),\"\")","v":"Materiales y suministros consumidos"},{"$f":"IFERROR(VLOOKUP(A361,EEFF_RENDIMIENTOS!A:E,3,0),0)","v":"61"},{"$f":"IFERROR(VLOOKUP(A361,EEFF_RENDIMIENTOS!A:J,4,0),0)","v":0},{"$f":"IFERROR(VLOOKUP(A361,EEFF_RENDIMIENTOS!A:J,5,0),0)","v":0},{"$f":"IFERROR(VLOOKUP(A361,EEFF_RENDIMIENTOS!A:J,10,0),0)","v":0},null,{"$f":"IFERROR(VLOOKUP(A361,EEFF_RENDIMIENTOS!A:L,12,0),0)","v":"La cuenta Materiales y suministros consumidos, representa el 0,00% del total del Gastos, que comparado al periodo anterior genera una variación absoluta de 0 000,00 que corresponde a un Aumento del 0,00% de recursos disponibles."}]
[]
["Cuenta ","Descripción","Nota","Periodo Actual","Periodo Anterior","Diferencia "]
[null,null,null,null,null,"%"]
["5.1.4.",{"$f":"IFERROR(VLOOKUP(A365,EEFF_RENDIMIENTOS!A:E,2,0),\"\")","v":"Consumo de bienes distintos de inventarios"},{"$f":"IFERROR(VLOOKUP(A365,EEFF_RENDIMIENTOS!A:E,3,0),0)","v":"62"},{"$f":"IFERROR(VLOOKUP(A365,EEFF_RENDIMIENTOS!A:J,4,0),0)","v":0},{"$f":"IFERROR(VLOOKUP(A365,EEFF_RENDIMIENTOS!A:J,5,0),0)","v":0},{"$f":"IFERROR(VLOOKUP(A365,EEFF_RENDIMIENTOS!A:J,10,0),0)","v":0},null,{"$f":"IFERROR(VLOOKUP(A365,EEFF_RENDIMIENTOS!A:L,12,0),0)","v":"La cuenta Consumo de bienes distintos de inventarios, representa el 0,00% del total del Gastos, que comparado al periodo anterior genera una variación absoluta de 0 000,00 que corresponde a un Aumento del 0,00% de recursos disponibles."}]
[]
["Cuenta ","Descripción","Nota","Periodo Actual","Periodo Anterior","Diferencia "]
[null,null,null,null,null,"%"]
["5.1.5.",{"$f":"IFERROR(VLOOKUP(A369,EEFF_RENDIMIENTOS!A:E,2,0),\"\")","v":"Pérdidas por deterioro y desvalorización de bienes "},{"$f":"IFERROR(VLOOKUP(A369,EEFF_RENDIMIENTOS!A:E,3,0),0)","v":"63"},{"$f":"IFERROR(VLOOKUP(A369,EEFF_RENDIMIENTOS!A:J,4,0),0)","v":0},{"$f":"IFERROR(VLOOKUP(A369,EEFF_RENDIMIENTOS!A:J,5,0),0)","v":0},{"$f":"IFERROR(VLOOKUP(A369,EEFF_RENDIMIENTOS!A:J,10,0),0)","v":0},null,{"$f":"IFERROR(VLOOKUP(A369,EEFF_RENDIMIENTOS!A:L,12,0),0)","v":"La cuenta Pérdidas por deterioro y desvalorización de bienes , representa el 0,00% del total del Gastos, que comparado al periodo anterior genera una variación absoluta de 0 000,00 que corresponde a un Aumento del 0,00% de recursos disponibles."}]
[]
["Cuenta ","Descripción","Nota","Periodo Actual","Periodo Anterior","Diferencia "]
[null,null,null,null,null,"%"]
["5.1.6.",{"$f":"IFERROR(VLOOKUP(A373,EEFF_RENDIMIENTOS!A:E,2,0),\"\")","v":"Deterioro y pérdidas de inventarios"},{"$f":"IFERROR(VLOOKUP(A373,EEFF_RENDIMIENTOS!A:E,3,0),0)","v":"64"},{"$f":"IFERROR(VLOOKUP(A373,EEFF_RENDIMIENTOS!A:J,4,0),0)","v":0},{"$f":"IFERROR(VLOOKUP(A373,EEFF_RENDIMIENTOS!A:J,5,0),0)","v":0},{"$f":"IFERROR(VLOOKUP(A373,EEFF_RENDIMIENTOS!A:J,10,0),0)","v":0},null,{"$f":"IFERROR(VLOOKUP(A373,EEFF_RENDIMIENTOS!A:L,12,0),0)","v":"La cuenta Deterioro y pérdidas de inventarios, representa el 0,00% del total del Gastos, que comparado al periodo anterior genera una variación absoluta de 0 000,00 que corresponde a un Aumento del 0,00% de recursos disponibles."}]
[]
["Cuenta ","Descripción","Nota","Periodo Actual","Periodo Anterior","Diferencia "]
[null,null,null,null,null,"%"]
["5.1.7.",{"$f":"IFERROR(VLOOKUP(A377,EEFF_RENDIMIENTOS!A:E,2,0),\"\")","v":"Deterioro de inversiones y cuentas a cobrar"},{"$f":"IFERROR(VLOOKUP(A377,EEFF_RENDIMIENTOS!A:E,3,0),0)","v":"65"},{"$f":"IFERROR(VLOOKUP(A377,EEFF_RENDIMIENTOS!A:J,4,0),0)","v":0},{"$f":"IFERROR(VLOOKUP(A377,EEFF_RENDIMIENTOS!A:J,5,0),0)","v":0},{"$f":"IFERROR(VLOOKUP(A377,EEFF_RENDIMIENTOS!A:J,10,0),0)","v":0},null,{"$f":"IFERROR(VLOOKUP(A377,EEFF_RENDIMIENTOS!A:L,12,0),0)","v":"La cuenta Deterioro de inversiones y cuentas a cobrar, representa el 0,00% del total del Gastos, que comparado al periodo anterior genera una variación absoluta de 0 000,00 que corresponde a un Aumento del 0,00% de recursos disponibles."}]
[]
["Cuenta ","Descripción","Nota","Periodo Actual","Periodo Anterior","Diferencia "]
[null,null,null,null,null,"%"]
["5.1.8.",{"$f":"IFERROR(VLOOKUP(A381,EEFF_RENDIMIENTOS!A:E,2,0),\"\")","v":"Cargos por provisiones y reservas técnicas"},{"$f":"IFERROR(VLOOKUP(A381,EEFF_RENDIMIENTOS!A:E,3,0),0)","v":"66"},{"$f":"IFERROR(VLOOKUP(A381,EEFF_RENDIMIENTOS!A:J,4,0),0)","v":0},{"$f":"IFERROR(VLOOKUP(A381,EEFF_RENDIMIENTOS!A:J,5,0),0)","v":0},{"$f":"IFERROR(VLOOKUP(A381,EEFF_RENDIMIENTOS!A:J,10,0),0)","v":0},null,{"$f":"IFERROR(VLOOKUP(A381,EEFF_RENDIMIENTOS!A:L,12,0),0)","v":"La cuenta Cargos por provisiones y reservas técnicas, representa el 0,00% del total del Gastos, que comparado al periodo anterior genera una variación absoluta de 0 000,00 que corresponde a un Aumento del 0,00% de recursos disponibles."}]
[]
["Cuenta ","Descripción","Nota","Periodo Actual","Periodo Anterior","Diferencia "]
[null,null,null,null,null,"%"]
["5.1.8.01.",{"$f":"IFERROR(VLOOKUP(A385,EEFF_RENDIMIENTOS!A:E,2,0),\"\")","v":"Cargos por litigios y demandas"},{"$f":"C381","v":"66"},{"$f":"IFERROR(VLOOKUP(A385,EEFF_RENDIMIENTOS!A:J,4,0),0)","v":0},{"$f":"IFERROR(VLOOKUP(A385,EEFF_RENDIMIENTOS!A:J,5,0),0)","v":0},{"$f":"IFERROR(VLOOKUP(A385,EEFF_RENDIMIENTOS!A:J,10,0),0)","v":0},null,{"$f":"IFERROR(VLOOKUP(A385,EEFF_RENDIMIENTOS!A:L,12,0),0)","v":"La cuenta Cargos por litigios y demandas, representa el 0,00% del total del Gastos, que comparado al periodo anterior genera una variación absoluta de 0 000,00 que corresponde a un Aumento del 0,00% de recursos disponibles."}]
[]
["Cuenta ","Descripción","Nota","Periodo Actual","Periodo Anterior","Diferencia "]
[null,null,null,null,null,"%"]
["5.2.1.",{"$f":"IFERROR(VLOOKUP(A389,EEFF_RENDIMIENTOS!A:E,2,0),\"\")","v":"Intereses sobre endeudamiento público"},{"$f":"IFERROR(VLOOKUP(A389,EEFF_RENDIMIENTOS!A:E,3,0),0)","v":"67"},{"$f":"IFERROR(VLOOKUP(A389,EEFF_RENDIMIENTOS!A:J,4,0),0)","v":0},{"$f":"IFERROR(VLOOKUP(A389,EEFF_RENDIMIENTOS!A:J,5,0),0)","v":0},{"$f":"IFERROR(VLOOKUP(A389,EEFF_RENDIMIENTOS!A:J,10,0),0)","v":0},null,{"$f":"IFERROR(VLOOKUP(A389,EEFF_RENDIMIENTOS!A:L,12,0),0)","v":"La cuenta Intereses sobre endeudamiento público, representa el 0,00% del total del Gastos, que comparado al periodo anterior genera una variación absoluta de 0 000,00 que corresponde a un Aumento del 0,00% de recursos disponibles."}]
[]
["Cuenta ","Descripción","Nota","Periodo Actual","Periodo Anterior","Diferencia "]
[null,null,null,null,null,"%"]
["5.2.9.",{"$f":"IFERROR(VLOOKUP(A393,EEFF_RENDIMIENTOS!A:E,2,0),\"\")","v":"Otros gastos financieros"},{"$f":"IFERROR(VLOOKUP(A393,EEFF_RENDIMIENTOS!A:E,3,0),0)","v":"68"},{"$f":"IFERROR(VLOOKUP(A393,EEFF_RENDIMIENTOS!A:J,4,0),0)","v":0},{"$f":"IFERROR(VLOOKUP(A393,EEFF_RENDIMIENTOS!A:J,5,0),0)","v":0},{"$f":"IFERROR(VLOOKUP(A393,EEFF_RENDIMIENTOS!A:J,10,0),0)","v":0},null,{"$f":"IFERROR(VLOOKUP(A393,EEFF_RENDIMIENTOS!A:L,12,0),0)","v":"La cuenta Otros gastos financieros, representa el 0,00% del total del Gastos, que comparado al periodo anterior genera una variación absoluta de 0 000,00 que corresponde a un Aumento del 0,00% de recursos disponibles."}]
[]
["Cuenta ","Descripción","Nota","Periodo Actual","Periodo Anterior","Diferencia "]
[null,null,null,null,null,"%"]
["5.3.1.",{"$f":"IFERROR(VLOOKUP(A397,EEFF_RENDIMIENTOS!A:E,2,0),\"\")","v":"Costo de ventas de bienes y servicios"},{"$f":"IFERROR(VLOOKUP(A397,EEFF_RENDIMIENTOS!A:E,3,0),0)","v":"69"},{"$f":"IFERROR(VLOOKUP(A397,EEFF_RENDIMIENTOS!A:J,4,0),0)","v":0},{"$f":"IFERROR(VLOOKUP(A397,EEFF_RENDIMIENTOS!A:J,5,0),0)","v":0},{"$f":"IFERROR(VLOOKUP(A397,EEFF_RENDIMIENTOS!A:J,10,0),0)","v":0},null,{"$f":"IFERROR(VLOOKUP(A397,EEFF_RENDIMIENTOS!A:L,12,0),0)","v":"La cuenta Costo de ventas de bienes y servicios, representa el 0,00% del total del Gastos, que comparado al periodo anterior genera una variación absoluta de 0 000,00 que corresponde a un Aumento del 0,00% de recursos disponibles."}]
[]
["Cuenta ","Descripción","Nota","Periodo Actual","Periodo Anterior","Diferencia "]
[null,null,null,null,null,"%"]
["5.3.2.",{"$f":"IFERROR(VLOOKUP(A401,EEFF_RENDIMIENTOS!A:E,2,0),\"\")","v":"Resultados negativos por ventas de inversiones"},{"$f":"IFERROR(VLOOKUP(A401,EEFF_RENDIMIENTOS!A:E,3,0),0)","v":"70"},{"$f":"IFERROR(VLOOKUP(A401,EEFF_RENDIMIENTOS!A:J,4,0),0)","v":0},{"$f":"IFERROR(VLOOKUP(A401,EEFF_RENDIMIENTOS!A:J,5,0),0)","v":0},{"$f":"IFERROR(VLOOKUP(A401,EEFF_RENDIMIENTOS!A:J,10,0),0)","v":0},null,{"$f":"IFERROR(VLOOKUP(A401,EEFF_RENDIMIENTOS!A:L,12,0),0)","v":"La cuenta Resultados negativos por ventas de inversiones, representa el 0,00% del total del Gastos, que comparado al periodo anterior genera una variación absoluta de 0 000,00 que corresponde a un Aumento del 0,00% de recursos disponibles."}]
[]
["Cuenta ","Descripción","Nota","Periodo Actual","Periodo Anterior","Diferencia "]
[null,null,null,null,null,"%"]
["5.3.3.",{"$f":"IFERROR(VLOOKUP(A405,EEFF_RENDIMIENTOS!A:E,2,0),\"\")","v":"Resultados negativos por ventas e intercambio de bienes"},{"$f":"IFERROR(VLOOKUP(A405,EEFF_RENDIMIENTOS!A:E,3,0),0)","v":"71"},{"$f":"IFERROR(VLOOKUP(A405,EEFF_RENDIMIENTOS!A:J,4,0),0)","v":0},{"$f":"IFERROR(VLOOKUP(A405,EEFF_RENDIMIENTOS!A:J,5,0),0)","v":0},{"$f":"IFERROR(VLOOKUP(A405,EEFF_RENDIMIENTOS!A:J,10,0),0)","v":0},null,{"$f":"IFERROR(VLOOKUP(A405,EEFF_RENDIMIENTOS!A:L,12,0),0)","v":"La cuenta Resultados negativos por ventas e intercambio de bienes, representa el 0,00% del total del Gastos, que comparado al periodo anterior genera una variación absoluta de 0 000,00 que corresponde a un Aumento del 0,00% de recursos disponibles."}]
[]
["Cuenta ","Descripción","Nota","Periodo Actual","Periodo Anterior","Diferencia "]
[null,null,null,null,null,"%"]
["5.4.1.",{"$f":"IFERROR(VLOOKUP(A409,EEFF_RENDIMIENTOS!A:E,2,0),\"\")","v":"Transferencias corrientes"},{"$f":"IFERROR(VLOOKUP(A409,EEFF_RENDIMIENTOS!A:E,3,0),0)","v":"72"},{"$f":"IFERROR(VLOOKUP(A409,EEFF_RENDIMIENTOS!A:J,4,0),0)","v":0},{"$f":"IFERROR(VLOOKUP(A409,EEFF_RENDIMIENTOS!A:J,5,0),0)","v":0},{"$f":"IFERROR(VLOOKUP(A409,EEFF_RENDIMIENTOS!A:J,10,0),0)","v":0},null,{"$f":"IFERROR(VLOOKUP(A409,EEFF_RENDIMIENTOS!A:L,12,0),0)","v":"La cuenta Transferencias corrientes, representa el 0,00% del total del Gastos, que comparado al periodo anterior genera una variación absoluta de 0 000,00 que corresponde a un Aumento del 0,00% de recursos disponibles."}]
[]
["Cuenta ","Descripción","Nota","Periodo Actual","Periodo Anterior","Diferencia "]
[null,null,null,null,null,"%"]
["5.4.2.",{"$f":"IFERROR(VLOOKUP(A413,EEFF_RENDIMIENTOS!A:E,2,0),\"\")","v":"Transferencias de capital"},{"$f":"IFERROR(VLOOKUP(A413,EEFF_RENDIMIENTOS!A:E,3,0),0)","v":"73"},{"$f":"IFERROR(VLOOKUP(A413,EEFF_RENDIMIENTOS!A:J,4,0),0)","v":0},{"$f":"IFERROR(VLOOKUP(A413,EEFF_RENDIMIENTOS!A:J,5,0),0)","v":0},{"$f":"IFERROR(VLOOKUP(A413,EEFF_RENDIMIENTOS!A:J,10,0),0)","v":0},null,{"$f":"IFERROR(VLOOKUP(A413,EEFF_RENDIMIENTOS!A:L,12,0),0)","v":"La cuenta Transferencias de capital, representa el 0,00% del total del Gastos, que comparado al periodo anterior genera una variación absoluta de 0 000,00 que corresponde a un Aumento del 0,00% de recursos disponibles."}]
[]
["Cuenta ","Descripción","Nota","Periodo Actual","Periodo Anterior","Diferencia "]
[null,null,null,null,null,"%"]
["5.9.1.",{"$f":"IFERROR(VLOOKUP(A417,EEFF_RENDIMIENTOS!A:E,2,0),\"\")","v":"Resultados negativos por tenencia y por exposición a la inflación"},{"$f":"IFERROR(VLOOKUP(A417,EEFF_RENDIMIENTOS!A:E,3,0),0)","v":"74"},{"$f":"IFERROR(VLOOKUP(A417,EEFF_RENDIMIENTOS!A:J,4,0),0)","v":0},{"$f":"IFERROR(VLOOKUP(A417,EEFF_RENDIMIENTOS!A:J,5,0),0)","v":0},{"$f":"IFERROR(VLOOKUP(A417,EEFF_RENDIMIENTOS!A:J,10,0),0)","v":0},null,{"$f":"IFERROR(VLOOKUP(A417,EEFF_RENDIMIENTOS!A:L,12,0),0)","v":"La cuenta Resultados negativos por tenencia y por exposición a la inflación, representa el 0,00% del total del Gastos, que comparado al periodo anterior genera una variación absoluta de 0 000,00 que corresponde a un Aumento del 0,00% de recursos disponibles."}]
[]
["Cuenta ","Descripción","Nota","Periodo Actual","Periodo Anterior","Diferencia "]
[null,null,null,null,null,"%"]
["5.9.2.",{"$f":"IFERROR(VLOOKUP(A421,EEFF_RENDIMIENTOS!A:E,2,0),\"\")","v":"Resultados negativos de inversiones patrimoniales y participación de los intereses minoritarios"},{"$f":"IFERROR(VLOOKUP(A421,EEFF_RENDIMIENTOS!A:E,3,0),0)","v":"75"},{"$f":"IFERROR(VLOOKUP(A421,EEFF_RENDIMIENTOS!A:J,4,0),0)","v":0},{"$f":"IFERROR(VLOOKUP(A421,EEFF_RENDIMIENTOS!A:J,5,0),0)","v":0},{"$f":"IFERROR(VLOOKUP(A421,EEFF_RENDIMIENTOS!A:J,10,0),0)","v":0},null,{"$f":"IFERROR(VLOOKUP(A421,EEFF_RENDIMIENTOS!A:L,12,0),0)","v":"La cuenta Resultados negativos de inversiones patrimoniales y participación de los intereses minoritarios, representa el 0,00% del total del Gastos, que comparado al periodo anterior genera una variación absoluta de 0 000,00 que corresponde a un Aumento del 0,00% de recursos disponibles."}]
[]
["Cuenta ","Descripción","Nota","Periodo Actual","Periodo Anterior","Diferencia "]
[null,null,null,null,null,"%"]
["5.9.9.",{"$f":"IFERROR(VLOOKUP(A425,EEFF_RENDIMIENTOS!A:E,2,0),\"\")","v":"Otros gastos y resultados negativos"},{"$f":"IFERROR(VLOOKUP(A425,EEFF_RENDIMIENTOS!A:E,3,0),0)","v":"76"},{"$f":"IFERROR(VLOOKUP(A425,EEFF_RENDIMIENTOS!A:J,4,0),0)","v":0},{"$f":"IFERROR(VLOOKUP(A425,EEFF_RENDIMIENTOS!A:J,5,0),0)","v":0},{"$f":"IFERROR(VLOOKUP(A425,EEFF_RENDIMIENTOS!A:J,10,0),0)","v":0},null,{"$f":"IFERROR(VLOOKUP(A425,EEFF_RENDIMIENTOS!A:L,12,0),0)","v":"La cuenta Otros gastos y resultados negativos, representa el 0,00% del total del Gastos, que comparado al periodo anterior genera una variación absoluta de 0 000,00 que corresponde a un Aumento del 0,00% de recursos disponibles."}]
[]
[]
["Notas Estado de Flujo de Efectivo Comparativo"]
[]
["FLUJOS DE EFECTIVO DE LAS ACTIVIDADES DE OPERACIÓN"]
[]
[null,"Descripción ","Nota","Periodo Actual","Periodo Anterior","Diferencia "]
[null,null,null,null,null,"%"]
["COBROS_OPE","Cobros",{"$f":"VLOOKUP(A434,EEFF_FLUJO!B:J,2,0)","v":77},{"$f":"VLOOKUP(A434,EEFF_FLUJO!B:J,3,0)","v":0},{"$f":"VLOOKUP(A434,EEFF_FLUJO!B:J,4,0)","v":0},{"$f":"VLOOKUP(A434,EEFF_FLUJO!B:J,9,0)","v":0},null,{"$f":"VLOOKUP(A434,EEFF_FLUJO!B:L,11,0)","v":"Los Cobros de los Flujos de Efectivo de las Actividades de Operación, comparado al periodo anterior genera una variación absoluta de 0 000,00 que corresponde a un Aumento del 0,00% de recursos disponibles."}]
[]
[null,"Descripción ","Nota","Periodo Actual","Periodo Anterior","Diferencia "]
[null,null,null,null,null,"%"]
["PAGOS_OPE","Pagos",{"$f":"VLOOKUP(A438,EEFF_FLUJO!B:J,2,0)","v":78},{"$f":"VLOOKUP(A438,EEFF_FLUJO!B:J,3,0)","v":0},{"$f":"VLOOKUP(A438,EEFF_FLUJO!B:J,4,0)","v":0},{"$f":"VLOOKUP(A438,EEFF_FLUJO!B:J,9,0)","v":0},null,{"$f":"VLOOKUP(A438,EEFF_FLUJO!B:L,11,0)","v":"Los Pagos de los Flujos de Efectivo de las Actividades de Operación, comparado al periodo anterior genera una variación absoluta de 0 000,00 que corresponde a un Aumento del 0,00% de recursos disponibles."}]
[]
[]
["FLUJOS DE EFECTIVO DE LAS ACTIVIDADES DE INVERSIÓN"]
[]
[null,"Descripción ","Nota","Periodo Actual","Periodo Anterior","Diferencia "]
[null,null,null,null,null,"%"]
["COBROS_INV","Cobros",{"$f":"VLOOKUP(A445,EEFF_FLUJO!B:J,2,0)","v":79},{"$f":"VLOOKUP(A445,EEFF_FLUJO!B:J,3,0)","v":0},{"$f":"VLOOKUP(A445,EEFF_FLUJO!B:J,4,0)","v":0},{"$f":"VLOOKUP(A445,EEFF_FLUJO!B:J,9,0)","v":0},null,{"$f":"VLOOKUP(A445,EEFF_FLUJO!B:L,11,0)","v":"Los Cobros de los Flujos de Efectivo de las Actividades de Inversión, comparado al periodo anterior genera una variación absoluta de 0 000,00 que corresponde a un Aumento del 0,00% de recursos disponibles."}]
[]
[null,"Descripción ","Nota","Periodo Actual","Periodo Anterior","Diferencia "]
[null,null,null,null,null,"%"]
["PAGOS_INV","Pagos",{"$f":"VLOOKUP(A449,EEFF_FLUJO!B:J,2,0)","v":80},{"$f":"VLOOKUP(A449,EEFF_FLUJO!B:J,3,0)","v":0},{"$f":"VLOOKUP(A449,EEFF_FLUJO!B:J,4,0)","v":0},{"$f":"VLOOKUP(A449,EEFF_FLUJO!B:J,9,0)","v":0},null,{"$f":"VLOOKUP(A449,EEFF_FLUJO!B:L,11,0)","v":"Los Pagos de los Flujos de Efectivo de las Actividades de Inversión, comparado al periodo anterior genera una variación absoluta de 0 000,00 que corresponde a un Aumento del 0,00% de recursos disponibles."}]
[]
[]
["FLUJOS DE EFECTIVO DE LAS ACTIVIDADES DE FINANCIACIÓN"]
[]
[null,"Descripción ","Nota","Periodo Actual","Periodo Anterior","Diferencia "]
[null,null,null,null,null,"%"]
["COBROS_FIN","Cobros",{"$f":"VLOOKUP(A456,EEFF_FLUJO!B:J,2,0)","v":81},{"$f":"VLOOKUP(A456,EEFF_FLUJO!B:J,3,0)","v":0},{"$f":"VLOOKUP(A456,EEFF_FLUJO!B:J,4,0)","v":0},{"$f":"VLOOKUP(A456,EEFF_FLUJO!B:J,9,0)","v":0},null,{"$f":"VLOOKUP(A456,EEFF_FLUJO!B:L,11,0)","v":"Los Cobros de los Flujos de Efectivo de las Actividades de Financiamiento, comparado al periodo anterior genera una variación absoluta de 0 000,00 que corresponde a un Aumento del 0,00% de recursos disponibles."}]
[]
[null,"Descripción ","Nota","Periodo Actual","Periodo Anterior","Diferencia "]
[null,null,null,null,null,"%"]
["PAGOS_FIN","Pagos",{"$f":"VLOOKUP(A460,EEFF_FLUJO!B:J,2,0)","v":82},{"$f":"VLOOKUP(A460,EEFF_FLUJO!B:J,3,0)","v":0},{"$f":"VLOOKUP(A460,EEFF_FLUJO!B:J,4,0)","v":0},{"$f":"VLOOKUP(A460,EEFF_FLUJO!B:J,9,0)","v":0},null,{"$f":"VLOOKUP(A460,EEFF_FLUJO!B:L,11,0)","v":"Los Pagos de los Flujos de Efectivo de las Actividades de Financiamiento, comparado al periodo anterior genera una variación absoluta de 0 000,00 que corresponde a un Aumento del 0,00% de recursos disponibles."}]
[]
[null,"Descripción ","Nota","Periodo Actual","Periodo Anterior","Diferencia "]
[null,null,null,null,null,"%"]
[null,"Efectivo y equivalentes de efectivo al final del ejercicio",{"$f":"VLOOKUP(B464,EEFF_FLUJO!A:J,3,0)","v":83},{"$f":"VLOOKUP(B464,EEFF_FLUJO!A:J,4,0)","v":0},{"$f":"VLOOKUP(B464,EEFF_FLUJO!A:J,5,0)","v":0},{"$f":"VLOOKUP(B464,EEFF_FLUJO!A:J,10,0)","v":0},null,{"$f":"VLOOKUP(B464,EEFF_FLUJO!A:L,12,0)","v":"La cuenta Efectivo y equivalentes de efectivo al final del ejercicio, comparado al periodo anterior genera una variación absoluta de 0 000,00 que corresponde a un Aumento del 0,00% de recursos disponibles."}]
[]
[]
["Notas Estado de Cambios en el Patrimonio Comparativo"]
[]
[null,"Descripción ","Nota ","Periodo Actual","Periodo Anterior","Diferencia "]
[null,null,null,null,null,"%"]
[null,"Saldos del período",84,{"$f":"VLOOKUP(C471,EEFF_CAPITAL!A:I,3,0)","v":0},{"$f":"VLOOKUP(C471,EEFF_CAPITAL!A:I,4,0)","v":0},{"$f":"VLOOKUP(C471,EEFF_CAPITAL!A:I,9,0)","v":0},null,{"$f":"VLOOKUP(B471,EEFF_CAPITAL!B:K,10,0)","v":"En el Estado de Cambio al Patrimonio, el Saldo del periodo al 31 de diciembre 2022, comparado al periodo anterior genera una variación absoluta de 0 000,00 que corresponde a un Aumento del 0,00% de recursos disponibles."}]

{"sheet":"NICSP","index":9,"n_rows":49,"n_cols":9,"rows_kept":49,"cut":false,"hidden":false,"merged":[[1,1,1,7],[14,3,14,7],[15,3,15,7],[16,3,16,7],[32,3,32,7],[8,1,8,2],[2,1,2,7],[3,1,3,7]]}
[]
[null,{"$f":"DATOS!D13","v":""}]
[null,"Cuadro Resumen - Normativa Contable"]
[null,"Normas Internacionales de Contabilidad para el Sector Pública"]
[]
[null,"Este apartado se completa de forma automática al pegar la información de la pestaña \"MATRIZ_AUTOEVALUACION\", con excepción de la aplicación de los fideicomisos"]
[null,"por lo que en esta sección se le solicita indicar SI - NO de acuerdo a la situación de la entidad."]
[]
[null,"NORMA",null,"NORMA TRANSITORIO","FECHA","APLICACIÓN","GRADO APLICACION","APLICACIÓN TRANSITORIO"]
["NICSP_1","NICSP 1","Presentación Estados Financieros","SI","2024-12-31",{"$f":"OFFSET(MATRIZ_AUTOVALUACION!D11,0,3)","v":0},{"$f":"OFFSET(MATRIZ_AUTOVALUACION!D11,0,4)","v":0},{"$f":"OFFSET(MATRIZ_AUTOVALUACION!D11,0,8)","v":0},{"$f":"IFERROR(IF(AND(F10=\"NO\",H10=\"SI\"),\"ERROR\",\"\"),\"\")","v":""}]
["NICSP_2","NICSP 2","Estado Flujo de Efectivo","NO","31-12-2022",{"$f":"OFFSET(MATRIZ_AUTOVALUACION!D12,0,3)","v":0},{"$f":"OFFSET(MATRIZ_AUTOVALUACION!D12,0,4)","v":0},{"$f":"OFFSET(MATRIZ_AUTOVALUACION!D12,0,8)","v":0},{"$f":"IFERROR(IF(AND(F11=\"NO\",H11=\"SI\"),\"ERROR\",\"\"),\"\")","v":""}]
["NICSP_3","NICSP 3","Políticas Contables, Cambios en las estimaciones contables y Errores","NO","31-12-2022",{"$f":"OFFSET(MATRIZ_AUTOVALUACION!D13,0,3)","v":0},{"$f":"OFFSET(MATRIZ_AUTOVALUACION!D13,0,4)","v":0},{"$f":"OFFSET(MATRIZ_AUTOVALUACION!D13,0,8)","v":0},""]
["NICSP_4","NICSP 4","Efectos de las variaciones en las tasas de cambio de la moneda","NO","31-12-2022",{"$f":"OFFSET(MATRIZ_AUTOVALUACION!D14,0,3)","v":0},{"$f":"OFFSET(MATRIZ_AUTOVALUACION!D14,0,4)","v":0},{"$f":"OFFSET(MATRIZ_AUTOVALUACION!D14,0,8)","v":0},""]
["NICSP_5","NICSP 5","Costo por Préstamos","SI","2024-12-31",{"$f":"OFFSET(MATRIZ_AUTOVALUACION!D15,0,3)","v":0},{"$f":"OFFSET(MATRIZ_AUTOVALUACION!D15,0,4)","v":0},{"$f":"OFFSET(MATRIZ_AUTOVALUACION!D15,0,8)","v":0},""]
["NICSP_6","NICSP 6","Estados Financieros Consolidados y separados.","Derogada en la versión 2018"]
["NICSP_7","NICSP 7","Inversiones en Asociadas","Derogada en la versión 2018"]
["NICSP_8","NICSP 8","Participaciones en Negocios Conjuntos","Derogada en la versión 2018"]
["NICSP_9","NICSP 9","Ingresos de transacciones con contraprestación","NO","31-12-2022",{"$f":"OFFSET(MATRIZ_AUTOVALUACION!D16,0,3)","v":0},{"$f":"OFFSET(MATRIZ_AUTOVALUACION!D16,0,4)","v":0},{"$f":"OFFSET(MATRIZ_AUTOVALUACION!D16,0,8)","v":0},""]
["NICSP_10","NICSP 10","Información Financiera en Economía Hiperinflacionarias","NO","31-12-2022",{"$f":"OFFSET(MATRIZ_AUTOVALUACION!D17,0,3)","v":0},{"$f":"OFFSET(MATRIZ_AUTOVALUACION!D17,0,4)","v":0},{"$f":"OFFSET(MATRIZ_AUTOVALUACION!D17,0,8)","v":0},""]
["NICSP_11","NICSP 11","Contrato de Construcción","NO","31-12-2022",{"$f":"OFFSET(MATRIZ_AUTOVALUACION!D18,0,3)","v":0},{"$f":"OFFSET(MATRIZ_AUTOVALUACION!D18,0,4)","v":0},{"$f":"OFFSET(MATRIZ_AUTOVALUACION!D18,0,8)","v":0},""]
["NICSP_12","NICSP 12","Inventarios","SI","2024-12-31",{"$f":"OFFSET(MATRIZ_AUTOVALUACION!D19,0,3)","v":0},{"$f":"OFFSET(MATRIZ_AUTOVALUACION!D19,0,4)","v":0},{"$f":"OFFSET(MATRIZ_AUTOVALUACION!D19,0,8)","v":0},""]
["NICSP_13","NICSP 13","Arrendamientos","SI","2024-12-31",{"$f":"OFFSET(MATRIZ_AUTOVALUACION!D20,0,3)","v":0},{"$f":"OFFSET(MATRIZ_AUTOVALUACION!D20,0,4)","v":0},{"$f":"OFFSET(MATRIZ_AUTOVALUACION!D20,0,8)","v":0},""]
["NICSP_14","NICSP 14","Hechos ocurridos después de la fecha de presentación.","NO","31-12-2022",{"$f":"OFFSET(MATRIZ_AUTOVALUACION!D21,0,3)","v":0},{"$f":"OFFSET(MATRIZ_AUTOVALUACION!D21,0,4)","v":0},{"$f":"OFFSET(MATRIZ_AUTOVALUACION!D21,0,8)","v":0},""]
["NICSP_16","NICSP 16","Propiedades de Inversión","SI","2024-12-31",{"$f":"OFFSET(MATRIZ_AUTOVALUACION!D22,0,3)","v":0},{"$f":"OFFSET(MATRIZ_AUTOVALUACION!D22,0,4)","v":0},{"$f":"OFFSET(MATRIZ_AUTOVALUACION!D22,0,8)","v":0},""]
["NICSP_17","NICSP 17","Propiedad, Planta y Equipo","SI","2024-12-31",{"$f":"OFFSET(MATRIZ_AUTOVALUACION!D23,0,3)","v":0},{"$f":"OFFSET(MATRIZ_AUTOVALUACION!D23,0,4)","v":0},{"$f":"OFFSET(MATRIZ_AUTOVALUACION!D23,0,8)","v":0},""]
["NICSP_18","NICSP 18","Información Financiera por Segmentos","SI","2024-12-31",{"$f":"OFFSET(MATRIZ_AUTOVALUACION!D24,0,3)","v":0},{"$f":"OFFSET(MATRIZ_AUTOVALUACION!D24,0,4)","v":0},{"$f":"OFFSET(MATRIZ_AUTOVALUACION!D24,0,8)","v":0},""]
["NICSP_19","NICSP 19","Provisiones, Pasivos contingentes y Activos Contingentes","SI","2024-12-31",{"$f":"OFFSET(MATRIZ_AUTOVALUACION!D25,0,3)","v":0},{"$f":"OFFSET(MATRIZ_AUTOVALUACION!D25,0,4)","v":0},{"$f":"OFFSET(MATRIZ_AUTOVALUACION!D25,0,8)","v":0},""]
["NICSP_20","NICSP 20","Información a Revelar sobre partes relacionadas","SI","2024-12-31",{"$f":"OFFSET(MATRIZ_AUTOVALUACION!D26,0,3)","v":0},{"$f":"OFFSET(MATRIZ_AUTOVALUACION!D26,0,4)","v":0},{"$f":"OFFSET(MATRIZ_AUTOVALUACION!D26,0,8)","v":0},""]
["NICSP_21","NICSP 21","Deterioro de Valor de Activos no generadores de Efectivo","SI","2024-12-31",{"$f":"OFFSET(MATRIZ_AUTOVALUACION!D27,0,3)","v":0},{"$f":"OFFSET(MATRIZ_AUTOVALUACION!D27,0,4)","v":0},{"$f":"OFFSET(MATRIZ_AUTOVALUACION!D27,0,8)","v":0},""]
["NICSP_22","NICSP 22","Revelación de Información Financiera sobre Sector Gobierno General","NO","31-12-2022",{"$f":"OFFSET(MATRIZ_AUTOVALUACION!D28,0,3)","v":0},{"$f":"OFFSET(MATRIZ_AUTOVALUACION!D28,0,4)","v":0},{"$f":"OFFSET(MATRIZ_AUTOVALUACION!D28,0,8)","v":0},""]
["NICSP_23","NICSP 23","Ingresos ordinarios provenientes de transacciones que no son de intercambio (Impuestos y transferencias)","SI","2024-12-31",{"$f":"OFFSET(MATRIZ_AUTOVALUACION!D29,0,3)","v":0},{"$f":"OFFSET(MATRIZ_AUTOVALUACION!D29,0,4)","v":0},{"$f":"OFFSET(MATRIZ_AUTOVALUACION!D29,0,8)","v":0},""]
["NICSP_24","NICSP 24","Presentación de Información del presupuesto en los Estados Financieros","NO","31-12-2022",{"$f":"OFFSET(MATRIZ_AUTOVALUACION!D30,0,3)","v":0},{"$f":"OFFSET(MATRIZ_AUTOVALUACION!D30,0,4)","v":0},{"$f":"OFFSET(MATRIZ_AUTOVALUACION!D30,0,8)","v":0},""]
["NICSP_25","NICSP 25","Beneficios a los Empleados","Derogada en la versión 2018"]
["NICSP_26","NICSP 26","Deterioro del Valor de Activos generadores de efectivo","SI","2024-12-31",{"$f":"OFFSET(MATRIZ_AUTOVALUACION!D31,0,3)","v":0},{"$f":"OFFSET(MATRIZ_AUTOVALUACION!D31,0,4)","v":0},{"$f":"OFFSET(MATRIZ_AUTOVALUACION!D31,0,8)","v":0},""]
["NICSP_27","NICSP 27","Agricultura","SI","2024-12-31",{"$f":"OFFSET(MATRIZ_AUTOVALUACION!D32,0,3)","v":0},{"$f":"OFFSET(MATRIZ_AUTOVALUACION!D32,0,4)","v":0},{"$f":"OFFSET(MATRIZ_AUTOVALUACION!D32,0,8)","v":0},""]
["NICSP_28","NICSP 28","Instrumentos Financieros- Presentación","NO","31-12-2022",{"$f":"OFFSET(MATRIZ_AUTOVALUACION!D33,0,3)","v":0},{"$f":"OFFSET(MATRIZ_AUTOVALUACION!D33,0,4)","v":0},{"$f":"OFFSET(MATRIZ_AUTOVALUACION!D33,0,8)","v":0},""]
["NICSP_29","NICSP 29","Instrumentos Financieros- Reconocimiento y Medición","SI","2024-12-31",{"$f":"OFFSET(MATRIZ_AUTOVALUACION!D34,0,3)","v":0},{"$f":"OFFSET(MATRIZ_AUTOVALUACION!D34,0,4)","v":0},{"$f":"OFFSET(MATRIZ_AUTOVALUACION!D34,0,8)","v":0},""]
["NICSP_30","NICSP 30","Instrumentos Financieros- Información a revelar","NO","31-12-2022",{"$f":"OFFSET(MATRIZ_AUTOVALUACION!D35,0,3)","v":0},{"$f":"OFFSET(MATRIZ_AUTOVALUACION!D35,0,4)","v":0},{"$f":"OFFSET(MATRIZ_AUTOVALUACION!D35,0,8)","v":0},""]
["NICSP_31","NICSP 31","Activos Intangibles","SI","2024-12-31",{"$f":"OFFSET(MATRIZ_AUTOVALUACION!D36,0,3)","v":0},{"$f":"OFFSET(MATRIZ_AUTOVALUACION!D36,0,4)","v":0},{"$f":"OFFSET(MATRIZ_AUTOVALUACION!D36,0,8)","v":0},""]
["NICSP_32","NICSP 32","Acuerdos de servicio de concesión: Otorgante","SI","2024-12-31",{"$f":"OFFSET(MATRIZ_AUTOVALUACION!D37,0,3)","v":0},{"$f":"OFFSET(MATRIZ_AUTOVALUACION!D37,0,4)","v":0},{"$f":"OFFSET(MATRIZ_AUTOVALUACION!D37,0,8)","v":0},""]
["NICSP_33","NICSP 33","Adopción por primera vez de las NICSP de base de acumulación (o Devengo)","NO","31-12-2022",{"$f":"OFFSET(MATRIZ_AUTOVALUACION!D38,0,3)","v":0},{"$f":"OFFSET(MATRIZ_AUTOVALUACION!D38,0,4)","v":0},{"$f":"OFFSET(MATRIZ_AUTOVALUACION!D38,0,8)","v":0},""]
["NICSP_34","NICSP 34","Estados financieros separados","SI","2024-12-31",{"$f":"OFFSET(MATRIZ_AUTOVALUACION!D39,0,3)","v":0},{"$f":"OFFSET(MATRIZ_AUTOVALUACION!D39,0,4)","v":0},{"$f":"OFFSET(MATRIZ_AUTOVALUACION!D39,0,8)","v":0},""]
["NICSP_35","NICSP 35","Estados financieros consolidados","SI","2024-12-31",{"$f":"OFFSET(MATRIZ_AUTOVALUACION!D40,0,3)","v":0},{"$f":"OFFSET(MATRIZ_AUTOVALUACION!D40,0,4)","v":0},{"$f":"OFFSET(MATRIZ_AUTOVALUACION!D40,0,8)","v":0},""]
["NICSP_36","NICSP 36","Inversiones en asociadas y negocios conjuntos","SI","2024-12-31",{"$f":"OFFSET(MATRIZ_AUTOVALUACION!D41,0,3)","v":0},{"$f":"OFFSET(MATRIZ_AUTOVALUACION!D41,0,4)","v":0},{"$f":"OFFSET(MATRIZ_AUTOVALUACION!D41,0,8)","v":0},""]
["NICSP_37","NICSP 37","Acuerdos conjuntos","NO","31-12-2022",{"$f":"OFFSET(MATRIZ_AUTOVALUACION!D42,0,3)","v":0},{"$f":"OFFSET(MATRIZ_AUTOVALUACION!D42,0,4)","v":0},{"$f":"OFFSET(MATRIZ_AUTOVALUACION!D42,0,8)","v":0},""]
["NICSP_38","NICSP 38","Revelación de intereses en otras entidades","NO","31-12-2022",{"$f":"OFFSET(MATRIZ_AUTOVALUACION!D43,0,3)","v":0},{"$f":"OFFSET(MATRIZ_AUTOVALUACION!D43,0,4)","v":0},{"$f":"OFFSET(MATRIZ_AUTOVALUACION!D43,0,8)","v":0},""]
["NICSP_39","NICSP 39","Beneficios para empleados","SI","2024-12-31",{"$f":"OFFSET(MATRIZ_AUTOVALUACION!D44,0,3)","v":0},{"$f":"OFFSET(MATRIZ_AUTOVALUACION!D44,0,4)","v":0},{"$f":"OFFSET(MATRIZ_AUTOVALUACION!D44,0,8)","v":0},""]
["NICSP_40","NICSP 40","Combinaciones en el sector público","SI","2024-12-31",{"$f":"OFFSET(MATRIZ_AUTOVALUACION!D45,0,3)","v":0},{"$f":"OFFSET(MATRIZ_AUTOVALUACION!D45,0,4)","v":0},{"$f":"OFFSET(MATRIZ_AUTOVALUACION!D45,0,8)","v":0},""]
["FIDEI",null,"Fideicomisos"]

{"sheet":"NICSP_1","index":10,"n_rows":20,"n_cols":5,"rows_kept":20,"cut":false,"hidden":false,"merged":[[13,2,13,8],[15,4,15,5]]}
[]
[null,null,"NICSP 1 - Presentación de Estados Financieros"]
[]
[null,null,"Los cuadros de aplicación y procentaje de avance se completan de forma automatica al pegar la información "]
[null,null,"de la  pestaña \"MATRIZ_AUTOEVALUACION\". De igual manera se completa de forma automatica el cuadro con respecto"]
[null,null,"a la Afirmación Explicita e Incondicional sobre el cumplimiento de las NICSP, y de las Políticas Contables Generales."]
[]
[null,null,"NICSP 1 "]
[null,"NICSP_1","Aplica",{"$f":"VLOOKUP(B9,NICSP!$A:$H,6,0)","v":0}]
[null,"NICSP_1","Porcentaje_Avance",{"$f":"VLOOKUP(B10,NICSP!$A:$H,7,0)","v":0}]
[]
[]
[]
[null,null,"El Ente Contable aplica lo dispuesto en la Resolución DCN-0003-2022 con respecto a la Afirmación Explicita e Incondicional sobre el cumplimiento de las NICSP, y de las Políticas Contables Generales."]
[]
[null,null,"APLICACIÓN",{"$f":"IF(D20=100%,\"SI\",IF(D20=0%,\"\",\"NO\"))","v":""},{"$f":"IF(D16=\"\",\"COMPLETAR_CAMPO\",\"\")","v":"COMPLETAR_CAMPO"}]
[]
[]
[]
[null,null,"Promedio_General ",{"$f":"MATRIZ_AUTOVALUACION!H47","v":0}]

{"sheet":"NICSP_2","index":11,"n_rows":10,"n_cols":4,"rows_kept":10,"cut":false,"hidden":false,"merged":[]}
[]
[null,null,"NICSP 2 - Estado de Flujo de Efectivo"]
[]
[null,null,"Los cuadros de aplicación y procentaje de avance se completan de forma automatica al pegar la información "]
[null,null,"de la  pestaña \"MATRIZ_AUTOEVALUACION\"."]
[null,null,"Si esta es de aplicación, completar los cuadros con la información respectiva"]
[]
[null,null,"NICSP 2 "]
[null,"NICSP_2","Aplica",{"$f":"VLOOKUP(B9,NICSP!$A:$H,6,0)","v":0}]
[null,"NICSP_2","Porcentaje_Avance",{"$f":"VLOOKUP(B10,NICSP!$A:$H,7,0)","v":0}]

{"sheet":"NICSP_3","index":12,"n_rows":19,"n_cols":16,"rows_kept":19,"cut":false,"hidden":false,"merged":[[12,4,12,5],[12,9,12,10],[12,14,12,15],[18,2,18,5],[18,7,18,10],[18,12,18,15]]}
[]
[null,null,"NICSP 3 - Políticas contables, cambios en las estimaciones contables y errores"]
[]
[null,null,"Los cuadros de aplicación y procentaje de avance se completan de forma automatica al pegar la información "]
[null,null,"de la  pestaña \"MATRIZ_AUTOEVALUACION\"."]
[null,null,"Si esta es de aplicación, completar los cuadros con la información respectiva"]
[]
[null,null,"NICSP 3 "]
[null,"NICSP_3","Aplica",{"$f":"VLOOKUP(B9,NICSP!$A:$H,6,0)","v":0}]
[null,"NICSP_3","Porcentaje_Avance",{"$f":"VLOOKUP(B10,NICSP!$A:$H,7,0)","v":0}]
[]
[]
[null,null,"Cambios_en_Estimación",null,{"$f":"IF(D13=\"\",\"COMPLETAR_CAMPO\",\"\")","v":"COMPLETAR_CAMPO"},null,null,"Cambios_en_Politica",null,{"$f":"IF(I13=\"\",\"COMPLETAR_CAMPO\",\"\")","v":"COMPLETAR_CAMPO"},null,null,"Errores",null,{"$f":"IF(N13=\"\",\"COMPLETAR_CAMPO\",\"\")","v":"COMPLETAR_CAMPO"}]
[]
[null,null,"Cambio Estimación","Naturaleza","Periodo","Efecto futuro",null,"Cambio Política Contable","Naturaleza","Periodo","Efecto futuro",null,"Error","Naturaleza","Periodo","Efecto futuro"]
[]
[]
[]
[null,null,{"$f":"IF(AND(D13=\"SI\",C16=\"\"),\"COMPLETAR_CAMPO\",\"\")","v":""},null,null,null,null,{"$f":"IF(AND(I13=\"SI\",H16=\"\"),\"COMPLETAR_CAMPO\",\"\")","v":""},null,null,null,null,{"$f":"IF(AND(N13=\"SI\",M16=\"\"),\"COMPLETAR_CAMPO\",\"\")","v":""}]

{"sheet":"NICSP_4","index":13,"n_rows":15,"n_cols":5,"rows_kept":15,"cut":false,"hidden":false,"merged":[]}
[]
[null,null,"NICSP 4 - Efectos de las variaciones en las tasas de cambio de la moneda"]
[]
[null,null,"Los cuadros de aplicación y procentaje de avance se completan de forma automatica al pegar la información "]
[null,null,"de la  pestaña \"MATRIZ_AUTOEVALUACION\"."]
[null,null,"Si esta es de aplicación, completar los cuadros con la información respectiva"]
[]
[null,null,"NICSP 4"]
[null,"NICSP_4","Aplica",{"$f":"VLOOKUP(B9,NICSP!$A:$H,6,0)","v":0}]
[null,"NICSP_4","Porcentaje_Avance",{"$f":"VLOOKUP(B10,NICSP!$A:$H,7,0)","v":0}]
[]
[]
[null,null,"Moneda","Compra","Venta"]
[null,null,"Dólar"]
[null,null,"Euro"]

{"sheet":"NICSP_5","index":14,"n_rows":16,"n_cols":4,"rows_kept":16,"cut":false,"hidden":false,"merged":[[15,2,15,6]]}
[]
[null,null,"NICSP 5 - Costo por Préstamos"]
[]
[null,null,"Los cuadros de aplicación y procentaje de avance se completan de forma automatica al pegar la información "]
[null,null,"de la  pestaña \"MATRIZ_AUTOEVALUACION\"."]
[null,null,"Si esta es de aplicación, completar los cuadros con la información respectiva"]
[]
[null,null,"NICSP 5"]
[null,"NICSP_5","Aplica",{"$f":"VLOOKUP(B9,NICSP!$A:$H,6,0)","v":0}]
[null,"NICSP_5","Porcentaje_Avance",{"$f":"VLOOKUP(B10,NICSP!$A:$H,7,0)","v":0}]
[]
[]
[null,null,"Se realizará la revelación considerando la política 1.172 del Plan General de Contabilidad."]
[null,null,"a) las políticas contables adoptadas con relación a los costos por préstamos;"]
[null,null,"b) el importe de los costos por préstamos capitalizados durante el período; y"]
[null,null,"c) la tasa de capitalización utilizada para determinar el importe de los costos por préstamos susceptibles de capitalización \n(si ha sido necesario aplicar una tasa de capitalización a los fondos obtenidos mediante un endeudamiento centralizado)."]

{"sheet":"NICSP_9","index":15,"n_rows":19,"n_cols":7,"rows_kept":19,"cut":false,"hidden":false,"merged":[]}
[]
[null,null,"NICSP 9 - Ingresos de transacciones con contraprestación"]
[]
[null,null,"Los cuadros de aplicación y porcentaje de avance se completan de forma automática al pegar la información "]
[null,null,"de la  pestaña \"MATRIZ_AUTOEVALUACION\"."]
[null,null,"Si esta es de aplicación, completar los cuadros con la información respectiva"]
[]
[null,null,"NICSP 9"]
[null,"NICSP_9","Aplica",{"$f":"VLOOKUP(B9,NICSP!$A:$H,6,0)","v":0},null,"TIPO DE INGRESO","TIEMPOS DEL DEVENGO:"]
[null,"NICSP_9","Porcentaje_Avance",{"$f":"VLOOKUP(B10,NICSP!$A:$H,7,0)","v":0}]
[]
[]
[]
[]
[]
[]
[]
[]
[null,null,null,null,null,null,{"$f":"IF(AND(D9=\"SI\",G10=\"\"),\"COMPLETAR_CAMPO\",\"\")","v":""}]

{"sheet":"NISCP_10","index":16,"n_rows":10,"n_cols":4,"rows_kept":10,"cut":false,"hidden":false,"merged":[]}
[]
[null,null,"NICSP 10 - Información Financiera en Economía Hiperinflacionarias"]
[]
[null,null,"Los cuadros de aplicación y procentaje de avance se completan de forma automatica al pegar la información "]
[null,null,"de la  pestaña \"MATRIZ_AUTOEVALUACION\"."]
[null,null,"Si esta es de aplicación, completar los cuadros con la información respectiva"]
[]
[null,null,"NICSP 10"]
[null,"NICSP_10","Aplica",{"$f":"VLOOKUP(B9,NICSP!$A:$H,6,0)","v":0}]
[null,"NICSP_10","Porcentaje_Avance",{"$f":"VLOOKUP(B10,NICSP!$A:$H,7,0)","v":0}]

{"sheet":"NICSP_11","index":17,"n_rows":10,"n_cols":4,"rows_kept":10,"cut":false,"hidden":false,"merged":[]}
[]
[null,null,"NICSP 11 - Contrato de Construcción"]
[]
[null,null,"Los cuadros de aplicación y procentaje de avance se completan de forma automatica al pegar la información "]
[null,null,"de la  pestaña \"MATRIZ_AUTOEVALUACION\"."]
[null,null,"Si esta es de aplicación, completar los cuadros con la información respectiva"]
[]
[null,null,"NICSP 11"]
[null,"NICSP_11","Aplica",{"$f":"VLOOKUP(B9,NICSP!$A:$H,6,0)","v":0}]
[null,"NICSP_11","Porcentaje_Avance",{"$f":"VLOOKUP(B10,NICSP!$A:$H,7,0)","v":0}]

{"sheet":"NICSP_12","index":18,"n_rows":32,"n_cols":12,"rows_kept":32,"cut":false,"hidden":false,"merged":[[18,6,18,7],[19,6,19,7],[20,6,20,7],[17,6,17,8],[11,2,11,4],[12,2,12,4],[13,2,13,4],[14,2,14,4],[15,2,15,4]]}
[]
[null,null,"NICSP 12 - Inventarios"]
[]
[null,null,"Los cuadros de aplicación y porcentaje de avance se completan de forma automática al pegar la información "]
[null,null,"de la  pestaña \"MATRIZ_AUTOEVALUACION\"."]
[null,null,"Si esta es de aplicación, completar los cuadros con la información respectiva"]
[]
[null,null,"NICSP 12"]
[null,"NICSP_12","Aplica",{"$f":"VLOOKUP(B9,NICSP!$A:$H,6,0)","v":0}]
[null,"NICSP_12","Porcentaje_Avance",{"$f":"VLOOKUP(B10,NICSP!$A:$H,7,0)","v":0}]
[]
[null,null,"TIEMPOS DEL DEVENGO:",null,null,null,"Sistema de Inventario","SI","NO"]
[null,null,"Describir los tiempos del devengo ",null,null,null,"Perpetuo o constante"]
[null,null,"en los insumos que por materialidad aplica:",null,null,null,"periódico"]
[]
[]
[]
[null,null,null,null,null,null,"Inventarios Método Valuación PEPS.",null,null,"Observaciones"]
[null,null,null,null,null,null,"Nombre de responsables institucional "]
[null,null,null,null,null,null,"Fecha de ultimo inventario físico"]
[null,null,null,null,null,null,"Fecha de ultimo asiento por depuración"]
[]
[]
[]
[]
[null,null,"Cantidad","No._inscripción","Ubicación","Categoría_Inventario","Medición","Valor_al_Inicio ","Altas"," Bajas","Monto_reconocido_como_gasto\n(En_el_Periódo)","Valor_al_Cierre"]
[null,null,null,null,null,"Bienes_Producidos_Terminados","Valor_Razonable"]
[null,null,null,null,null,"Materiales_y_suministros_para_proceso_productivo","Valor_Razonable"]
[null,null,null,null,null,"Alimentos_y_Productos_Agrícolas_posterior_Cosecha_y_Recolección","Costo"]
[]
[]
[null,null,{"$f":"SUM(C27:C31)","v":0},"Totales",null,null,null,{"$f":"SUM(H27:H31)","v":0},{"$f":"SUM(I27:I31)","v":0},0,0,0]

{"sheet":"NICSP_13","index":19,"n_rows":121,"n_cols":42,"rows_kept":121,"cut":false,"hidden":false,"merged":[[78,7,78,9],[22,6,22,12],[22,16,22,17],[22,21,22,26],[22,30,22,31],[22,33,22,35],[22,37,22,41],[19,16,19,17],[19,30,19,31],[20,16,20,17],[20,30,20,31],[21,16,21,17],[21,30,21,31],[17,38,18,38],[17,39,18,39],[17,41,18,41],[18,16,18,17],[18,30,18,31],[17,35,18,35],[17,37,18,37],[12,5,12,6],[17,6,17,17],[17,20,17,31],[17,33,18,33],[17,34,18,34],[13,5,13,6]]}
[]
[null,null,"NICSP 13 - Arrendamientos"]
[]
[null,null,"Los cuadros de aplicación y porcentaje de avance se completan de forma automática al pegar la información "]
[null,null,"de la  pestaña \"MATRIZ_AUTOEVALUACION\"."]
[null,null,"Si esta es de aplicación, completar los cuadros con la información respectiva"]
[]
[null,null,"NICSP 13"]
[null,"NICSP_13","Aplica",{"$f":"VLOOKUP(B9,NICSP!$A:$H,6,0)","v":0}]
[null,"NICSP_13","Porcentaje_Avance",{"$f":"VLOOKUP(B10,NICSP!$A:$H,7,0)","v":0}]
[]
[null,null,"Resumen","CANTIDAD ","MONTO TOTAL"]
[null,"NICSP_13_ARR_OPE","Arrendamiento Operativo",null,{"$f":"$P$23","v":0},{"$f":"IF(AND(D9=\"SI\",D13<>\"\",E13>0),\"\",IF(OR(D9=0,D9=\"NO\"),\"\",\"REVELACION_JUSTIFICAR\"))","v":""}]
[null,"NICSP_13_ARR_FIN","Arrendamiento Financiero",null,{"$f":"$AD$23","v":0},{"$f":"IF(AND(D9=\"SI\",D14<>\"\",E14>0),\"\",IF(OR(D9=0,D9=\"NO\"),\"\",\"REVELACION_JUSTIFICAR\"))","v":""}]
[]
[]
[null,null,null,null,null,null,"ANEXOS"]
[null,null,null,null,null,null,"Arrendamiento Operativo",null,null,null,null,null,null,null,null,null,null,null,null,null,"Arrendamiento Financiero",null,null,null,null,null,null,null,null,null,null,null,null,"Ítem","No. Contrato","Descripción","Monto  ","Fiduciario","Fideicomisario","Tipo Arrendamiento (Operativo/Financiero)","Valor","Observación"]
[null,null,null,null,null,null,"Ítem","No. Contrato","Descripción","Fecha Inicio","Fecha Final","Ente vinculante (Proveedor)","Moneda del Contrato","Monto ₡","Monto $","Monto Total Colones","Observación",null,null,null,"Ítem","No. Contrato","Descripción","Fecha Inicio","Fecha Final","Ente vinculante (Proveedor)","Moneda del Contrato","Monto ₡","Monto $","Monto Total Colones","Observación",null,null,null,null,null,"Fideicomitente",null,null,null,"Razonable"]
[null,null,null,null,null,null,1,null,null,null,null,null,null,null,null,null,null,null,null,null,1,null,null,null,null,null,null,null,null,null,null,null,null,1]
[null,null,null,null,null,null,2,null,null,null,null,null,null,null,null,null,null,null,null,null,2,null,null,null,null,null,null,null,null,null,null,null,null,2]
[null,null,null,null,null,null,3,null,null,null,null,null,null,null,null,null,null,null,null,null,3,null,null,null,null,null,null,null,null,null,null,null,null,3]
[null,null,null,null,null,null,"GRAN TOTAL",null,null,null,null,null,null,{"$f":"SUM(N20:N22)","v":0},{"$f":"SUM(O20:O22)","v":0},{"$f":"SUM(P20:P22)","v":0},null,null,null,null,null,"GRAN TOTAL",null,null,null,null,null,{"$f":"SUM(AB20:AB22)","v":0},{"$f":"SUM(AC20:AC22)","v":0},{"$f":"SUM(AD20:AD22)","v":0},null,null,null,"GRAN TOTAL",null,null,{"$f":"SUM(AK20:AK22)","v":0}]
[]
[]
[]
[null,null,null,null,null,null,"TABLA DE FLUJOS POR CADA CONTRATO DE ARRENDAMIENTO"]
[]
[null,null,null,null,null,null,"Indicar para cada uno de los contratos por arrendamientos financieros las tablas de medición inicial y amortización"]
[]
[null,null,null,null,null,null,"Se detallan los cuadros respectivos como ejemplo, para arrendamiento con plazo de 36 meses"]
[]
[null,null,null,null,null,null,null,"Datos de Arrendamiento"]
[]
[null,null,null,null,null,null,null,"Plazo en meses",null,36]
[null,null,null,null,null,null,null,"Tasa",null,0]
[null,null,null,null,null,null,null,"Cuota mensual",null,0]
[]
[null,null,null,null,null,null,null,"Medición Inicial Pasivo por Arrendamiento",null,{"$f":"J37","v":0}]
[]
[null,null,null,null,null,null,null,"N° Flujo ","Flujos","Factor","Valor Presente"]
[null,null,null,null,null,null,null,0]
[null,null,null,null,null,null,null,1,{"$f":"$J$37","v":0},{"$f":"(1+$J$36)^-H43","v":1},{"$f":"J43*I43","v":0}]
[null,null,null,null,null,null,null,2,{"$f":"$J$37","v":0},{"$f":"+(1+$J$36)^-H44","v":1},0]
[null,null,null,null,null,null,null,3,0,1,0]
[null,null,null,null,null,null,null,4,0,1,0]
[null,null,null,null,null,null,null,5,0,1,0]
[null,null,null,null,null,null,null,6,0,1,0]
[null,null,null,null,null,null,null,7,0,1,0]
[null,null,null,null,null,null,null,8,0,1,0]
[null,null,null,null,null,null,null,9,0,1,0]
[null,null,null,null,null,null,null,10,0,1,0]
[null,null,null,null,null,null,null,11,0,1,0]
[null,null,null,null,null,null,null,12,0,1,0]
[null,null,null,null,null,null,null,13,0,1,0]
[null,null,null,null,null,null,null,14,0,1,0]
[null,null,null,null,null,null,null,15,0,1,0]
[null,null,null,null,null,null,null,16,0,1,0]
[null,null,null,null,null,null,null,17,0,1,0]
[null,null,null,null,null,null,null,18,0,1,0]
[null,null,null,null,null,null,null,19,0,1,0]
[null,null,null,null,null,null,null,20,0,1,0]
[null,null,null,null,null,null,null,21,0,1,0]
[null,null,null,null,null,null,null,22,0,1,0]
[null,null,null,null,null,null,null,23,0,1,0]
[null,null,null,null,null,null,null,24,0,1,0]
[null,null,null,null,null,null,null,25,0,1,0]
[null,null,null,null,null,null,null,26,0,1,0]
[null,null,null,null,null,null,null,27,0,1,0]
[null,null,null,null,null,null,null,28,0,1,0]
[null,null,null,null,null,null,null,29,0,1,0]
[null,null,null,null,null,null,null,30,0,1,0]
[null,null,null,null,null,null,null,31,0,1,0]
[null,null,null,null,null,null,null,32,0,1,0]
[null,null,null,null,null,null,null,33,0,1,0]
[null,null,null,null,null,null,null,34,0,1,0]
[null,null,null,null,null,null,null,35,0,1,0]
[null,null,null,null,null,null,null,36,0,1,0]
[null,null,null,null,null,null,null,"TOTAL ACTIVO EN DERECHO DE USO",null,null,{"$f":"SUM(K42:K78)","v":0}]
[]
[]
[null,null,null,null,null,null,null,"Tabla de Amortización por Arrendamiento"]
[]
[null,null,null,null,null,null,null,"N°_FLUJO","FLUJOS","INTERESES","AMORTIZACION","SALDOS"]
[null,null,null,null,null,null,null,0,null,null,null,{"$f":"K79","v":0}]
[null,null,null,null,null,null,null,1,{"$f":"$J$37","v":0},{"$f":"L85*$J$36","v":0},{"$f":"I86-J86","v":0},{"$f":"L85-K86","v":0}]
[null,null,null,null,null,null,null,2,{"$f":"$J$37","v":0},0,{"$f":"I87-J87","v":0},{"$f":"L86-K87","v":0}]
[null,null,null,null,null,null,null,3,0,0,0,0]
[null,null,null,null,null,null,null,4,0,0,0,0]
[null,null,null,null,null,null,null,5,0,0,0,0]
[null,null,null,null,null,null,null,6,0,0,0,0]
[null,null,null,null,null,null,null,7,0,0,0,0]
[null,null,null,null,null,null,null,8,0,0,0,0]
[null,null,null,null,null,null,null,9,0,0,0,0]
[null,null,null,null,null,null,null,10,0,0,0,0]
[null,null,null,null,null,null,null,11,0,0,0,0]
[null,null,null,null,null,null,null,12,0,0,0,0]
[null,null,null,null,null,null,null,13,0,0,0,0]
[null,null,null,null,null,null,null,14,0,0,0,0]
[null,null,null,null,null,null,null,15,0,0,0,0]
[null,null,null,null,null,null,null,16,0,0,0,0]
[null,null,null,null,null,null,null,17,0,0,0,0]
[null,null,null,null,null,null,null,18,0,0,0,0]
[null,null,null,null,null,null,null,19,0,0,0,0]
[null,null,null,null,null,null,null,20,0,0,0,0]
[null,null,null,null,null,null,null,21,0,0,{"$f":"I106-J106","v":0},{"$f":"L105-K106","v":0}]
[null,null,null,null,null,null,null,22,0,0,0,0]
[null,null,null,null,null,null,null,23,0,0,0,0]
[null,null,null,null,null,null,null,24,0,0,0,0]
[null,null,null,null,null,null,null,25,0,0,0,0]
[null,null,null,null,null,null,null,26,0,0,0,0]
[null,null,null,null,null,null,null,27,0,0,0,0]
[null,null,null,null,null,null,null,28,0,0,0,0]
[null,null,null,null,null,null,null,29,0,0,0,0]
[null,null,null,null,null,null,null,30,0,0,0,0]
[null,null,null,null,null,null,null,31,0,0,0,0]
[null,null,null,null,null,null,null,32,0,0,0,0]
[null,null,null,null,null,null,null,33,0,0,0,0]
[null,null,null,null,null,null,null,34,0,0,0,0]
[null,null,null,null,null,null,null,35,0,0,0,0]
[null,null,null,null,null,null,null,36,0,0,0,0]

{"sheet":"NICSP_14","index":20,"n_rows":25,"n_cols":6,"rows_kept":25,"cut":false,"hidden":false,"merged":[[14,4,14,5]]}
[]
[null,null,"NICSP 14 - Hechos ocurridos después de fecha de presentación"]
[]
[null,null,"Los cuadros de aplicación y porcentaje de avance se completan de forma automática al pegar la información "]
[null,null,"de la  pestaña \"MATRIZ_AUTOEVALUACION\"."]
[null,null,"Si esta es de aplicación, completar los cuadros con la información respectiva"]
[]
[null,null,"NICSP 14"]
[null,"NICSP_14","Aplica",{"$f":"VLOOKUP(B9,NICSP!$A:$H,6,0)","v":0}]
[null,"NICSP_14","Porcentaje_Avance",{"$f":"VLOOKUP(B10,NICSP!$A:$H,7,0)","v":0}]
[]
[]
[null,null,"Eventos_posterior_del_cierre",null,{"$f":"IF(D13=\"\",\"COMPLETAR_CAMPO\",\"\")","v":"COMPLETAR_CAMPO"}]
[]
[null,null,null,null,"Indique los eventos posteriores después del cierre"]
[null,null,null,null,"Fecha de cierre"]
[null,null,null,null,"Fecha del Evento"]
[null,null,null,null,"Descripción"]
[null,null,null,null,"Cuenta Contable"]
[null,null,null,null,"Materialidad"]
[null,null,null,null,"Oficio de ente fiscalizador que lo detecto"]
[null,null,null,null,"Oficio de la administración que lo detecto"]
[null,null,null,null,"Fecha de Re expresión"]
[null,null,null,null,"Observaciones"]
[null,null,null,null,null,{"$f":"IF(AND(D13=\"SI\",F16=\"\"),\"COMPLETAR_CAMPO\",\"\")","v":""}]

{"sheet":"NICSP_16","index":21,"n_rows":21,"n_cols":12,"rows_kept":21,"cut":false,"hidden":false,"merged":[[13,3,13,4]]}
[]
[null,null,"NICSP 16 - Propiedades de Inversión"]
[]
[null,null,"Los cuadros de aplicación y porcentaje de avance se completan de forma automática al pegar la información "]
[null,null,"de la  pestaña \"MATRIZ_AUTOEVALUACION\"."]
[null,null,"Si esta es de aplicación, completar los cuadros con la información respectiva"]
[]
[null,null,"NICSP 16"]
[null,"NICSP_16","Aplica",{"$f":"VLOOKUP(B9,NICSP!$A:$H,6,0)","v":0}]
[null,"NICSP_16","Porcentaje_Avance",{"$f":"VLOOKUP(B10,NICSP!$A:$H,7,0)","v":0}]
[]
[null,null,"Resumen","CANTIDAD ","MONTO TOTAL"]
[null,"NICSP_16_PROP_INV","Propiedades de Inversión",null,{"$f":"$J$21","v":0},null,"ANEXOS"]
[null,null,null,{"$f":"IF(AND(D9=\"SI\",D13<>\"\",E13>0),\"\",IF(OR(D9=0,D9=\"NO\"),\"\",\"REVELACION_JUSTIFICAR\"))","v":""},null,null,"Ítem","No. Propiedad","Ubicación","Monto","Cuenta contable","Observaciones"]
[null,null,null,null,null,{"$f":"SUM(D13:E13)","v":0},1]
[null,null,null,null,null,null,2]
[null,null,null,null,null,null,3]
[null,null,null,null,null,null,4]
[null,null,null,null,null,null,5]
[null,null,null,null,null,null,6]
[null,null,null,null,null,null,"GRAN TOTAL",null,null,{"$f":"SUM(J15:J20)","v":0}]

{"sheet":"NICSP_17","index":22,"n_rows":22,"n_cols":22,"rows_kept":22,"cut":false,"hidden":false,"merged":[[21,6,21,11],[21,2,21,3]]}
[]
[null,null,"NICSP 17 - Propiedad Planta y Equipo"]
[]
[null,null,"Los cuadros de aplicación y porcentaje de avance se completan de forma automática al pegar la información "]
[null,null,"de la  pestaña \"MATRIZ_AUTOEVALUACION\"."]
[null,null,"Si esta es de aplicación, completar los cuadros con la información respectiva"]
[]
[null,null,"NICSP 17"]
[null,"NICSP_17","Aplica",{"$f":"VLOOKUP(B9,NICSP!$A:$H,6,0)","v":0}]
[null,"NICSP_17","Porcentaje_Avance",{"$f":"VLOOKUP(B10,NICSP!$A:$H,7,0)","v":0}]
[]
[null,null,"Resumen","PPE"]
[null,"NICSP_17_C","CANTIDAD ",{"$f":"$F$22","v":0}]
[null,"NICSP_17_VI","Valor  Inicio ",{"$f":"$M$22","v":0}]
[null,"NICSP_17_ALT","Altas",{"$f":"$P$22","v":0},null,"Cantidad","No._inscripción","Ubicación","Categoría_Activo","Registro_EEFF // Revelación","Medición","Vida_útil_en_años","Costo_al_Inicio ","Revaluaciones","Mejoras","Altas"," Bajas","Depreciación","Deterioro","Ajustes_por_reversión_de_Deterioro ","Ajustes_por_diferencias_derivadas_T.C.","Valor_al_Cierre"]
[null,"NICSP_17_BAJ"," Bajas",{"$f":"-$Q$22","v":0},null,null,null,null,"Edificios","Registro","Valor_Razonable"]
[null,"NICSP_17_DEPR","Depreciación",{"$f":"-$R$22","v":0},null,null,null,null,"Maquinaria y equipos para la  producción","Revelación","Valor_Razonable"]
[null,"NICSP_17_DET","Deterioro",{"$f":"-$S$22","v":0}]
[null,"NICSP_17_AJ_DET","Ajustes por reversión de Deterioro ",{"$f":"$T$22","v":0}]
[null,"NICSP_17_AJ_TC","Ajustes por diferencias derivadas T.C.",{"$f":"$U$22","v":0}]
[null,"NICSP_17_VC","Valor al Cierre",{"$f":"$V$22","v":0}]
[null,null,{"$f":"IF(AND(D9=\"SI\",D13=0),\"REVELACION_JUSTIFICAR\",\"\")","v":""},null,null,{"$f":"SUM(F16:F21)","v":0},"Totales",null,null,null,null,null,{"$f":"SUM(M16:M21)","v":0},{"$f":"SUM(N16:N21)","v":0},{"$f":"SUM(O16:O21)","v":0},{"$f":"SUM(P16:P21)","v":0},0,0,0,0,{"$f":"SUM(U16:U21)","v":0},0]

{"sheet":"NICSP_18","index":23,"n_rows":10,"n_cols":7,"rows_kept":10,"cut":false,"hidden":false,"merged":[]}
[]
[null,null,"NICSP 18 - Información Financiera por Segmentos"]
[]
[null,null,"Los cuadros de aplicación y porcentaje de avance se completan de forma automática al pegar la información "]
[null,null,"de la  pestaña \"MATRIZ_AUTOEVALUACION\"."]
[null,null,"Si esta es de aplicación, completar los cuadros con la información respectiva"]
[]
[null,null,"NICSP 18"]
[null,"NICSP_18","Aplica",{"$f":"VLOOKUP(B9,NICSP!$A:$H,6,0)","v":0},null,"Ente contable","Código de Segmento asignado"]
[null,"NICSP_18","Porcentaje_Avance",{"$f":"VLOOKUP(B10,NICSP!$A:$H,7,0)","v":0}]

{"sheet":"NICSP_19_ACTIVO","index":24,"n_rows":80,"n_cols":46,"rows_kept":80,"cut":false,"hidden":false,"merged":[[23,43,24,43],[23,44,24,44],[23,45,24,45],[23,4,24,4],[23,26,24,26],[23,27,24,27],[23,34,24,34],[23,35,24,35],[23,36,24,36],[23,37,24,37],[23,15,24,15],[23,14,24,14],[23,16,24,16],[23,17,24,17],[23,24,24,24],[23,25,24,25],[18,8,18,9],[18,5,18,6],[23,6,24,6],[23,5,24,5],[23,7,24,7]]}
[]
[null,null,"NICSP 19 - Activos y Pasivos Contingentes"]
[]
[null,null,"Los cuadros de aplicación y porcentaje de avance se completan de forma automática al pegar la información "]
[null,null,"de la  pestaña \"MATRIZ_AUTOEVALUACION\"."]
[null,null,"Si esta es de aplicación, completar los cuadros con la información respectiva"]
[]
[null,null,"NICSP 19 Activos Contingentes"]
[null,"NICSP_19","Aplica",{"$f":"VLOOKUP(B9,NICSP!$A:$H,6,0)","v":0}]
[null,"NICSP_19","Porcentaje_Avance",{"$f":"VLOOKUP(B10,NICSP!$A:$H,7,0)","v":0}]
[]
[]
[null,null,null,null,null,"Resumen\nMontos","Activos Contingentes",null,"Resumen\nCantidad ","Activos Contingentes"]
[null,"NICSP_19_A_PI",null,null,null,"Pretensión Inicial",{"$f":"$M$31","v":0},null,"Pretensión Inicial"]
[null,"NICSP_19_A_P1",null,null,null,"Resolución provisional 1",{"$f":"$W$31","v":0},null,"Resolución provisional 1"]
[null,"NICSP_19_A_P2",null,null,null,"Resolución provisional 2",{"$f":"$AG$31","v":0},null,"Resolución provisional 2"]
[null,"NICSP_19_A_RF",null,null,null,"Resolución en firme",{"$f":"$AQ$31","v":0},null,"Resolución en firme"]
[null,"NICSP_19_A_TOTAL",null,null,null,"GRAN TOTAL",{"$f":"SUM(G14:G17)","v":0},null,"GRAN TOTAL",{"$f":"SUM(J14:J17)","v":0}]
[null,null,null,null,null,{"$f":"IF(AND(D9=\"SI\",G18=0),\"REVELACION_JUSTIFICAR\",\"\")","v":""},null,null,{"$f":"IF(AND(D9=\"SI\",J18=0),\"REVELACION_JUSTIFICAR\",\"\")","v":""}]
[]
[]
[null,null,null,null,"ANEXOS"]
[null,null,null,null,null,"Activos Contingentes (NICSP 19)"]
[null,null,null,null,"#","Nº de Expediente judicial","Nombre Actor","Motivo demanda","Pretensión Inicial",null,null,null,null,null,"#","Nº de Expediente judicial","Nombre Actor","Motivo de la demanda","Resolución provisional 1",null,null,null,null,null,"#","Nº de Expediente judicial","Nombre Actor","Motivo de la demanda","Resolución provisional 2",null,null,null,null,null,"#","Nº de Expediente judicial","Nombre Actor","Motivo de la demanda","Resolución en firme",null,null,null,null,"Fecha de recepción de pago","Monto recibido","Observaciones"]
[null,null,null,null,null,null,null,null,"Fecha","Moneda","Monto","Tipo de Cambio","Monto colones",null,null,null,null,null,"Fecha","Moneda","Monto","Tipo de Cambio","Monto colones",null,null,null,null,null,"Fecha","Moneda","Monto","Tipo de Cambio","Monto colones",null,null,null,null,null,"Fecha","Monto","Moneda","Tipo de Cambio","Monto colones"]
[null,null,null,null,1,null,null,null,null,null,null,null,null,null,1,null,null,null,null,null,null,null,null,null,1,null,null,null,null,null,null,null,null,null,1,null,null,null,null," "]
[null,null,null,null,2,null,null,null,null,null,null,null,null,null,2,null,null,null,null,null,null,null,null,null,2,null,null,null,null,null,null,null,null,null,2]
[null,null,null,null,3,null,null,null,null,null,null,null,null,null,3,null,null,null,null,null,null,null,null,null,3,null,null,null,null,null,null,null,null,null,3]
[null,null,null,null,4,null,null,null,null,null,null,null,null,null,4,null,null,null,null,null,null,null,null,null,4,null,null,null,null,null,null,null,null,null,4]
[null,null,null,null,5,null,null,null,null,null,null,null,null,null,5,null,null,null,null,null,null,null,null,null,5,null,null,null,null,null,null,null,null,null,5]
[null,null,null,null,null,null,null,null," Total en colones ",null,null,null,{"$f":"SUM(M26:M30)","v":0},null,null,null,null,null," Total en colones ",null,null,null,{"$f":"SUM(W26:W30)","v":0},null,null,null,null,null," Total en colones ",null,null,null,{"$f":"SUM(AG26:AG30)","v":0},null,null,null,null,null," Total en colones ",null,null,null,{"$f":"SUM(AQ26:AQ30)","v":0}]
[]
[]
[]
[]
[]
[]
[]
[]
[]
[]
[]
[]
[]
[]
[]
[]
[]
[]
[]
[]
[]
[]
[]
[]
[]
[]
[]
[]
[]
[]
[]
[]
[]
[]
[]
[]
[]
[]
[]
[]
[]
[]
[]
[]
[]
[]
[null,null,null,null,null,null,null,null,null,"Hecho por:"]
[null,null,null,null,null,null,null,null,null,"Revisado por:"]
[null,null,null,null,null,null,null,null,null,"Aprobado por:"]

{"sheet":"NICSP_19_PASIVO","index":25,"n_rows":99,"n_cols":46,"rows_kept":99,"cut":false,"hidden":false,"merged":[[23,44,24,44],[23,45,24,45],[18,5,18,6],[18,8,18,9],[23,26,24,26],[23,27,24,27],[23,34,24,34],[23,35,24,35],[23,36,24,36],[23,43,24,43],[23,14,24,14],[23,15,24,15],[23,16,24,16],[23,17,24,17],[23,24,24,24],[23,25,24,25],[97,9,97,12],[98,9,98,12],[23,4,24,4],[23,5,24,5],[23,6,24,6],[23,7,24,7],[23,38,23,42],[23,28,23,32],[23,18,23,22],[23,8,23,12],[96,9,96,12]]}
[]
[null,null,"NICSP 19 - Activos y Pasivos Contingentes"]
[]
[null,null,"Los cuadros de aplicación y porcentaje de avance se completan de forma automática al pegar la información "]
[null,null,"de la  pestaña \"MATRIZ_AUTOEVALUACION\"."]
[null,null,"Si esta es de aplicación, completar los cuadros con la información respectiva"]
[]
[null,null,"NICSP 19 Pasivos Contingentes"]
[null,"NICSP_19","Aplica",{"$f":"VLOOKUP(B9,NICSP!$A:$H,6,0)","v":0}]
[null,"NICSP_19","Porcentaje_Avance",{"$f":"VLOOKUP(B10,NICSP!$A:$H,7,0)","v":0}]
[]
[]
[null,null,null,null,null,"Resumen\nMontos","Pasivos Contingentes",null,"Resumen\nCantidad ","Pasivos Contingentes"]
[null,"NICSP_19_P_PI",null,null,null,"Pretensión Inicial",{"$f":"$M$31","v":0},null,"Pretensión Inicial"]
[null,"NICSP_19_P_P1",null,null,null,"Resolución provisional 1",{"$f":"$W$31","v":0},null,"Resolución provisional 1"]
[null,"NICSP_19_P_P2",null,null,null,"Resolución provisional 2",{"$f":"$AG$31","v":0},null,"Resolución provisional 2"]
[null,"NICSP_19_P_RF",null,null,null,"Resolución en firme",{"$f":"$AQ$31","v":0},null,"Resolución en firme"]
[null,"NICSP_19_P_TOTAL",null,null,null,"GRAN TOTAL",{"$f":"SUM(G14:G17)","v":0},null,"GRAN TOTAL",{"$f":"SUM(J14:J17)","v":0}]
[null,null,null,null,null,{"$f":"IF(AND(D9=\"SI\",G18=0),\"REVELACION_JUSTIFICAR\",\"\")","v":""},null,null,{"$f":"IF(AND(D9=\"SI\",J18=0),\"REVELACION_JUSTIFICAR\",\"\")","v":""}]
[]
[]
[null,null,null,null,"ANEXOS"]
[null,null,null,null,"Pasivos Contingentes (NICSP 19)"]
[null,null,null,null,"#","Nº de Expediente judicial","Nombre Demandado","Motivo demanda","Pretensión Inicial",null,null,null,null,null,"#","Nº de Expediente judicial","Nombre Demandado","Motivo de la demanda","Resolución provisional 1",null,null,null,null,null,"#","Nº de Expediente judicial","Nombre Demandado","Motivo de la demanda","Resolución provisional 2",null,null,null,null,null,"#","Nº de Expediente judicial","Nombre Demandado","Motivo de la demanda","Resolución en firme",null,null,null,null,"Fecha de recepción de pago","Monto recibido","Observaciones"]
[null,null,null,null,null,null,null,null,"Fecha","Moneda","Monto","Tipo de Cambio","Monto colones",null,null,null,null,null,"Fecha","Monto","Moneda","Tipo de Cambio","Monto colones",null,null,null,null,null,"Fecha","Moneda","Monto","Tipo de Cambio","Monto colones",null,null,null,null,null,"Fecha","Monto","Moneda","Tipo de Cambio","Monto colones"]
[null,null,null,null,1,null,null,null,null,null,null,null,null,null,1,null,null,null,null,null,null,null,null,null,1,null,null,null,null,null,null,null,null,null,1]
[null,null,null,null,2,null,null,null,null,null,null,null,null,null,2,null,null,null,null,null,null,null,null,null,2,null,null,null,null,null,null,null,null,null,2]
[null,null,null,null,3,null,null,null,null,null,null,null,null,null,3,null,null,null,null,null,null,null,null,null,3,null,null,null,null,null,null,null,null,null,3]
[null,null,null,null,4,null,null,null,null,null,null,null,null,null,4,null,null,null,null,null,null,null,null,null,4,null,null,null,null,null,null,null,null,null,4]
[null,null,null,null,5,null,null,null,null,null,null,null,null,null,5,null,null,null,null,null,null,null,null,null,5,null,null,null,null,null,null,null,null,null,5]
[null,null,null,null,{"$f":"COUNT(E26:E30)","v":5},null,null,null," Total en colones ",null,null,null,{"$f":"SUM(M26:M30)","v":0},null,{"$f":"COUNT(O26:O30)","v":5},null,null,null," Total en colones ",null,null,null,{"$f":"SUM(W26:W30)","v":0},null,{"$f":"COUNT(Y26:Y30)","v":5},null,null,null," Total en colones ",null,null,null,{"$f":"SUM(AG26:AG30)","v":0},null,{"$f":"COUNT(AI26:AI30)","v":5},null,null,null," Total en colones ",null,null,null,{"$f":"SUM(AQ26:AQ27)","v":0}]
[]
[]
[]
[]
[]
[]
[]
[]
[]
[]
[]
[]
[]
[]
[]
[]
[]
[]
[]
[]
[]
[]
[]
[]
[]
[]
[]
[]
[]
[]
[]
[]
[]
[]
[]
[]
[]
[]
[]
[]
[]
[]
[]
[]
[]
[]
[]
[]
[]
[]
[]
[]
[]
[]
[]
[]
[]
[]
[]
[]
[]
[]
[]
[]
[]
[null,null,null,null,null,null,null,null,null,"Hecho por:"]
[null,null,null,null,null,null,null,null,null,"Revisado por:"]
[null,null,null,null,null,null,null,null,null,"Aprobado por:"]

{"sheet":"NICSP_20","index":26,"n_rows":13,"n_cols":11,"rows_kept":13,"cut":false,"hidden":false,"merged":[[11,6,12,6],[11,7,12,7],[11,10,12,10],[11,8,11,9]]}
[]
[null,null,"NICSP 20 - Información a revelar sobre partes relacionadas"]
[]
[null,null,"Los cuadros de aplicación y porcentaje de avance se completan de forma automática al pegar la información "]
[null,null,"de la  pestaña \"MATRIZ_AUTOEVALUACION\"."]
[null,null,"Si esta es de aplicación, completar los cuadros con la información respectiva"]
[]
[null,null,"NICSP 20"]
[null,"NICSP_20","Aplica",{"$f":"VLOOKUP(B9,NICSP!$A:$H,6,0)","v":0}]
[null,"NICSP_20","Porcentaje_Avance",{"$f":"VLOOKUP(B10,NICSP!$A:$H,7,0)","v":0}]
[]
[null,null,null,null,null,null,"Nombre funcionario","Fecha de presentación","Partes relacionadas",null,"Observaciones"]
[null,null,null,null,null,null,null,null,"SI","NO "]

{"sheet":"NICSP_21","index":27,"n_rows":13,"n_cols":4,"rows_kept":13,"cut":false,"hidden":false,"merged":[[12,2,12,8]]}
[]
[null,null,"NICSP 21 - Deterioro de Valor de Activos no generadores de Efectivo"]
[]
[null,null,"Los cuadros de aplicación y procentaje de avance se completan de forma automatica al pegar la información "]
[null,null,"de la  pestaña \"MATRIZ_AUTOEVALUACION\"."]
[null,null,"Si esta es de aplicación, completar los cuadros con la información respectiva"]
[]
[null,null,"NICSP 21"]
[null,"NICSP_21","Aplica",{"$f":"VLOOKUP(B9,NICSP!$A:$H,6,0)","v":0}]
[null,"NICSP_21","Porcentaje_Avance",{"$f":"VLOOKUP(B10,NICSP!$A:$H,7,0)","v":0}]
[]
[]
[null,null,"Lo relacionado con Pandemia se establece en la nota de Impacto de Pandemia, si poseen Deterioro del Valor de Activos No Generadores de Efectivo, que no tiene relación con la Pandemia, si se debe hacer la revelación"]

{"sheet":"NICSP_22","index":28,"n_rows":10,"n_cols":4,"rows_kept":10,"cut":false,"hidden":false,"merged":[]}
[]
[null,null,"NICSP 22 - Revelación de Información Financiera sobre Sector Gobierno General"]
[]
[null,null,"Los cuadros de aplicación y procentaje de avance se completan de forma automatica al pegar la información "]
[null,null,"de la  pestaña \"MATRIZ_AUTOEVALUACION\"."]
[null,null,"Si esta es de aplicación, completar los cuadros con la información respectiva"]
[]
[null,null,"NICSP 22"]
[null,"NICSP_22","Aplica",{"$f":"VLOOKUP(B9,NICSP!$A:$H,6,0)","v":0}]
[null,"NICSP_22","Porcentaje_Avance",{"$f":"VLOOKUP(B10,NICSP!$A:$H,7,0)","v":0}]

{"sheet":"NICSP_23","index":29,"n_rows":22,"n_cols":7,"rows_kept":22,"cut":false,"hidden":false,"merged":[]}
[]
[null,null,"NICSP 23 - Ingresos de transacciones sin contraprestación (Impuestos y Transferencias)"]
[]
[null,null,"Los cuadros de aplicación y porcentaje de avance se completan de forma automática al pegar la información "]
[null,null,"de la  pestaña \"MATRIZ_AUTOEVALUACION\"."]
[null,null,"Si esta es de aplicación, completar los cuadros con la información respectiva"]
[]
[null,null,"NICSP 23"]
[null,"NICSP_23","Aplica",{"$f":"VLOOKUP(B9,NICSP!$A:$H,6,0)","v":0}]
[null,"NICSP_23","Porcentaje_Avance",{"$f":"VLOOKUP(B10,NICSP!$A:$H,7,0)","v":0}]
[]
[null,null,null,null,null,"TIPO DE INGRESO","TIEMPOS DEL DEVENGO:"]
[]
[]
[]
[]
[]
[]
[]
[]
[]
[null,null,null,null,null,null,{"$f":"IF(AND(D9=\"SI\",G13=\"\"),\"COMPLETAR_CAMPO\",\"\")","v":""}]

{"sheet":"NICSP_24","index":30,"n_rows":22,"n_cols":9,"rows_kept":22,"cut":false,"hidden":false,"merged":[[21,6,21,7],[21,8,21,9],[17,6,17,7],[17,8,17,9],[18,6,18,7],[18,8,18,9],[19,6,19,7],[19,8,19,9],[15,6,15,7],[15,8,15,9],[16,6,16,7],[16,8,16,9],[20,6,20,7],[20,8,20,9],[11,5,11,9],[12,6,12,9],[13,6,13,9],[14,6,14,7],[14,8,14,9]]}
[]
[null,null,"NICSP 24 - Presentación de información del presupuesto en los Estados Financieros"]
[]
[null,null,"Los cuadros de aplicación y porcentaje de avance se completan de forma automática al pegar la información "]
[null,null,"de la  pestaña \"MATRIZ_AUTOEVALUACION\"."]
[null,null,"Si esta es de aplicación, completar los cuadros con la información respectiva"]
[]
[null,null,"NICSP 24"]
[null,"NICSP_24","Aplica",{"$f":"VLOOKUP(B9,NICSP!$A:$H,6,0)","v":0}]
[null,"NICSP_24","Porcentaje_Avance",{"$f":"VLOOKUP(B10,NICSP!$A:$H,7,0)","v":0}]
[]
[null,null,null,null,null,"LIQUIDACION PRESUPUESTARIA"]
[null,null,null,null,null,"PERIODO"]
[null,null,null,null,null,"OFICIO ENVIO A CGR"]
[null,null,null,null,null,"INGRESOS",0,null,0]
[null,null,null,null,null,null,0,null,0]
[null,null,null,null,null,null,0,null,0]
[null,null,null,null,null,"GASTOS",0,null,0]
[null,null,null,null,null,null,0,null,0]
[null,null,null,null,null,null,0,null,0]
[null,null,null,null,null,"SUPERAVIT/DEFICIT",0,null,0]
[null,null,null,null,null,null,0,null,0]

{"sheet":"NICSP_26","index":31,"n_rows":13,"n_cols":4,"rows_kept":13,"cut":false,"hidden":false,"merged":[[12,2,12,8]]}
[]
[null,null,"NICSP 26 - Deterioro del Valor de Activos generadores de efectivo"]
[]
[null,null,"Los cuadros de aplicación y procentaje de avance se completan de forma automatica al pegar la información "]
[null,null,"de la  pestaña \"MATRIZ_AUTOEVALUACION\"."]
[null,null,"Si esta es de aplicación, completar los cuadros con la información respectiva"]
[]
[null,null,"NICSP 26"]
[null,"NICSP_26","Aplica",{"$f":"VLOOKUP(B9,NICSP!$A:$H,6,0)","v":0}]
[null,"NICSP_26","Porcentaje_Avance",{"$f":"VLOOKUP(B10,NICSP!$A:$H,7,0)","v":0}]
[]
[]
[null,null,"Lo relacionado con Pandemia se establece en la nota de Impacto de Pandemia, si poseen Deterioro del Valor de Activos Generadores de Efectivo, que no tiene relación con la Pandemia, si se debe hacer la revelación,"]

{"sheet":"NICSP_27","index":32,"n_rows":23,"n_cols":20,"rows_kept":23,"cut":false,"hidden":false,"merged":[[14,6,14,8]]}
[]
[null,null,"NICSP 27 - Agricultura"]
[]
[null,null,"Los cuadros de aplicación y porcentaje de avance se completan de forma automática al pegar la información "]
[null,null,"de la  pestaña \"MATRIZ_AUTOEVALUACION\"."]
[null,null,"Si esta es de aplicación, completar los cuadros con la información respectiva"]
[]
[null,null,"NICSP 27"]
[null,"NICSP_27","Aplica",{"$f":"VLOOKUP(B9,NICSP!$A:$H,6,0)","v":0}]
[null,"NICSP_27","Porcentaje_Avance",{"$f":"VLOOKUP(B10,NICSP!$A:$H,7,0)","v":0}]
[]
[null,null,null,null,null,"Resumen","Activos biológicos","Productos Agrícolas","Productos resultantes del procesamiento tras la cosecha o recolección"]
[null,"NICSP_27_CAN",null,null,null,"CANTIDAD ",null,null,null,{"$f":"SUM(G13:I13)","v":0}]
[null,"NICSP_27_MON",null,null,null,"MONTO TOTAL",{"$f":"$J$23","v":0},{"$f":"$O$23","v":0},{"$f":"+$T$23","v":0},{"$f":"SUM(G14:I14)","v":0}]
[null,null,null,null,null,null,{"$f":"IF(AND(D9=\"SI\",J14=0,J13=0),\"REVELACION_JUSTIFICAR\",IF(AND(D9=\"SI\",J14=0,J13<>0),\"REVELACION_JUSTIFICAR\",IF(AND(D9=\"SI\",J14<>0,J13=0),\"REVELACION_JUSTIFICAR\",\"\")))","v":""}]
[]
[null,null,null,null,null,null,"ANEXOS"]
[]
[null,null,null,null,null,null,"#","Activos biológicos","Cuenta Contable","Monto",null,"#","Productos Agrícolas","Cuenta Contable","Monto",null,"#","Productos resultantes del procesamiento tras la cosecha o recolección","Cuenta Contable","Monto"]
[null,null,null,null,null,null,1,null,null,null,null,1,null,null,null,null,1]
[null,null,null,null,null,null,2,null,null,null,null,2,null,null,null,null,2]
[null,null,null,null,null,null,3,null,null,null,null,3,null,null,null,null,3]
[null,null,null,null,null,null,"GRAN TOTAL",null,null,{"$f":"SUM(J20:J22)","v":0},null,"GRAN TOTAL",null,null,{"$f":"SUM(O20:O22)","v":0},null,"GRAN TOTAL",null,null,{"$f":"SUM(T20:T22)","v":0}]

{"sheet":"NICSP_28_29_30","index":33,"n_rows":89,"n_cols":11,"rows_kept":89,"cut":false,"hidden":false,"merged":[[25,5,25,6],[75,3,75,10],[53,3,53,10],[33,3,33,5],[33,8,33,9],[41,3,41,5],[41,8,41,9]]}
[]
[null,null,"NICSP 28 - 29 - 30 - Instrumentos Financieros (Presentación, Reconocimiento Medición y Revelación)"]
[]
[null,null,"Los cuadros de aplicación y porcentaje de avance se completan de forma automática al pegar la información "]
[null,null,"de la  pestaña \"MATRIZ_AUTOEVALUACION\"."]
[null,null,"Si esta es de aplicación, completar los cuadros con la información respectiva"]
[]
[]
[null,null,"NICSP 28"]
[null,"NICSP_28","Aplica",{"$f":"VLOOKUP(B10,NICSP!$A:$H,6,0)","v":0}]
[null,"NICSP_28","Porcentaje_Avance",{"$f":"VLOOKUP(B11,NICSP!$A:$H,7,0)","v":0}]
[]
[null,null,"NICSP 29"]
[null,"NICSP_29","Aplica",{"$f":"VLOOKUP(B14,NICSP!$A:$H,6,0)","v":0}]
[null,"NICSP_29","Porcentaje_Avance",{"$f":"VLOOKUP(B15,NICSP!$A:$H,7,0)","v":0}]
[]
[null,null,"NICSP 30"]
[null,"NICSP_30","Aplica",{"$f":"VLOOKUP(B18,NICSP!$A:$H,6,0)","v":0}]
[null,"NICSP_30","Porcentaje_Avance",{"$f":"VLOOKUP(B19,NICSP!$A:$H,7,0)","v":0}]
[]
[]
[null,null,null,null,"Resumen","Activos Financiero","Pasivo Financiero",{"$f":"SUM(H23:H25)","v":0}]
[null,"NICSP_30_CANT",null,null,"CANTIDAD ",null,null,{"$f":"SUM(F23:G23)","v":0}]
[null,"NICSP_30_VL",null,null,"Valor Libros ",{"$f":"G34","v":0},{"$f":"G42","v":0},{"$f":"SUM(F24:G24)","v":0}]
[null,"NICSP_30_VR",null,null,"Valor Razonable ",{"$f":"H34","v":0},{"$f":"H42","v":0},0]
[null,null,null,null,null,{"$f":"IF(AND(D18=\"SI\",H22=0),\"REVELACION_JUSTIFICAR\",\"\")","v":""}]
[]
[]
[null,null,null,"NICSP 28-29-30 Instrumentos Financieros - Activos Financieros"]
[null,null,null,"#","Categoría Activo Financiero","Tasa rendimiento","Valor libros","Valor razonable","Nivel riesgo","Observaciones"]
[null,null,null,1,"Activo Financiero al Valor Razonable",null,null,null,"Riesgo de Crédito"]
[null,null,null,2,"Activos Financieros disponibles para la venta",null,null,null,"Riesgo de Liquidez"]
[null,null,null,3,"Prestamos y Cuentas por Cobrar",null,null,null,"Riesgo de Tasa de Cambio"]
[null,null,null,"GRAN TOTAL",null,null,{"$f":"SUM(G31:G33)","v":0},{"$f":"SUM(H31:H33)","v":0}]
[]
[]
[null,null,null,"NICSP 28-29-30 Instrumentos Financieros - Pasivos Financieros"]
[null,null,null,"#","Categoría Activo Financiero","Tasa rendimiento","Valor libros","Valor razonable","Nivel riesgo","Observaciones"]
[null,null,null,1,null,null,null,null,"Riesgo de Crédito"]
[null,null,null,2,null,null,null,null,"Riesgo de Liquidez"]
[null,null,null,3,null,null,null,null,"Riesgo de Tasa de Cambio"]
[null,null,null,"GRAN TOTAL",null,null,{"$f":"SUM(G39:G41)","v":0},{"$f":"SUM(H39:H41)","v":0}]
[]
[]
[null,null,null,"CALCES DE PLAZOS ACTIVOS Y PASIVOS FINANCIEROS"]
[]
[null,null,null,"Indicar en el detalle las cuentas correspondientes a los activos financieros determinados por la entidad, los saldos de estas cuentas deben distribuirse de acuerdo a los rangos de "]
[null,null,null,"vencimiento y desembolso de recursos líquidos a la entidad"]
[]
[null,null,null,"Las cuentas deben detallarse de acuerdo al nivel 5 del catalogo de cuentas vigente. Se muestra la cuenta 1.1.2.01. de ejemplo."]
[]
[null,null,null,"ACTIVOS FINANCIEROS"]
[]
[null,null,null,"ACTIVOS FINANCIEROS"]
[null,null,null,"Cuenta","Detalle "," Saldo de 1 a 30 días","Saldo de 31 a 90 días"," Saldo de 91 a 180 días"," Saldo de 181 a 365 días","Más de 365 días","Total"]
[null,null,null,"1.1.2.01.","Títulos y valores a valor razonable a corto plazo",12000,8966,0,41325,0,{"$f":"SUM(F56:J56)","v":62291}]
[null,null,null,null,null,null,null,null,null,null,{"$f":"SUM(F57:J57)","v":0}]
[null,null,null,null,null,null,null,null,null,null,0]
[null,null,null,null,null,null,null,null,null,null,{"$f":"SUM(F59:J59)","v":0}]
[null,null,null,null,null,null,null,null,null,null,0]
[null,null,null,null,null,null,null,null,null,null,0]
[null,null,null,null,null,null,null,null,null,null,0]
[null,null,null,null,null,null,null,null,null,null,0]
[null,null,null,null,null,null,null,null,null,null,0]
[null,null,null,null,null,null,null,null,null,null,0]
[null,null,null,null,null,null,null,null,null,null,0]
[]
[]
[null,null,null,"PASIVOS FINANCIEROS"]
[]
[null,null,null,"Indicar en el detalle las cuentas correspondientes a los pasivos financieros determinados por la entidad, los saldos de estas cuentas deben distribuirse de acuerdo a los rangos de "]
[null,null,null,"pago y desembolso de recursos de la entidad"]
[]
[null,null,null,"Las cuentas deben detallarse de acuerdo al nivel 5 del catalogo de cuentas vigente. Se muestra la cuenta 2.1.1.05 de ejemplo."]
[]
[null,null,null,"PASIVOS  FINANCIEROS"]
[null,null,null,"Cuenta","Detalle "," Saldo de 1 a 30 días","Saldo de 31 a 90 días"," Saldo de 91 a 180 días"," Saldo de 181 a 365 días","Más de 365 días","Total"]
[null,null,null,"2.1.1.05.","Inversiones patrimoniales a pagar a corto plazo",2876,0,55846,0,0,{"$f":"SUM(F78:J78)","v":58722}]
[null,null,null,null,null,null,null,null,null,null,{"$f":"SUM(F79:J79)","v":0}]
[null,null,null,null,null,null,null,null,null,null,0]
[null,null,null,null,null,null,null,null,null,null,0]
[null,null,null,null,null,null,null,null,null,null,0]
[null,null,null,null,null,null,null,null,null,null,0]
[null,null,null,null,null,null,null,null,null,null,0]
[null,null,null,null,null,null,null,null,null,null,0]
[null,null,null,null,null,null,null,null,null,null,0]
[null,null,null,null,null,null,null,null,null,null,0]
[null,null,null,null,null,null,null,null,null,null,0]
[null,null,null,null,null,null,null,null,null,null,0]

{"sheet":"FIDEICOMISOS","index":34,"n_rows":34,"n_cols":10,"rows_kept":34,"cut":false,"hidden":false,"merged":[[30,5,31,5],[32,5,33,5],[13,2,13,3],[22,5,22,6],[23,5,23,6],[24,5,24,6],[25,5,25,6],[26,5,27,5],[28,5,29,5],[16,5,16,6],[17,5,17,6],[18,5,18,6],[19,5,19,6],[20,5,20,6],[21,5,21,6]]}
[]
[null,null,"Fideicomisos"]
[]
[null,null,"Los cuadros de aplicación y porcentaje de avance se completan de forma automática al pegar la información "]
[null,null,"de la  pestaña \"MATRIZ_AUTOEVALUACION\"."]
[null,null,"Si esta es de aplicación, completar los cuadros con la información respectiva"]
[]
[null,null,"Fideicomiso"]
[null,"FIDEI","Aplica",{"$f":"VLOOKUP(B9,NICSP!$A:$H,6,0)","v":0}]
[]
[]
[null,null,"Resumen","Fideicomisos"]
[null,"FIDEI_CANT","CANTIDAD "]
[null,null,{"$f":"IF(AND(D9=\"SI\",D13=0),\"REVELACION_JUSTIFICAR\",\"\")","v":""}]
[]
[]
[null,null,null,null,null,"#",null,1,2,3]
[null,null,null,null,null,"Numero Contrato"]
[null,null,null,null,null,"Fecha inicio"]
[null,null,null,null,null,"Fecha Final"]
[null,null,null,null,null,"Plazo"]
[null,null,null,null,null,"Nombre de Fideicomiso"]
[null,null,null,null,null,"Nombre de Fideicomitente"]
[null,null,null,null,null,"Nombre de Fiduciario"]
[null,null,null,null,null,"Nombre de Fideicomisario"]
[null,null,null,null,null,"Fin del fideicomiso"]
[null,null,null,null,null,"Cesión de Activos","SI"]
[null,null,null,null,null,null,"NO"]
[null,null,null,null,null,"El Fideicomiso está registrado en los EEFF","SI"]
[null,null,null,null,null,null,"NO"]
[null,null,null,null,null,"Existe Control sobre el fideicomiso (NICSP 35)","SI"]
[null,null,null,null,null,null,"NO"]
[null,null,null,null,null,"La entidad consolida el fideicomiso a su contabilidad","SI"]
[null,null,null,null,null,null,"NO"]

{"sheet":"NICSP_31","index":35,"n_rows":22,"n_cols":23,"rows_kept":22,"cut":false,"hidden":false,"merged":[[21,6,21,12],[21,2,21,3]]}
[]
[null,null,"NICSP 31 - Activos Intangibles"]
[]
[null,null,"Los cuadros de aplicación y porcentaje de avance se completan de forma automática al pegar la información "]
[null,null,"de la  pestaña \"MATRIZ_AUTOEVALUACION\"."]
[null,null,"Si esta es de aplicación, completar los cuadros con la información respectiva"]
[]
[null,null,"NICSP 31"]
[null,"NICSP_31","Aplica",{"$f":"VLOOKUP(B9,NICSP!$A:$H,6,0)","v":0}]
[null,"NICSP_31","Porcentaje_Avance",{"$f":"VLOOKUP(B10,NICSP!$A:$H,7,0)","v":0}]
[]
[null,null,"Resumen","Intangibles"]
[null,"NICSP_31_CAN","CANTIDAD ",{"$f":"$F$22","v":0}]
[null,"NICSP_31_VI","Valor  Inicio ",{"$f":"$N$22","v":0}]
[null,"NICSP_31_ALT","Altas",{"$f":"$Q$22","v":0},null,"Cantidad","No._inscripción","Ubicación","Categoría_Activo","Registro_EEFF // Revelación","Medición","Vida_Útil","Vida_útil // Tasa_de_Amortización_definida","Costo_al_Inicio ","Revaluaciones","Mejoras","Altas"," Bajas","Amortización","Deterioro","Ajustes_por_reversión_de_Deterioro ","Ajustes_por_diferencias_derivadas_T.C.","Valor_al_Cierre"]
[null,"NICSP_31_BAJ"," Bajas",{"$f":"-$R$22","v":0},null,null,null,null,"Publicidad","Revelación","Costo","Indefinida"]
[null,"NICSP_31_AMO","Amortización",{"$f":"-$S$22","v":0},null,null,null,null,"Publicidad","Registro","Costo","Indefinida"]
[null,"NICSP_31_DET","Deterioro",{"$f":"-$T$22","v":0},null,null,null,null,null,"Registro","Costo","Indefinida"]
[null,"NICSP_31_AJU_DET","Ajustes por reversión de Deterioro ",{"$f":"$U$22","v":0}]
[null,"NICSP_31_AJU_TC","Ajustes por diferencias derivadas T.C.",{"$f":"$V$22","v":0}]
[null,"NICSP_31_VC","Valor al Cierre",{"$f":"$W$22","v":0}]
[null,null,{"$f":"IF(AND(D9=\"SI\",D13=0),\"REVELACION_JUSTIFICAR\",\"\")","v":""},null,null,{"$f":"SUM(F16:F21)","v":0},"Totales",null,null,null,null,null,null,{"$f":"SUM(N16:N21)","v":0},0,0,0,0,0,0,0,0,0]

{"sheet":"NICSP_32","index":36,"n_rows":19,"n_cols":10,"rows_kept":19,"cut":false,"hidden":false,"merged":[]}
[]
[null,null,"NICSP 32 - Acuerdos de concesión de Servicios La Concedente "]
[]
[null,null,"Los cuadros de aplicación y porcentaje de avance se completan de forma automática al pegar la información "]
[null,null,"de la  pestaña \"MATRIZ_AUTOEVALUACION\"."]
[null,null,"Si esta es de aplicación, completar los cuadros con la información respectiva"]
[]
[null,null,"NICSP 32"]
[null,"NICSP_32","Aplica",{"$f":"VLOOKUP(B9,NICSP!$A:$H,6,0)","v":0}]
[null,"NICSP_32","Porcentaje_Avance",{"$f":"VLOOKUP(B10,NICSP!$A:$H,7,0)","v":0}]
[]
[null,null,null,null,null,"Categoría","Arrendatario","Tipo","Propietario\n% Participación","Observaciones"]
[null,null,null,null,null,"Tipos de acuerdos"]
[null,null,null,null,null,"Propiedad del activo"]
[null,null,null,null,null,"Inversión de capital"]
[null,null,null,null,null,"Riesgo de demanda"]
[null,null,null,null,null,"Duración habitual"]
[null,null,null,null,null,"Interés residual"]
[null,null,null,null,null,"NICSP correspondiente"]

{"sheet":"NICSP_33","index":37,"n_rows":10,"n_cols":4,"rows_kept":10,"cut":false,"hidden":false,"merged":[]}
[]
[null,null,"NICSP 33 -Adopción por primera vez de las NICSP de base de acumulación (o Devengo)"]
[]
[null,null,"Los cuadros de aplicación y procentaje de avance se completan de forma automatica al pegar la información "]
[null,null,"de la  pestaña \"MATRIZ_AUTOEVALUACION\"."]
[null,null,"Si esta es de aplicación, completar los cuadros con la información respectiva"]
[]
[null,null,"NICSP 33"]
[null,"NICSP_33","Aplica",{"$f":"VLOOKUP(B9,NICSP!$A:$H,6,0)","v":0}]
[null,"NICSP_33","Porcentaje_Avance",{"$f":"VLOOKUP(B10,NICSP!$A:$H,7,0)","v":0}]

{"sheet":"NICSP_34","index":38,"n_rows":18,"n_cols":4,"rows_kept":18,"cut":false,"hidden":false,"merged":[[13,2,13,8],[14,2,14,8]]}
[]
[null,null,"NICSP 34 -Estados financieros separados"]
[]
[null,null,"Los cuadros de aplicación y procentaje de avance se completan de forma automatica al pegar la información "]
[null,null,"de la  pestaña \"MATRIZ_AUTOEVALUACION\"."]
[null,null,"Si esta es de aplicación, completar los cuadros con la información respectiva"]
[]
[null,null,"NICSP 34"]
[null,"NICSP_34","Aplica",{"$f":"VLOOKUP(B9,NICSP!$A:$H,6,0)","v":0}]
[null,"NICSP_34","Porcentaje_Avance",{"$f":"VLOOKUP(B10,NICSP!$A:$H,7,0)","v":0}]
[]
[]
[]
[null,null,"Los estados financieros separados se elaborarán de acuerdo con todas las NICSP aplicables, \nexcepto por lo previsto en el párrafo 12, en el cual se indica lo siguiente:"]
[null,null,"Cuando una entidad elabore estados financieros separados, contabilizará las inversiones similares en entidades controladas, negocios conjuntos y asociadas:"]
[null,null,"(a) al costo;"]
[null,null,"(b) de acuerdo con la NICSP 29; o"]
[null,null,"(c) utilizando el método de la participación como se describe en la NICSP 36."]

{"sheet":"NICSP_35","index":39,"n_rows":19,"n_cols":9,"rows_kept":19,"cut":false,"hidden":false,"merged":[[12,5,13,5],[12,6,13,6],[12,7,12,8],[18,5,18,6]]}
[]
[null,null,"NICSP 35 - Estados financieros consolidados"]
[]
[null,null,"Los cuadros de aplicación y porcentaje de avance se completan de forma automática al pegar la información "]
[null,null,"de la  pestaña \"MATRIZ_AUTOEVALUACION\"."]
[null,null,"Si esta es de aplicación, completar los cuadros con la información respectiva"]
[]
[null,null,"NICSP 35"]
[null,"NICSP_35","Aplica",{"$f":"VLOOKUP(B9,NICSP!$A:$H,6,0)","v":0}]
[null,"NICSP_35","Porcentaje_Avance",{"$f":"VLOOKUP(B10,NICSP!$A:$H,7,0)","v":0}]
[]
[]
[null,null,null,null,null,"Código Institución","Nombre institución","Consolida"]
[null,null,null,null,null,null,null,"SI","NO"]
[]
[]
[]
[]
[null,null,null,null,null,"Total"]

{"sheet":"NICSP_36","index":40,"n_rows":19,"n_cols":8,"rows_kept":19,"cut":false,"hidden":false,"merged":[[12,5,13,5],[12,6,13,6],[12,7,13,7],[18,5,18,6]]}
[]
[null,null,"NICSP 36 - Inversiones en asociadas y negocios conjuntos"]
[]
[null,null,"Los cuadros de aplicación y porcentaje de avance se completan de forma automática al pegar la información "]
[null,null,"de la  pestaña \"MATRIZ_AUTOEVALUACION\"."]
[null,null,"Si esta es de aplicación, completar los cuadros con la información respectiva"]
[]
[null,null,"NICSP 36"]
[null,"NICSP_36","Aplica",{"$f":"VLOOKUP(B9,NICSP!$A:$H,6,0)","v":0}]
[null,"NICSP_36","Porcentaje_Avance",{"$f":"VLOOKUP(B10,NICSP!$A:$H,7,0)","v":0}]
[]
[]
[null,null,null,null,null,"Código Institución","Nombre institución","% Participación"]
[]
[]
[]
[]
[]
[null,null,null,null,null,"Total, instituciones"]

{"sheet":"NICSP_37","index":41,"n_rows":16,"n_cols":4,"rows_kept":16,"cut":false,"hidden":false,"merged":[[12,2,12,8],[15,2,15,8]]}
[]
[null,null,"NICSP 37 -Acuerdos conjuntos"]
[]
[null,null,"Los cuadros de aplicación y procentaje de avance se completan de forma automatica al pegar la información "]
[null,null,"de la  pestaña \"MATRIZ_AUTOEVALUACION\"."]
[null,null,"Si esta es de aplicación, completar los cuadros con la información respectiva"]
[]
[null,null,"NICSP 37"]
[null,"NICSP_37","Aplica",{"$f":"VLOOKUP(B9,NICSP!$A:$H,6,0)","v":0}]
[null,"NICSP_37","Porcentaje_Avance",{"$f":"VLOOKUP(B10,NICSP!$A:$H,7,0)","v":0}]
[]
[]
[null,null,"Un acuerdo conjunto es una operación conjunta o un negocio conjunto, mediante el cual dos o más partes mantienen control conjunto, tiene las siguientes características:"]
[null,null,"a) Las partes están obligadas por un acuerdo vinculante; y"]
[null,null,"b) El acuerdo vinculante otorga a dos o más de esas partes control conjunto sobre el acuerdo."]
[null,null,"Una entidad que prepara y presenta estados financieros según la base contable de acumulación (o devengo) aplicará esta política contable para determinar el tipo de acuerdo conjunto en el cual está involucrada y para contabilizar los derechos y obligaciones del acuerdo conjunto."]

{"sheet":"NICSP_38","index":42,"n_rows":16,"n_cols":4,"rows_kept":16,"cut":false,"hidden":false,"merged":[]}
[]
[null,null,"NICSP 38 -Revelación de intereses en otras entidades"]
[]
[null,null,"Los cuadros de aplicación y procentaje de avance se completan de forma automatica al pegar la información "]
[null,null,"de la  pestaña \"MATRIZ_AUTOEVALUACION\"."]
[null,null,"Si esta es de aplicación, completar los cuadros con la información respectiva"]
[]
[null,null,"NICSP 38"]
[null,"NICSP_38","Aplica",{"$f":"VLOOKUP(B9,NICSP!$A:$H,6,0)","v":0}]
[null,"NICSP_38","Porcentaje_Avance",{"$f":"VLOOKUP(B10,NICSP!$A:$H,7,0)","v":0}]
[]
[]
[null,null,"La metodología usada para determinar:"]
[null,null,"1. que tiene el control de otra entidad como se describe en la norma;"]
[null,null,"2. que tiene el control conjunto de un acuerdo sobre otra entidad; y"]
[null,null,"3. el tipo de acuerdo conjunto, es decir, operación conjunta o negocio conjunto cuando el acuerdo ha sido estructurado a través de un vehículo separado;"]

{"sheet":"NICSP_39","index":43,"n_rows":22,"n_cols":11,"rows_kept":22,"cut":false,"hidden":false,"merged":[[13,8,15,8],[14,9,15,9],[16,7,16,9],[21,7,21,8]]}
[]
[null,null,"NICSP 39 - Beneficios a Empleados"]
[]
[null,null,"Los cuadros de aplicación y porcentaje de avance se completan de forma automática al pegar la información "]
[null,null,"de la  pestaña \"MATRIZ_AUTOEVALUACION\"."]
[null,null,"Si esta es de aplicación, completar los cuadros con la información respectiva"]
[]
[null,null,"NICSP 39"]
[null,"NICSP_39","Aplica",{"$f":"VLOOKUP(B9,NICSP!$A:$H,6,0)","v":0}]
[null,"NICSP_39","Porcentaje_Avance",{"$f":"VLOOKUP(B10,NICSP!$A:$H,7,0)","v":0}]
[null,null,null,null,null,null,null,{"$f":"SUM(H13:H16)","v":0},{"$f":"I13","v":0},{"$f":"J14","v":0},{"$f":"SUM(H11:J11)","v":0}]
[null,null,null,null,null,null,null,"Montos Pago ","Días sin disfrute ","Cantidad "]
[null,"NICSP_39_VAC",null,null,null,null,"Vacaciones",0]
[null,"NICSP_39_CC",null,null,null,null,"Convención colectiva",0]
[null,"NICSP_39_CES",null,null,null,null,"Cesantía",0]
[null,"NICSP_39_PRE",null,null,null,null,"Preaviso",0]
[null,null,null,null,null,null,null,{"$f":"IF(AND(D9=\"SI\",K11=0),\"REVELACION_JUSTIFICAR\",\"\")","v":""}]
[]
[]
[null,null,null,null,null,null,null,"SI ","NO"]
[null,"NICSP_39_SER",null,null,null,null,"Servicios Médicos"]
[null,null,null,null,null,null,null,{"$f":"IF(AND(D9=\"SI\",H21=\"\",I21=\"\"),\"REVELACION_JUSTIFICAR\",\"\")","v":""}]

{"sheet":"NICSP_40","index":44,"n_rows":10,"n_cols":4,"rows_kept":10,"cut":false,"hidden":false,"merged":[]}
[]
[null,null,"NICSP 40 -Combinaciones en el sector público"]
[]
[null,null,"Los cuadros de aplicación y procentaje de avance se completan de forma automatica al pegar la información "]
[null,null,"de la  pestaña \"MATRIZ_AUTOEVALUACION\"."]
[null,null,"Si esta es de aplicación, completar los cuadros con la información respectiva"]
[]
[null,null,"NICSP 40"]
[null,"NICSP_40","Aplica",{"$f":"VLOOKUP(B9,NICSP!$A:$H,6,0)","v":0}]
[null,"NICSP_40","Porcentaje_Avance",{"$f":"VLOOKUP(B10,NICSP!$A:$H,7,0)","v":0}]

{"sheet":"NOTAS_PARTICULAR","index":45,"n_rows":25,"n_cols":4,"rows_kept":25,"cut":false,"hidden":false,"merged":[[2,1,2,3],[1,1,1,3],[6,1,6,2]]}
[]
[null,{"$f":"DATOS!D13","v":""}]
[null,"Revelaciones Particulares"]
[]
[null,"Se les solicita completar el siguiente cuadro, seleccionando SI - NO de acuerdo a la situación actual de la entidad"]
[]
[null,"PREGUNTAS_NOTAS_PARTICULARES",null,"RESPUESTA"]
["N_PART_1","1- ¿La entidad aplica la Ley de reducción de la deuda pública por medio de la venta de activos ociosos o subutilizados del sector público (10092)? ","APLICACIÓN"]
["N_PART_2","2-\t¿La Entidad está registrando sus asientos contables a partir del 01 de enero de 2017, basado en el Plan de Cuentas NICSP, en la última versión?","APLICACIÓN"]
["N_PART_3","3-\t¿Su institución realizó reclasificaciones de cuentas, en el periodo actual?","APLICACIÓN"]
["N_PART_4","4-\t¿Su institución realizó depuración de cifras, en el periodo actual?","APLICACIÓN"]
["N_PART_5","5-\t¿Su institución realizó confirmación y conciliaciones de saldos de cuentas reciprocas con otros entes contables?","APLICACIÓN"]
["N_PART_6","6-\t¿Su institución realizó Conciliaciones Bancarias “Caja Únicas”?","APLICACIÓN"]
["N_PART_7","7-\t¿La institución cuenta con sistema de información integrado para elaborar los Estados Financieros y la reportería?","APLICACIÓN"]
["N_PART_8","8-\t¿La Institución elabora los Estados Financieros de manera manual, es decir, el sistema utilizado no facilita balanzas de comprobación sino solo saldos de cuentas?","APLICACIÓN"]
["N_PART_9","9-\t¿La entidad realiza la conversión de cifras de moneda extranjera a moneda nacional?","APLICACIÓN"]
["N_PART_10","10-\t¿El método de evaluación para inventarios utilizado por la institución es PEPS?","APLICACIÓN"]
["N_PART_11","11-\t¿El método de utilizado por la Institución es Estimación por Incobrables (ANTIGÜEDAD DE SALDOS)?","APLICACIÓN"]
["N_PART_12","12-\t¿El método utilizado en la Institución para la Depreciación o agotamiento es Línea Recta?","APLICACIÓN"]
["N_PART_13","13-\t¿La entidad lleva los libros contables en formato digital?","APLICACIÓN"]
["N_PART_14","14-\t¿Los libros contables se encuentran actualizados?","APLICACIÓN"]
["N_PART_15","15-\t¿La Entidad audita de manera externa los Estados Financieros?","APLICACIÓN"]
["N_PART_16","16-\t¿Incluye Informes de Auditorias y CGR?","APLICACIÓN"]
["N_PART_17","17-\t¿Incluye resultados de Oficios o correo de Observaciones CN?","APLICACIÓN"]
["N_PART_18","18-\t¿Incluye Nota Particular y Certificación denominada “Estados Financieros y Plan General de Contabilidad” incorporando los puntos indicados en una carpeta?","APLICACIÓN"]

{"sheet":"PARAMETROS","index":46,"n_rows":216,"n_cols":17,"rows_kept":216,"cut":false,"hidden":true,"merged":[]}
[]
[]
[]
[null,"AÑO","TRIMESTRAL","MENSUAL",null,null,"GRUPOS_INSTITUCIONALES","SECTORES","Tierras y terrenos"]
[null,2017,"MARZO","ENERO",null,null,"PODER_EJECUTIVO",null,"Edificios"]
[null,2018,"JUNIO","FEBRERO",null,null,"PODERES_AUXILIARES","ADMINISTRACION_CENTRAL","Maquinaria y equipos para la  producción"]
[null,2019,"SETIEMBRE","ABRIL",null,null,"ORGANOS_DESCONCENTRADOS","GOBIERNO_DE_LA_REPUBLICA","Equipos de transporte, tracción y elevación"]
[null,2020,"DICIEMBRE","MAYO",null,null,"INSTITUCIONES_DESCENTRALIZADAS","GOBIERNO_GENERAL","Equipos de comunicación"]
[null,2021,null,"JULIO",null,null,"INSTITUCIONES_FINANCIERAS_NO_BANCARIAS",null,"Equipos y mobiliario de oficina"]
[null,2022,null,"AGOSTO",null,null,"UNIVERSIDADES_PUBLICAS","PODER_EJECUTIVO","Equipos para computación"]
[null,2023,null,"OCTUBRE",null,null,"SECTOR_MUNICIPAL","ORGANOS_DESCONCENTRADOS","Equipos sanitario, de laboratorio e investigación"]
[null,2024,null,"NOVIEMBRE",null,null,"EMPRESAS_PUBLICAS",null,"Equipos y mobiliario educacional, deportivo y recreativo"]
[null,2025,null,null,null,null,null,null,"Equipos de seguridad, orden, vigilancia y control público"]
[null,null,null,null,null,null,null,null,"Semovientes"]
[null,null,null,null,null,null,null,null,"Maquinarias, equipos y mobiliarios diversos"]
[null,null,null,null,"SI",null,null,null,"Otros"]
[null,null,null,null,"NO"]
[]
[]
[]
[null,null,null,null,null,null,null,null,null,null,null,null,null,"Del","01 de Enero ","al"]
["SECTOR","SECTOR_NIVEL_1","SECTOR_NIVEL_2","SECTOR_NIVEL_3","GRUPO_INSTITUCIONAL","CODIGO","ENTIDAD","CODIDO_ENTIDAD","GRUPO_INSTITUCIONAL"]
["SECTOR_PUBLICO_NO_FINANCIERO","GOBIERNO_GENERAL","GOBIERNO_DE_LA_REPUBLICA","ADMINISTRACION_CENTRAL","PODER_EJECUTIVO","11206","Poder Ejecutivo","11206 - Poder Ejecutivo","PODER_EJECUTIVO",null,null,null,"M01","ENERO","31 de Enero",null,"2022-01-31"]
["SECTOR_PUBLICO_NO_FINANCIERO","GOBIERNO_GENERAL","GOBIERNO_DE_LA_REPUBLICA","-","PODERES_AUXILIARES","13101","Asamblea Legislativa","13101 - Asamblea Legislativa","PODERES_AUXILIARES",null,null,null,"M02","FEBRERO","28 de Febrero",null,"2022-02-28"]
["SECTOR_PUBLICO_NO_FINANCIERO","GOBIERNO_GENERAL","GOBIERNO_DE_LA_REPUBLICA","-","PODERES_AUXILIARES","13102","Contraloria General de la Republica","13102 - Contraloria General de la Republica","PODERES_AUXILIARES",null,null,null,"T01","MARZO","31 de Marzo",null,"2022-03-31"]
["SECTOR_PUBLICO_NO_FINANCIERO","GOBIERNO_GENERAL","GOBIERNO_DE_LA_REPUBLICA","-","PODERES_AUXILIARES","13103","Defensoria de los Habitantes","13103 - Defensoria de los Habitantes","PODERES_AUXILIARES",null,null,null,"M04","ABRIL","30 de Abril",null,"2022-04-30"]
["SECTOR_PUBLICO_NO_FINANCIERO","GOBIERNO_GENERAL","GOBIERNO_DE_LA_REPUBLICA","-","PODERES_AUXILIARES","13301","Poder Judicial","13301 - Poder Judicial","PODERES_AUXILIARES",null,null,null,"M05","MAYO","31 de Mayo",null,"2022-05-31"]
["SECTOR_PUBLICO_NO_FINANCIERO","GOBIERNO_GENERAL","GOBIERNO_DE_LA_REPUBLICA","-","PODERES_AUXILIARES","13401","Tribunal Supremo de Elecciones","13401 - Tribunal Supremo de Elecciones","PODERES_AUXILIARES",null,null,null,"T02","JUNIO","30 de Junio",null,"31/6/2022"]
["SECTOR_PUBLICO_NO_FINANCIERO","GOBIERNO_GENERAL","GOBIERNO_DE_LA_REPUBLICA","ADMINISTRACION_CENTRAL","ORGANOS_DESCONCENTRADOS","12505","Agencia de Protección de Datos de los Habitantes (PRODHAB)","12505 - Agencia de Protección de Datos de los Habitantes (PRODHAB)","ORGANOS_DESCONCENTRADOS",null,null,null,"M07","JULIO","31 de Julio",null,"2022-07-31"]
["SECTOR_PUBLICO_NO_FINANCIERO","GOBIERNO_GENERAL","GOBIERNO_DE_LA_REPUBLICA","ADMINISTRACION_CENTRAL","ORGANOS_DESCONCENTRADOS","12510","Casa de Cultura de Puntarenas","12510 - Casa de Cultura de Puntarenas","ORGANOS_DESCONCENTRADOS",null,null,null,"M08","AGOSTO","31 de Agosto",null,"2022-08-31"]
["SECTOR_PUBLICO_NO_FINANCIERO","GOBIERNO_GENERAL","GOBIERNO_DE_LA_REPUBLICA","ADMINISTRACION_CENTRAL","ORGANOS_DESCONCENTRADOS","12530","Centro Costarricense de Producción Cinematográfica ","12530 - Centro Costarricense de Producción Cinematográfica ","ORGANOS_DESCONCENTRADOS",null,null,null,"T03","SETIEMBRE","30 de Setiembre ",null,"2022-09-30"]
["SECTOR_PUBLICO_NO_FINANCIERO","GOBIERNO_GENERAL","GOBIERNO_DE_LA_REPUBLICA","ADMINISTRACION_CENTRAL","ORGANOS_DESCONCENTRADOS","12531","Centro Cultural e Histórico José Figueres Ferrer","12531 - Centro Cultural e Histórico José Figueres Ferrer","ORGANOS_DESCONCENTRADOS",null,null,null,"M10","OCTUBRE","31 de Octubre",null,"2022-10-31"]
["SECTOR_PUBLICO_NO_FINANCIERO","GOBIERNO_GENERAL","GOBIERNO_DE_LA_REPUBLICA","ADMINISTRACION_CENTRAL","ORGANOS_DESCONCENTRADOS","12534","Centro Nacional de la Música","12534 - Centro Nacional de la Música","ORGANOS_DESCONCENTRADOS",null,null,null,"M11","NOVIEMBRE","30 de Noviembre",null,"2022-11-30"]
["SECTOR_PUBLICO_NO_FINANCIERO","GOBIERNO_GENERAL","GOBIERNO_DE_LA_REPUBLICA","ADMINISTRACION_CENTRAL","ORGANOS_DESCONCENTRADOS","12553","Comisión Nacional para la Gestión de la Biodiversidad  (CONAGEBIO)","12553 - Comisión Nacional para la Gestión de la Biodiversidad  (CONAGEBIO)","ORGANOS_DESCONCENTRADOS",null,null,null,"T04","DICIEMBRE","31 de Diciembre",null,"2022-12-31"]
["SECTOR_PUBLICO_NO_FINANCIERO","GOBIERNO_GENERAL","GOBIERNO_DE_LA_REPUBLICA","ADMINISTRACION_CENTRAL","ORGANOS_DESCONCENTRADOS","12554","Comisión Nacional de Prevención de Riesgos y Atención de Emergencias  (CNE)","12554 - Comisión Nacional de Prevención de Riesgos y Atención de Emergencias  (CNE)","ORGANOS_DESCONCENTRADOS",null,null,null,"PXX","-"]
["SECTOR_PUBLICO_NO_FINANCIERO","GOBIERNO_GENERAL","GOBIERNO_DE_LA_REPUBLICA","ADMINISTRACION_CENTRAL","ORGANOS_DESCONCENTRADOS","12555","Comisión Nacional de Vacunación y Epidemiología","12555 - Comisión Nacional de Vacunación y Epidemiología","ORGANOS_DESCONCENTRADOS"]
["SECTOR_PUBLICO_NO_FINANCIERO","GOBIERNO_GENERAL","GOBIERNO_DE_LA_REPUBLICA","ADMINISTRACION_CENTRAL","ORGANOS_DESCONCENTRADOS","12556","Comisión de Ordenamiento y Manejo de la Cuenca Alta del  Río Reventazón  (CONCURE)","12556 - Comisión de Ordenamiento y Manejo de la Cuenca Alta del  Río Reventazón  (CONCURE)","ORGANOS_DESCONCENTRADOS"]
["SECTOR_PUBLICO_NO_FINANCIERO","GOBIERNO_GENERAL","GOBIERNO_DE_LA_REPUBLICA","ADMINISTRACION_CENTRAL","ORGANOS_DESCONCENTRADOS","12570","Consejo Nacional de Clubes 4-S","12570 - Consejo Nacional de Clubes 4-S","ORGANOS_DESCONCENTRADOS"]
["SECTOR_PUBLICO_NO_FINANCIERO","GOBIERNO_GENERAL","GOBIERNO_DE_LA_REPUBLICA","ADMINISTRACION_CENTRAL","ORGANOS_DESCONCENTRADOS","12575","Consejo Nacional de Investigación en Salud (CONIS)","12575 - Consejo Nacional de Investigación en Salud (CONIS)","ORGANOS_DESCONCENTRADOS"]
["SECTOR_PUBLICO_NO_FINANCIERO","GOBIERNO_GENERAL","GOBIERNO_DE_LA_REPUBLICA","ADMINISTRACION_CENTRAL","ORGANOS_DESCONCENTRADOS","12580","Consejo Nacional de Concesiones (CNC)","12580 - Consejo Nacional de Concesiones (CNC)","ORGANOS_DESCONCENTRADOS"]
["SECTOR_PUBLICO_NO_FINANCIERO","GOBIERNO_GENERAL","GOBIERNO_DE_LA_REPUBLICA","ADMINISTRACION_CENTRAL","ORGANOS_DESCONCENTRADOS","12581","Consejo Nacional de Personas con Discapacidad (CONAPDIS)","12581 - Consejo Nacional de Personas con Discapacidad (CONAPDIS)","ORGANOS_DESCONCENTRADOS"]
["SECTOR_PUBLICO_NO_FINANCIERO","GOBIERNO_GENERAL","GOBIERNO_DE_LA_REPUBLICA","ADMINISTRACION_CENTRAL","ORGANOS_DESCONCENTRADOS","12582","Consejo Nacional de la Persona Adulta Mayor (CONAPAM)","12582 - Consejo Nacional de la Persona Adulta Mayor (CONAPAM)","ORGANOS_DESCONCENTRADOS"]
["SECTOR_PUBLICO_NO_FINANCIERO","GOBIERNO_GENERAL","GOBIERNO_DE_LA_REPUBLICA","ADMINISTRACION_CENTRAL","ORGANOS_DESCONCENTRADOS","12583","Consejo Nacional de la Política Pública de la Persona Joven (CPJ)","12583 - Consejo Nacional de la Política Pública de la Persona Joven (CPJ)","ORGANOS_DESCONCENTRADOS"]
["SECTOR_PUBLICO_NO_FINANCIERO","GOBIERNO_GENERAL","GOBIERNO_DE_LA_REPUBLICA","ADMINISTRACION_CENTRAL","ORGANOS_DESCONCENTRADOS","12584","Consejo Nacional de Vialidad (CONAVI)","12584 - Consejo Nacional de Vialidad (CONAVI)","ORGANOS_DESCONCENTRADOS"]
["SECTOR_PUBLICO_NO_FINANCIERO","GOBIERNO_GENERAL","GOBIERNO_DE_LA_REPUBLICA","ADMINISTRACION_CENTRAL","ORGANOS_DESCONCENTRADOS","12587","Consejo de Seguridad Vial (COSEVI)","12587 - Consejo de Seguridad Vial (COSEVI)","ORGANOS_DESCONCENTRADOS"]
["SECTOR_PUBLICO_NO_FINANCIERO","GOBIERNO_GENERAL","GOBIERNO_DE_LA_REPUBLICA","ADMINISTRACION_CENTRAL","ORGANOS_DESCONCENTRADOS","12588","Consejo Superior de Educación (CSE)","12588 - Consejo Superior de Educación (CSE)","ORGANOS_DESCONCENTRADOS"]
["SECTOR_PUBLICO_NO_FINANCIERO","GOBIERNO_GENERAL","GOBIERNO_DE_LA_REPUBLICA","ADMINISTRACION_CENTRAL","ORGANOS_DESCONCENTRADOS","12589","Consejo Técnico de Asistencia Médico Social (CTAMS)","12589 - Consejo Técnico de Asistencia Médico Social (CTAMS)","ORGANOS_DESCONCENTRADOS"]
["SECTOR_PUBLICO_NO_FINANCIERO","GOBIERNO_GENERAL","GOBIERNO_DE_LA_REPUBLICA","ADMINISTRACION_CENTRAL","ORGANOS_DESCONCENTRADOS","12590","Consejo Técnico de Aviación Civil (CTAC) ","12590 - Consejo Técnico de Aviación Civil (CTAC) ","ORGANOS_DESCONCENTRADOS"]
["SECTOR_PUBLICO_NO_FINANCIERO","GOBIERNO_GENERAL","GOBIERNO_DE_LA_REPUBLICA","ADMINISTRACION_CENTRAL","ORGANOS_DESCONCENTRADOS","12591","Consejo de Transporte Público (CTP)","12591 - Consejo de Transporte Público (CTP)","ORGANOS_DESCONCENTRADOS"]
["SECTOR_PUBLICO_NO_FINANCIERO","GOBIERNO_GENERAL","GOBIERNO_DE_LA_REPUBLICA","ADMINISTRACION_CENTRAL","ORGANOS_DESCONCENTRADOS","12634","Dirección Nacional Centros Educacion y Nutrición  l ( CEN CINAI )","12634 - Dirección Nacional Centros Educacion y Nutrición  l ( CEN CINAI )","ORGANOS_DESCONCENTRADOS"]
["SECTOR_PUBLICO_NO_FINANCIERO","GOBIERNO_GENERAL","GOBIERNO_DE_LA_REPUBLICA","ADMINISTRACION_CENTRAL","ORGANOS_DESCONCENTRADOS","12637","Dirección Nacional de Notariado","12637 - Dirección Nacional de Notariado","ORGANOS_DESCONCENTRADOS"]
["SECTOR_PUBLICO_NO_FINANCIERO","GOBIERNO_GENERAL","GOBIERNO_DE_LA_REPUBLICA","ADMINISTRACION_CENTRAL","ORGANOS_DESCONCENTRADOS","12700","Fondo de Desarrollo Social y Asignaciones Familiares (FODESAF)","12700 - Fondo de Desarrollo Social y Asignaciones Familiares (FODESAF)","ORGANOS_DESCONCENTRADOS"]
["SECTOR_PUBLICO_NO_FINANCIERO","GOBIERNO_GENERAL","GOBIERNO_DE_LA_REPUBLICA","ADMINISTRACION_CENTRAL","ORGANOS_DESCONCENTRADOS","12704","Fondo Nacional de Financiamiento Forestal (FONAFIFO)","12704 - Fondo Nacional de Financiamiento Forestal (FONAFIFO)","ORGANOS_DESCONCENTRADOS"]
["SECTOR_PUBLICO_NO_FINANCIERO","GOBIERNO_GENERAL","GOBIERNO_DE_LA_REPUBLICA","ADMINISTRACION_CENTRAL","ORGANOS_DESCONCENTRADOS","12750","Instituto sobre Alcoholismo y Farmacodependencia  (IAFA)","12750 - Instituto sobre Alcoholismo y Farmacodependencia  (IAFA)","ORGANOS_DESCONCENTRADOS"]
["SECTOR_PUBLICO_NO_FINANCIERO","GOBIERNO_GENERAL","GOBIERNO_DE_LA_REPUBLICA","ADMINISTRACION_CENTRAL","ORGANOS_DESCONCENTRADOS","12751","Instituto Costarricense sobre Drogas  (ICD)","12751 - Instituto Costarricense sobre Drogas  (ICD)","ORGANOS_DESCONCENTRADOS"]
["SECTOR_PUBLICO_NO_FINANCIERO","GOBIERNO_GENERAL","GOBIERNO_DE_LA_REPUBLICA","ADMINISTRACION_CENTRAL","ORGANOS_DESCONCENTRADOS","12752","Instituto Costarricense de Investigación y Enseñanza en Nutrición y Salud  (INCIENSA)","12752 - Instituto Costarricense de Investigación y Enseñanza en Nutrición y Salud  (INCIENSA)","ORGANOS_DESCONCENTRADOS"]
["SECTOR_PUBLICO_NO_FINANCIERO","GOBIERNO_GENERAL","GOBIERNO_DE_LA_REPUBLICA","ADMINISTRACION_CENTRAL","ORGANOS_DESCONCENTRADOS","12755","Instituto Nacional de Innovación y Transferencia en Tecnología agropecuaria (INTA)","12755 - Instituto Nacional de Innovación y Transferencia en Tecnología agropecuaria (INTA)","ORGANOS_DESCONCENTRADOS"]
["SECTOR_PUBLICO_NO_FINANCIERO","GOBIERNO_GENERAL","GOBIERNO_DE_LA_REPUBLICA","ADMINISTRACION_CENTRAL","ORGANOS_DESCONCENTRADOS","12756","Instituto de Desarrollo Profesional Uladislao Gámez Solano","12756 - Instituto de Desarrollo Profesional Uladislao Gámez Solano","ORGANOS_DESCONCENTRADOS"]
["SECTOR_PUBLICO_NO_FINANCIERO","GOBIERNO_GENERAL","GOBIERNO_DE_LA_REPUBLICA","ADMINISTRACION_CENTRAL","ORGANOS_DESCONCENTRADOS","12780","Junta Administrativa del Archivo Nacional (JAAN)","12780 - Junta Administrativa del Archivo Nacional (JAAN)","ORGANOS_DESCONCENTRADOS"]
["SECTOR_PUBLICO_NO_FINANCIERO","GOBIERNO_GENERAL","GOBIERNO_DE_LA_REPUBLICA","ADMINISTRACION_CENTRAL","ORGANOS_DESCONCENTRADOS","12781","Junta Administrativa  de la Dirección General de Migración y Extranjería","12781 - Junta Administrativa  de la Dirección General de Migración y Extranjería","ORGANOS_DESCONCENTRADOS"]
["SECTOR_PUBLICO_NO_FINANCIERO","GOBIERNO_GENERAL","GOBIERNO_DE_LA_REPUBLICA","ADMINISTRACION_CENTRAL","ORGANOS_DESCONCENTRADOS","12782","Junta Administrativa de la Imprenta Nacional (JAIN)","12782 - Junta Administrativa de la Imprenta Nacional (JAIN)","ORGANOS_DESCONCENTRADOS"]
["SECTOR_PUBLICO_NO_FINANCIERO","GOBIERNO_GENERAL","GOBIERNO_DE_LA_REPUBLICA","ADMINISTRACION_CENTRAL","ORGANOS_DESCONCENTRADOS","12784","Junta Administrativa del Registro Nacional  ","12784 - Junta Administrativa del Registro Nacional  ","ORGANOS_DESCONCENTRADOS"]
["SECTOR_PUBLICO_NO_FINANCIERO","GOBIERNO_GENERAL","GOBIERNO_DE_LA_REPUBLICA","ADMINISTRACION_CENTRAL","ORGANOS_DESCONCENTRADOS","12795","Laboratorio Costarricense de Metrología (LACOMET)","12795 - Laboratorio Costarricense de Metrología (LACOMET)","ORGANOS_DESCONCENTRADOS"]
["SECTOR_PUBLICO_NO_FINANCIERO","GOBIERNO_GENERAL","GOBIERNO_DE_LA_REPUBLICA","ADMINISTRACION_CENTRAL","ORGANOS_DESCONCENTRADOS","12800","Museo de Arte Costarricense","12800 - Museo de Arte Costarricense","ORGANOS_DESCONCENTRADOS"]
["SECTOR_PUBLICO_NO_FINANCIERO","GOBIERNO_GENERAL","GOBIERNO_DE_LA_REPUBLICA","ADMINISTRACION_CENTRAL","ORGANOS_DESCONCENTRADOS","12801","Museo de Arte y Diseño Contemporáneo (MADC)","12801 - Museo de Arte y Diseño Contemporáneo (MADC)","ORGANOS_DESCONCENTRADOS"]
["SECTOR_PUBLICO_NO_FINANCIERO","GOBIERNO_GENERAL","GOBIERNO_DE_LA_REPUBLICA","ADMINISTRACION_CENTRAL","ORGANOS_DESCONCENTRADOS","12802","Museo Histórico Cultural Juan Santamaría","12802 - Museo Histórico Cultural Juan Santamaría","ORGANOS_DESCONCENTRADOS"]
["SECTOR_PUBLICO_NO_FINANCIERO","GOBIERNO_GENERAL","GOBIERNO_DE_LA_REPUBLICA","ADMINISTRACION_CENTRAL","ORGANOS_DESCONCENTRADOS","12804","Museo Nacional de Costa Rica (MNCR)","12804 - Museo Nacional de Costa Rica (MNCR)","ORGANOS_DESCONCENTRADOS"]
["SECTOR_PUBLICO_NO_FINANCIERO","GOBIERNO_GENERAL","GOBIERNO_DE_LA_REPUBLICA","ADMINISTRACION_CENTRAL","ORGANOS_DESCONCENTRADOS","12805","Museo Dr. Rafael Ángel Calderón Guardia","12805 - Museo Dr. Rafael Ángel Calderón Guardia","ORGANOS_DESCONCENTRADOS"]
["SECTOR_PUBLICO_NO_FINANCIERO","GOBIERNO_GENERAL","GOBIERNO_DE_LA_REPUBLICA","ADMINISTRACION_CENTRAL","ORGANOS_DESCONCENTRADOS","12820","Oficina de Cooperación Internacional de la Salud (OCIS)","12820 - Oficina de Cooperación Internacional de la Salud (OCIS)","ORGANOS_DESCONCENTRADOS"]
["SECTOR_PUBLICO_NO_FINANCIERO","GOBIERNO_GENERAL","GOBIERNO_DE_LA_REPUBLICA","ADMINISTRACION_CENTRAL","ORGANOS_DESCONCENTRADOS","12853","Parque Marino del Pacífico","12853 - Parque Marino del Pacífico","ORGANOS_DESCONCENTRADOS"]
["SECTOR_PUBLICO_NO_FINANCIERO","GOBIERNO_GENERAL","GOBIERNO_DE_LA_REPUBLICA","ADMINISTRACION_CENTRAL","ORGANOS_DESCONCENTRADOS","12901","Servicio Fitosanitario del Estado","12901 - Servicio Fitosanitario del Estado","ORGANOS_DESCONCENTRADOS"]
["SECTOR_PUBLICO_NO_FINANCIERO","GOBIERNO_GENERAL","GOBIERNO_DE_LA_REPUBLICA","ADMINISTRACION_CENTRAL","ORGANOS_DESCONCENTRADOS","12902","Servicio Nacional de Salud Animal (SENASA)","12902 - Servicio Nacional de Salud Animal (SENASA)","ORGANOS_DESCONCENTRADOS"]
["SECTOR_PUBLICO_NO_FINANCIERO","GOBIERNO_GENERAL","GOBIERNO_DE_LA_REPUBLICA","ADMINISTRACION_CENTRAL","ORGANOS_DESCONCENTRADOS","12908"," Sistema Nacional de Áreas de Conservación (SINAC) ","12908 -  Sistema Nacional de Áreas de Conservación (SINAC) ","ORGANOS_DESCONCENTRADOS"]
["SECTOR_PUBLICO_NO_FINANCIERO","GOBIERNO_GENERAL","GOBIERNO_DE_LA_REPUBLICA","ADMINISTRACION_CENTRAL","ORGANOS_DESCONCENTRADOS","12914","Sistema Nacional de Educación Musical (SINEM)","12914 - Sistema Nacional de Educación Musical (SINEM)","ORGANOS_DESCONCENTRADOS"]
["SECTOR_PUBLICO_NO_FINANCIERO","GOBIERNO_GENERAL","GOBIERNO_DE_LA_REPUBLICA","ADMINISTRACION_CENTRAL","ORGANOS_DESCONCENTRADOS","12920","Teatro Nacional (TNCR)","12920 - Teatro Nacional (TNCR)","ORGANOS_DESCONCENTRADOS"]
["SECTOR_PUBLICO_NO_FINANCIERO","GOBIERNO_GENERAL","GOBIERNO_DE_LA_REPUBLICA","ADMINISTRACION_CENTRAL","ORGANOS_DESCONCENTRADOS","12921","Teatro Popular Mélico Salazar  (TPMS)","12921 - Teatro Popular Mélico Salazar  (TPMS)","ORGANOS_DESCONCENTRADOS"]
["SECTOR_PUBLICO_NO_FINANCIERO","GOBIERNO_GENERAL","GOBIERNO_DE_LA_REPUBLICA","ADMINISTRACION_CENTRAL","ORGANOS_DESCONCENTRADOS","12940","Tribunal Registral Administrativo  (TRA)","12940 - Tribunal Registral Administrativo  (TRA)","ORGANOS_DESCONCENTRADOS"]
["SECTOR_PUBLICO_NO_FINANCIERO","GOBIERNO_GENERAL","-","-","INSTITUCIONES_DESCENTRALIZADAS","14110","Autoridad Reguladora de Servicios Públicos (ARESEP)","14110 - Autoridad Reguladora de Servicios Públicos (ARESEP)","INSTITUCIONES_DESCENTRALIZADAS"]
["SECTOR_PUBLICO_NO_FINANCIERO","GOBIERNO_GENERAL","-","-","INSTITUCIONES_DESCENTRALIZADAS","14115","Benemérito Cuerpo de Bomberos de Costa Rica","14115 - Benemérito Cuerpo de Bomberos de Costa Rica","INSTITUCIONES_DESCENTRALIZADAS"]
["SECTOR_PUBLICO_NO_FINANCIERO","GOBIERNO_GENERAL","-","-","INSTITUCIONES_DESCENTRALIZADAS","14120","Caja Costarricense de Seguro Social (CCSS)","14120 - Caja Costarricense de Seguro Social (CCSS)","INSTITUCIONES_DESCENTRALIZADAS"]
["SECTOR_PUBLICO_NO_FINANCIERO","GOBIERNO_GENERAL","-","-","INSTITUCIONES_DESCENTRALIZADAS","14132","Colegio Universitario de Cartago (CUC)","14132 - Colegio Universitario de Cartago (CUC)","INSTITUCIONES_DESCENTRALIZADAS"]
["SECTOR_PUBLICO_NO_FINANCIERO","GOBIERNO_GENERAL","-","-","INSTITUCIONES_DESCENTRALIZADAS","14133","Colegio Universitario de Limón (CUNLIMON)","14133 - Colegio Universitario de Limón (CUNLIMON)","INSTITUCIONES_DESCENTRALIZADAS"]
["SECTOR_PUBLICO_NO_FINANCIERO","GOBIERNO_GENERAL","-","-","INSTITUCIONES_DESCENTRALIZADAS","14137","Comisión de Energía Atómica de Costa Rica (CEA)","14137 - Comisión de Energía Atómica de Costa Rica (CEA)","INSTITUCIONES_DESCENTRALIZADAS"]
["SECTOR_PUBLICO_NO_FINANCIERO","GOBIERNO_GENERAL","-","-","INSTITUCIONES_DESCENTRALIZADAS","14150","Comisión Nacional de Asuntos Indígenas (CONAI)","14150 - Comisión Nacional de Asuntos Indígenas (CONAI)","INSTITUCIONES_DESCENTRALIZADAS"]
["SECTOR_PUBLICO_NO_FINANCIERO","GOBIERNO_GENERAL","-","-","INSTITUCIONES_DESCENTRALIZADAS","14161","Promotora Costarricense de Innovación e Investigación (PROMOTORA)","14161 - Promotora Costarricense de Innovación e Investigación (PROMOTORA)","INSTITUCIONES_DESCENTRALIZADAS"]
["SECTOR_PUBLICO_NO_FINANCIERO","GOBIERNO_GENERAL","-","-","INSTITUCIONES_DESCENTRALIZADAS","14162","Consejo Nacional de Rectores (CONARE)","14162 - Consejo Nacional de Rectores (CONARE)","INSTITUCIONES_DESCENTRALIZADAS"]
["SECTOR_PUBLICO_NO_FINANCIERO","GOBIERNO_GENERAL","-","-","INSTITUCIONES_DESCENTRALIZADAS","14222","Instituto Costarricense del Deporte y la Recreación (ICODER)","14222 - Instituto Costarricense del Deporte y la Recreación (ICODER)","INSTITUCIONES_DESCENTRALIZADAS"]
["SECTOR_PUBLICO_NO_FINANCIERO","GOBIERNO_GENERAL","-","-","INSTITUCIONES_DESCENTRALIZADAS","14223","Instituto Costarricense de Pesca y Acuicultura (INCOPESCA)","14223 - Instituto Costarricense de Pesca y Acuicultura (INCOPESCA)","INSTITUCIONES_DESCENTRALIZADAS"]
["SECTOR_PUBLICO_NO_FINANCIERO","GOBIERNO_GENERAL","-","-","INSTITUCIONES_DESCENTRALIZADAS","14224","Instituto Costarricense de Turismo (ICT)","14224 - Instituto Costarricense de Turismo (ICT)","INSTITUCIONES_DESCENTRALIZADAS"]
["SECTOR_PUBLICO_NO_FINANCIERO","GOBIERNO_GENERAL","-","-","INSTITUCIONES_DESCENTRALIZADAS","14225","Instituto de Desarrollo Rural (INDER)","14225 - Instituto de Desarrollo Rural (INDER)","INSTITUCIONES_DESCENTRALIZADAS"]
["SECTOR_PUBLICO_NO_FINANCIERO","GOBIERNO_GENERAL","-","-","INSTITUCIONES_DESCENTRALIZADAS","14226","Instituto de Fomento y Asesoría Municipal (IFAM)","14226 - Instituto de Fomento y Asesoría Municipal (IFAM)","INSTITUCIONES_DESCENTRALIZADAS"]
["SECTOR_PUBLICO_NO_FINANCIERO","GOBIERNO_GENERAL","-","-","INSTITUCIONES_DESCENTRALIZADAS","14227","Instituto Mixto de Ayuda Social (IMAS)","14227 - Instituto Mixto de Ayuda Social (IMAS)","INSTITUCIONES_DESCENTRALIZADAS"]
["SECTOR_PUBLICO_NO_FINANCIERO","GOBIERNO_GENERAL","-","-","INSTITUCIONES_DESCENTRALIZADAS","14228","Instituto Nacional de Aprendizaje (INA)","14228 - Instituto Nacional de Aprendizaje (INA)","INSTITUCIONES_DESCENTRALIZADAS"]
["SECTOR_PUBLICO_NO_FINANCIERO","GOBIERNO_GENERAL","-","-","INSTITUCIONES_DESCENTRALIZADAS","14229","Instituto Nacional de Estadística y Censos (INEC)","14229 - Instituto Nacional de Estadística y Censos (INEC)","INSTITUCIONES_DESCENTRALIZADAS"]
["SECTOR_PUBLICO_NO_FINANCIERO","GOBIERNO_GENERAL","-","-","INSTITUCIONES_DESCENTRALIZADAS","14230","Instituto Nacional de las Mujeres (INAMU)","14230 - Instituto Nacional de las Mujeres (INAMU)","INSTITUCIONES_DESCENTRALIZADAS"]
["SECTOR_PUBLICO_NO_FINANCIERO","GOBIERNO_GENERAL","-","-","INSTITUCIONES_DESCENTRALIZADAS","14251","Junta Administrativa Colegio San Luis Gonzaga (JACSLG)","14251 - Junta Administrativa Colegio San Luis Gonzaga (JACSLG)","INSTITUCIONES_DESCENTRALIZADAS"]
["SECTOR_PUBLICO_NO_FINANCIERO","GOBIERNO_GENERAL","-","-","INSTITUCIONES_DESCENTRALIZADAS","14252","Junta de Desarrollo Regional de la Zona Sur de la Provincia de Puntarenas (JUDESUR)","14252 - Junta de Desarrollo Regional de la Zona Sur de la Provincia de Puntarenas (JUDESUR)","INSTITUCIONES_DESCENTRALIZADAS"]
["SECTOR_PUBLICO_NO_FINANCIERO","GOBIERNO_GENERAL","-","-","INSTITUCIONES_DESCENTRALIZADAS","14267","Oficina Nacional de Semillas (ONS)","14267 - Oficina Nacional de Semillas (ONS)","INSTITUCIONES_DESCENTRALIZADAS"]
["SECTOR_PUBLICO_NO_FINANCIERO","GOBIERNO_GENERAL","-","-","INSTITUCIONES_DESCENTRALIZADAS","14275","Patronato Nacional de Ciegos (PANACI) 12851","14275 - Patronato Nacional de Ciegos (PANACI) 12851","INSTITUCIONES_DESCENTRALIZADAS"]
["SECTOR_PUBLICO_NO_FINANCIERO","GOBIERNO_GENERAL","-","-","INSTITUCIONES_DESCENTRALIZADAS","14290","Patronato Nacional de la Infancia (PANI)","14290 - Patronato Nacional de la Infancia (PANI)","INSTITUCIONES_DESCENTRALIZADAS"]
["SECTOR_PUBLICO_NO_FINANCIERO","GOBIERNO_GENERAL","-","-","INSTITUCIONES_DESCENTRALIZADAS","14300","Programa Integral de Mercadeo Agropecuario (PIMA)","14300 - Programa Integral de Mercadeo Agropecuario (PIMA)","INSTITUCIONES_DESCENTRALIZADAS"]
["SECTOR_PUBLICO_NO_FINANCIERO","GOBIERNO_GENERAL","-","-","INSTITUCIONES_DESCENTRALIZADAS","14320","Servicio Nacional de Aguas Subterráneas, Riego y Avenamiento (SENARA)","14320 - Servicio Nacional de Aguas Subterráneas, Riego y Avenamiento (SENARA)","INSTITUCIONES_DESCENTRALIZADAS"]
["SECTOR_PUBLICO_NO_FINANCIERO","GOBIERNO_GENERAL","-","-","INSTITUCIONES_DESCENTRALIZADAS","14323","Sistema de Emergencias 9-1-1","14323 - Sistema de Emergencias 9-1-1","INSTITUCIONES_DESCENTRALIZADAS"]
["SECTOR_PUBLICO_NO_FINANCIERO","GOBIERNO_GENERAL","-","-","INSTITUCIONES_DESCENTRALIZADAS","14326","Superintendencia de Telecomunicaciones (SUTEL)","14326 - Superintendencia de Telecomunicaciones (SUTEL)","INSTITUCIONES_DESCENTRALIZADAS"]
["SECTOR_PUBLICO_NO_FINANCIERO","GOBIERNO_GENERAL","-","-","INSTITUCIONES_DESCENTRALIZADAS","14990","Sistema Nacional de Acreditación para Educación Superior (SINAES) 12325","14990 - Sistema Nacional de Acreditación para Educación Superior (SINAES) 12325","INSTITUCIONES_DESCENTRALIZADAS"]
["SECTOR_PUBLICO_NO_FINANCIERO","GOBIERNO_GENERAL","-","-","UNIVERSIDADES_PUBLICAS","14231","Instituto Tecnológico de Costa Rica (ITCR)","14231 - Instituto Tecnológico de Costa Rica (ITCR)","UNIVERSIDADES_PUBLICAS"]
["SECTOR_PUBLICO_NO_FINANCIERO","GOBIERNO_GENERAL","-","-","UNIVERSIDADES_PUBLICAS","14340","Universidad de Costa Rica (UCR)","14340 - Universidad de Costa Rica (UCR)","UNIVERSIDADES_PUBLICAS"]
["SECTOR_PUBLICO_NO_FINANCIERO","GOBIERNO_GENERAL","-","-","UNIVERSIDADES_PUBLICAS","14341","Universidad Estatal a Distancia (UNED)","14341 - Universidad Estatal a Distancia (UNED)","UNIVERSIDADES_PUBLICAS"]
["SECTOR_PUBLICO_NO_FINANCIERO","GOBIERNO_GENERAL","-","-","UNIVERSIDADES_PUBLICAS","14342","Universidad Nacional (UNA)","14342 - Universidad Nacional (UNA)","UNIVERSIDADES_PUBLICAS"]
["SECTOR_PUBLICO_NO_FINANCIERO","GOBIERNO_GENERAL","-","-","UNIVERSIDADES_PUBLICAS","14353","Universidad Técnica Nacional","14353 - Universidad Técnica Nacional","UNIVERSIDADES_PUBLICAS"]
["SECTOR_PUBLICO_NO_FINANCIERO","GOBIERNO_GENERAL","-","-","INSTITUCIONES_FINANCIERAS_NO_BANCARIAS","22150","CONAPE","22150 - CONAPE","INSTITUCIONES_FINANCIERAS_NO_BANCARIAS"]
["SECTOR_PUBLICO_NO_FINANCIERO","GOBIERNO_GENERAL","-","-","INSTITUCIONES_FINANCIERAS_NO_BANCARIAS","22165","Fondo de Desarrollo de la Provincia de Limón (FODELI) 14210","22165 - Fondo de Desarrollo de la Provincia de Limón (FODELI) 14210","INSTITUCIONES_FINANCIERAS_NO_BANCARIAS"]
["SECTOR_PUBLICO_NO_FINANCIERO","GOBIERNO_GENERAL","-","-","INSTITUCIONES_FINANCIERAS_NO_BANCARIAS","22194","INVU","22194 - INVU","INSTITUCIONES_FINANCIERAS_NO_BANCARIAS"]
["SECTOR_PUBLICO_NO_FINANCIERO","GOBIERNO_GENERAL","-","-","SECTOR_MUNICIPAL","15101","Municipalidad de San José ","15101 - Municipalidad de San José ","SECTOR_MUNICIPAL"]
["SECTOR_PUBLICO_NO_FINANCIERO","GOBIERNO_GENERAL","-","-","SECTOR_MUNICIPAL","15102","Municipalidad de Escazú","15102 - Municipalidad de Escazú","SECTOR_MUNICIPAL"]
["SECTOR_PUBLICO_NO_FINANCIERO","GOBIERNO_GENERAL","-","-","SECTOR_MUNICIPAL","15103","Municipalidad de Desamparados","15103 - Municipalidad de Desamparados","SECTOR_MUNICIPAL"]
["SECTOR_PUBLICO_NO_FINANCIERO","GOBIERNO_GENERAL","-","-","SECTOR_MUNICIPAL","15104","Municipalidad de Puriscal","15104 - Municipalidad de Puriscal","SECTOR_MUNICIPAL"]
["SECTOR_PUBLICO_NO_FINANCIERO","GOBIERNO_GENERAL","-","-","SECTOR_MUNICIPAL","15105","Municipalidad de Tarrazú","15105 - Municipalidad de Tarrazú","SECTOR_MUNICIPAL"]
["SECTOR_PUBLICO_NO_FINANCIERO","GOBIERNO_GENERAL","-","-","SECTOR_MUNICIPAL","15106","Municipalidad de Aserrí","15106 - Municipalidad de Aserrí","SECTOR_MUNICIPAL"]
["SECTOR_PUBLICO_NO_FINANCIERO","GOBIERNO_GENERAL","-","-","SECTOR_MUNICIPAL","15107","Municipalidad de Mora","15107 - Municipalidad de Mora","SECTOR_MUNICIPAL"]
["SECTOR_PUBLICO_NO_FINANCIERO","GOBIERNO_GENERAL","-","-","SECTOR_MUNICIPAL","15108","Municipalidad de Goicoechea","15108 - Municipalidad de Goicoechea","SECTOR_MUNICIPAL"]
["SECTOR_PUBLICO_NO_FINANCIERO","GOBIERNO_GENERAL","-","-","SECTOR_MUNICIPAL","15109","Municipalidad de Santa Ana","15109 - Municipalidad de Santa Ana","SECTOR_MUNICIPAL"]
["SECTOR_PUBLICO_NO_FINANCIERO","GOBIERNO_GENERAL","-","-","SECTOR_MUNICIPAL","15110","Municipalidad de Alajuelita","15110 - Municipalidad de Alajuelita","SECTOR_MUNICIPAL"]
["SECTOR_PUBLICO_NO_FINANCIERO","GOBIERNO_GENERAL","-","-","SECTOR_MUNICIPAL","15111","Municipalidad de Vásquez de Coronado","15111 - Municipalidad de Vásquez de Coronado","SECTOR_MUNICIPAL"]
["SECTOR_PUBLICO_NO_FINANCIERO","GOBIERNO_GENERAL","-","-","SECTOR_MUNICIPAL","15112","Municipalidad de Acosta","15112 - Municipalidad de Acosta","SECTOR_MUNICIPAL"]
["SECTOR_PUBLICO_NO_FINANCIERO","GOBIERNO_GENERAL","-","-","SECTOR_MUNICIPAL","15113","Municipalidad de Tibás","15113 - Municipalidad de Tibás","SECTOR_MUNICIPAL"]
["SECTOR_PUBLICO_NO_FINANCIERO","GOBIERNO_GENERAL","-","-","SECTOR_MUNICIPAL","15114","Municipalidad de Moravia","15114 - Municipalidad de Moravia","SECTOR_MUNICIPAL"]
["SECTOR_PUBLICO_NO_FINANCIERO","GOBIERNO_GENERAL","-","-","SECTOR_MUNICIPAL","15115","Municipalidad de Montes de Oca","15115 - Municipalidad de Montes de Oca","SECTOR_MUNICIPAL"]
["SECTOR_PUBLICO_NO_FINANCIERO","GOBIERNO_GENERAL","-","-","SECTOR_MUNICIPAL","15116","Municipalidad de Turrubares","15116 - Municipalidad de Turrubares","SECTOR_MUNICIPAL"]
["SECTOR_PUBLICO_NO_FINANCIERO","GOBIERNO_GENERAL","-","-","SECTOR_MUNICIPAL","15117","Municipalidad de Dota","15117 - Municipalidad de Dota","SECTOR_MUNICIPAL"]
["SECTOR_PUBLICO_NO_FINANCIERO","GOBIERNO_GENERAL","-","-","SECTOR_MUNICIPAL","15118","Municipalidad de Curridabat","15118 - Municipalidad de Curridabat","SECTOR_MUNICIPAL"]
["SECTOR_PUBLICO_NO_FINANCIERO","GOBIERNO_GENERAL","-","-","SECTOR_MUNICIPAL","15119","Municipalidad de Pérez Zeledón","15119 - Municipalidad de Pérez Zeledón","SECTOR_MUNICIPAL"]
["SECTOR_PUBLICO_NO_FINANCIERO","GOBIERNO_GENERAL","-","-","SECTOR_MUNICIPAL","15120","Municipalidad de León Cortés","15120 - Municipalidad de León Cortés","SECTOR_MUNICIPAL"]
["SECTOR_PUBLICO_NO_FINANCIERO","GOBIERNO_GENERAL","-","-","SECTOR_MUNICIPAL","15201","Municipalidad de Alajuela","15201 - Municipalidad de Alajuela","SECTOR_MUNICIPAL"]
["SECTOR_PUBLICO_NO_FINANCIERO","GOBIERNO_GENERAL","-","-","SECTOR_MUNICIPAL","15202","Municipalidad de San Ramón","15202 - Municipalidad de San Ramón","SECTOR_MUNICIPAL"]
["SECTOR_PUBLICO_NO_FINANCIERO","GOBIERNO_GENERAL","-","-","SECTOR_MUNICIPAL","15203","Municipalidad de Grecia","15203 - Municipalidad de Grecia","SECTOR_MUNICIPAL"]
["SECTOR_PUBLICO_NO_FINANCIERO","GOBIERNO_GENERAL","-","-","SECTOR_MUNICIPAL","15204","Municipalidad de San Mateo","15204 - Municipalidad de San Mateo","SECTOR_MUNICIPAL"]
["SECTOR_PUBLICO_NO_FINANCIERO","GOBIERNO_GENERAL","-","-","SECTOR_MUNICIPAL","15205","Municipalidad de Atenas","15205 - Municipalidad de Atenas","SECTOR_MUNICIPAL"]
["SECTOR_PUBLICO_NO_FINANCIERO","GOBIERNO_GENERAL","-","-","SECTOR_MUNICIPAL","15206","Municipalidad de Naranjo","15206 - Municipalidad de Naranjo","SECTOR_MUNICIPAL"]
["SECTOR_PUBLICO_NO_FINANCIERO","GOBIERNO_GENERAL","-","-","SECTOR_MUNICIPAL","15207","Municipalidad de Palmares","15207 - Municipalidad de Palmares","SECTOR_MUNICIPAL"]
["SECTOR_PUBLICO_NO_FINANCIERO","GOBIERNO_GENERAL","-","-","SECTOR_MUNICIPAL","15208","Municipalidad de Poás","15208 - Municipalidad de Poás","SECTOR_MUNICIPAL"]
["SECTOR_PUBLICO_NO_FINANCIERO","GOBIERNO_GENERAL","-","-","SECTOR_MUNICIPAL","15209","Municipalidad de Orotina","15209 - Municipalidad de Orotina","SECTOR_MUNICIPAL"]
["SECTOR_PUBLICO_NO_FINANCIERO","GOBIERNO_GENERAL","-","-","SECTOR_MUNICIPAL","15210","Municipalidad de San Carlos","15210 - Municipalidad de San Carlos","SECTOR_MUNICIPAL"]
["SECTOR_PUBLICO_NO_FINANCIERO","GOBIERNO_GENERAL","-","-","SECTOR_MUNICIPAL","15211","Municipalidad de Alfaro Ruíz","15211 - Municipalidad de Alfaro Ruíz","SECTOR_MUNICIPAL"]
["SECTOR_PUBLICO_NO_FINANCIERO","GOBIERNO_GENERAL","-","-","SECTOR_MUNICIPAL","15212","Municipalidad de Sarchí","15212 - Municipalidad de Sarchí","SECTOR_MUNICIPAL"]
["SECTOR_PUBLICO_NO_FINANCIERO","GOBIERNO_GENERAL","-","-","SECTOR_MUNICIPAL","15213","Municipalidad de Upala","15213 - Municipalidad de Upala","SECTOR_MUNICIPAL"]
["SECTOR_PUBLICO_NO_FINANCIERO","GOBIERNO_GENERAL","-","-","SECTOR_MUNICIPAL","15214","Municipalidad de Los Chiles","15214 - Municipalidad de Los Chiles","SECTOR_MUNICIPAL"]
["SECTOR_PUBLICO_NO_FINANCIERO","GOBIERNO_GENERAL","-","-","SECTOR_MUNICIPAL","15215","Municipalidad de Guatuso","15215 - Municipalidad de Guatuso","SECTOR_MUNICIPAL"]
["SECTOR_PUBLICO_NO_FINANCIERO","GOBIERNO_GENERAL","-","-","SECTOR_MUNICIPAL","15216","Municipalidad de Rio Cuarto","15216 - Municipalidad de Rio Cuarto","SECTOR_MUNICIPAL"]
["SECTOR_PUBLICO_NO_FINANCIERO","GOBIERNO_GENERAL","-","-","SECTOR_MUNICIPAL","15220","Concejo Municipal de Distrito de Peñas Blancas de San Ramón","15220 - Concejo Municipal de Distrito de Peñas Blancas de San Ramón","SECTOR_MUNICIPAL"]
["SECTOR_PUBLICO_NO_FINANCIERO","GOBIERNO_GENERAL","-","-","SECTOR_MUNICIPAL","15301","Municipalidad de Cartago","15301 - Municipalidad de Cartago","SECTOR_MUNICIPAL"]
["SECTOR_PUBLICO_NO_FINANCIERO","GOBIERNO_GENERAL","-","-","SECTOR_MUNICIPAL","15302","Municipalidad de Paraíso","15302 - Municipalidad de Paraíso","SECTOR_MUNICIPAL"]
["SECTOR_PUBLICO_NO_FINANCIERO","GOBIERNO_GENERAL","-","-","SECTOR_MUNICIPAL","15303","Municipalidad de La Unión","15303 - Municipalidad de La Unión","SECTOR_MUNICIPAL"]
["SECTOR_PUBLICO_NO_FINANCIERO","GOBIERNO_GENERAL","-","-","SECTOR_MUNICIPAL","15304","Municipalidad de Jiménez","15304 - Municipalidad de Jiménez","SECTOR_MUNICIPAL"]
["SECTOR_PUBLICO_NO_FINANCIERO","GOBIERNO_GENERAL","-","-","SECTOR_MUNICIPAL","15305","Municipalidad de Turrialba","15305 - Municipalidad de Turrialba","SECTOR_MUNICIPAL"]
["SECTOR_PUBLICO_NO_FINANCIERO","GOBIERNO_GENERAL","-","-","SECTOR_MUNICIPAL","15306","Municipalidad de Alvarado","15306 - Municipalidad de Alvarado","SECTOR_MUNICIPAL"]
["SECTOR_PUBLICO_NO_FINANCIERO","GOBIERNO_GENERAL","-","-","SECTOR_MUNICIPAL","15307","Municipalidad de Oreamuno","15307 - Municipalidad de Oreamuno","SECTOR_MUNICIPAL"]
["SECTOR_PUBLICO_NO_FINANCIERO","GOBIERNO_GENERAL","-","-","SECTOR_MUNICIPAL","15308","Municipalidad de El Guarco","15308 - Municipalidad de El Guarco","SECTOR_MUNICIPAL"]
["SECTOR_PUBLICO_NO_FINANCIERO","GOBIERNO_GENERAL","-","-","SECTOR_MUNICIPAL","15320","Concejo Municipal de Distrito de Cervantes de Alvarado","15320 - Concejo Municipal de Distrito de Cervantes de Alvarado","SECTOR_MUNICIPAL"]
["SECTOR_PUBLICO_NO_FINANCIERO","GOBIERNO_GENERAL","-","-","SECTOR_MUNICIPAL","15321","Concejo Municipal de Distrito de Tucurrique de Jiménez","15321 - Concejo Municipal de Distrito de Tucurrique de Jiménez","SECTOR_MUNICIPAL"]
["SECTOR_PUBLICO_NO_FINANCIERO","GOBIERNO_GENERAL","-","-","SECTOR_MUNICIPAL","15401","Municipalidad de Heredia","15401 - Municipalidad de Heredia","SECTOR_MUNICIPAL"]
["SECTOR_PUBLICO_NO_FINANCIERO","GOBIERNO_GENERAL","-","-","SECTOR_MUNICIPAL","15402","Municipalidad de Barva","15402 - Municipalidad de Barva","SECTOR_MUNICIPAL"]
["SECTOR_PUBLICO_NO_FINANCIERO","GOBIERNO_GENERAL","-","-","SECTOR_MUNICIPAL","15403","Municipalidad de Santo Domingo","15403 - Municipalidad de Santo Domingo","SECTOR_MUNICIPAL"]
["SECTOR_PUBLICO_NO_FINANCIERO","GOBIERNO_GENERAL","-","-","SECTOR_MUNICIPAL","15404","Municipalidad de Santa Barbara","15404 - Municipalidad de Santa Barbara","SECTOR_MUNICIPAL"]
["SECTOR_PUBLICO_NO_FINANCIERO","GOBIERNO_GENERAL","-","-","SECTOR_MUNICIPAL","15405","Municipalidad de San Rafael","15405 - Municipalidad de San Rafael","SECTOR_MUNICIPAL"]
["SECTOR_PUBLICO_NO_FINANCIERO","GOBIERNO_GENERAL","-","-","SECTOR_MUNICIPAL","15406","Municipalidad de San Isidro","15406 - Municipalidad de San Isidro","SECTOR_MUNICIPAL"]
["SECTOR_PUBLICO_NO_FINANCIERO","GOBIERNO_GENERAL","-","-","SECTOR_MUNICIPAL","15407","Municipalidad de Belén","15407 - Municipalidad de Belén","SECTOR_MUNICIPAL"]
["SECTOR_PUBLICO_NO_FINANCIERO","GOBIERNO_GENERAL","-","-","SECTOR_MUNICIPAL","15408","Municipalidad de Flores","15408 - Municipalidad de Flores","SECTOR_MUNICIPAL"]
["SECTOR_PUBLICO_NO_FINANCIERO","GOBIERNO_GENERAL","-","-","SECTOR_MUNICIPAL","15409","Municipalidad de San Pablo","15409 - Municipalidad de San Pablo","SECTOR_MUNICIPAL"]
["SECTOR_PUBLICO_NO_FINANCIERO","GOBIERNO_GENERAL","-","-","SECTOR_MUNICIPAL","15410","Municipalidad de Sarapiquí","15410 - Municipalidad de Sarapiquí","SECTOR_MUNICIPAL"]
["SECTOR_PUBLICO_NO_FINANCIERO","GOBIERNO_GENERAL","-","-","SECTOR_MUNICIPAL","15501","Municipalidad de Liberia","15501 - Municipalidad de Liberia","SECTOR_MUNICIPAL"]
["SECTOR_PUBLICO_NO_FINANCIERO","GOBIERNO_GENERAL","-","-","SECTOR_MUNICIPAL","15502","Municipalidad de Nicoya","15502 - Municipalidad de Nicoya","SECTOR_MUNICIPAL"]
["SECTOR_PUBLICO_NO_FINANCIERO","GOBIERNO_GENERAL","-","-","SECTOR_MUNICIPAL","15503","Municipalidad de Santa Cruz","15503 - Municipalidad de Santa Cruz","SECTOR_MUNICIPAL"]
["SECTOR_PUBLICO_NO_FINANCIERO","GOBIERNO_GENERAL","-","-","SECTOR_MUNICIPAL","15504","Municipalidad de Bagaces","15504 - Municipalidad de Bagaces","SECTOR_MUNICIPAL"]
["SECTOR_PUBLICO_NO_FINANCIERO","GOBIERNO_GENERAL","-","-","SECTOR_MUNICIPAL","15505","Municipalidad de Carrillo","15505 - Municipalidad de Carrillo","SECTOR_MUNICIPAL"]
["SECTOR_PUBLICO_NO_FINANCIERO","GOBIERNO_GENERAL","-","-","SECTOR_MUNICIPAL","15506","Municipalidad de Cañas","15506 - Municipalidad de Cañas","SECTOR_MUNICIPAL"]
["SECTOR_PUBLICO_NO_FINANCIERO","GOBIERNO_GENERAL","-","-","SECTOR_MUNICIPAL","15507","Municipalidad de Abangares","15507 - Municipalidad de Abangares","SECTOR_MUNICIPAL"]
["SECTOR_PUBLICO_NO_FINANCIERO","GOBIERNO_GENERAL","-","-","SECTOR_MUNICIPAL","15508","Municipalidad de Tilarán","15508 - Municipalidad de Tilarán","SECTOR_MUNICIPAL"]
["SECTOR_PUBLICO_NO_FINANCIERO","GOBIERNO_GENERAL","-","-","SECTOR_MUNICIPAL","15509","Municipalidad de Nandayure","15509 - Municipalidad de Nandayure","SECTOR_MUNICIPAL"]
["SECTOR_PUBLICO_NO_FINANCIERO","GOBIERNO_GENERAL","-","-","SECTOR_MUNICIPAL","15510","Municipalidad de La Cruz","15510 - Municipalidad de La Cruz","SECTOR_MUNICIPAL"]
["SECTOR_PUBLICO_NO_FINANCIERO","GOBIERNO_GENERAL","-","-","SECTOR_MUNICIPAL","15511","Municipalidad de Hojancha","15511 - Municipalidad de Hojancha","SECTOR_MUNICIPAL"]
["SECTOR_PUBLICO_NO_FINANCIERO","GOBIERNO_GENERAL","-","-","SECTOR_MUNICIPAL","15520","Concejo Municipal de Distrito de Colorado de Abangares","15520 - Concejo Municipal de Distrito de Colorado de Abangares","SECTOR_MUNICIPAL"]
["SECTOR_PUBLICO_NO_FINANCIERO","GOBIERNO_GENERAL","-","-","SECTOR_MUNICIPAL","15601","Municipalidad de Puntarenas","15601 - Municipalidad de Puntarenas","SECTOR_MUNICIPAL"]
["SECTOR_PUBLICO_NO_FINANCIERO","GOBIERNO_GENERAL","-","-","SECTOR_MUNICIPAL","15602","Municipalidad de Esparza","15602 - Municipalidad de Esparza","SECTOR_MUNICIPAL"]
["SECTOR_PUBLICO_NO_FINANCIERO","GOBIERNO_GENERAL","-","-","SECTOR_MUNICIPAL","15603","Municipalidad de Buenos Aires","15603 - Municipalidad de Buenos Aires","SECTOR_MUNICIPAL"]
["SECTOR_PUBLICO_NO_FINANCIERO","GOBIERNO_GENERAL","-","-","SECTOR_MUNICIPAL","15604","Municipalidad de Montes de Oro","15604 - Municipalidad de Montes de Oro","SECTOR_MUNICIPAL"]
["SECTOR_PUBLICO_NO_FINANCIERO","GOBIERNO_GENERAL","-","-","SECTOR_MUNICIPAL","15605","Municipalidad de Osa","15605 - Municipalidad de Osa","SECTOR_MUNICIPAL"]
["SECTOR_PUBLICO_NO_FINANCIERO","GOBIERNO_GENERAL","-","-","SECTOR_MUNICIPAL","15606","Municipalidad de Aguirre","15606 - Municipalidad de Aguirre","SECTOR_MUNICIPAL"]
["SECTOR_PUBLICO_NO_FINANCIERO","GOBIERNO_GENERAL","-","-","SECTOR_MUNICIPAL","15607","Municipalidad de Golfito","15607 - Municipalidad de Golfito","SECTOR_MUNICIPAL"]
["SECTOR_PUBLICO_NO_FINANCIERO","GOBIERNO_GENERAL","-","-","SECTOR_MUNICIPAL","15608","Municipalidad de Coto Brus","15608 - Municipalidad de Coto Brus","SECTOR_MUNICIPAL"]
["SECTOR_PUBLICO_NO_FINANCIERO","GOBIERNO_GENERAL","-","-","SECTOR_MUNICIPAL","15609","Municipalidad de Parrita","15609 - Municipalidad de Parrita","SECTOR_MUNICIPAL"]
["SECTOR_PUBLICO_NO_FINANCIERO","GOBIERNO_GENERAL","-","-","SECTOR_MUNICIPAL","15610","Municipalidad de Corredores","15610 - Municipalidad de Corredores","SECTOR_MUNICIPAL"]
["SECTOR_PUBLICO_NO_FINANCIERO","GOBIERNO_GENERAL","-","-","SECTOR_MUNICIPAL","15611","Municipalidad de Garabito","15611 - Municipalidad de Garabito","SECTOR_MUNICIPAL"]
["SECTOR_PUBLICO_NO_FINANCIERO","GOBIERNO_GENERAL","-","-","SECTOR_MUNICIPAL","15612","Municipalidad de Monteverde","15612 - Municipalidad de Monteverde","SECTOR_MUNICIPAL"]
["SECTOR_PUBLICO_NO_FINANCIERO","GOBIERNO_GENERAL","-","-","SECTOR_MUNICIPAL","15613","Municipalidad de Puerto Jimenez","15613 - Municipalidad de Puerto Jimenez","SECTOR_MUNICIPAL"]
["SECTOR_PUBLICO_NO_FINANCIERO","GOBIERNO_GENERAL","-","-","SECTOR_MUNICIPAL","15620","Concejo Municipal de Distrito de Cóbano Puntarenas","15620 - Concejo Municipal de Distrito de Cóbano Puntarenas","SECTOR_MUNICIPAL"]
["SECTOR_PUBLICO_NO_FINANCIERO","GOBIERNO_GENERAL","-","-","SECTOR_MUNICIPAL","15621","Concejo Municipal de Distrito de Monteverde de Puntarenas","15621 - Concejo Municipal de Distrito de Monteverde de Puntarenas","SECTOR_MUNICIPAL"]
["SECTOR_PUBLICO_NO_FINANCIERO","GOBIERNO_GENERAL","-","-","SECTOR_MUNICIPAL","15622","Concejo Municipal de Distrito de Lepanto de Puntarenas","15622 - Concejo Municipal de Distrito de Lepanto de Puntarenas","SECTOR_MUNICIPAL"]
["SECTOR_PUBLICO_NO_FINANCIERO","GOBIERNO_GENERAL","-","-","SECTOR_MUNICIPAL","15623","Concejo Municipal de Distrito de Paquera de Puntarenas","15623 - Concejo Municipal de Distrito de Paquera de Puntarenas","SECTOR_MUNICIPAL"]
["SECTOR_PUBLICO_NO_FINANCIERO","GOBIERNO_GENERAL","-","-","SECTOR_MUNICIPAL","15701","Municipalidad de Limón","15701 - Municipalidad de Limón","SECTOR_MUNICIPAL"]
["SECTOR_PUBLICO_NO_FINANCIERO","GOBIERNO_GENERAL","-","-","SECTOR_MUNICIPAL","15702","Municipalidad de Pococí","15702 - Municipalidad de Pococí","SECTOR_MUNICIPAL"]
["SECTOR_PUBLICO_NO_FINANCIERO","GOBIERNO_GENERAL","-","-","SECTOR_MUNICIPAL","15703","Municipalidad de Siquirres","15703 - Municipalidad de Siquirres","SECTOR_MUNICIPAL"]
["SECTOR_PUBLICO_NO_FINANCIERO","GOBIERNO_GENERAL","-","-","SECTOR_MUNICIPAL","15704","Municipalidad de Talamanca","15704 - Municipalidad de Talamanca","SECTOR_MUNICIPAL"]
["SECTOR_PUBLICO_NO_FINANCIERO","GOBIERNO_GENERAL","-","-","SECTOR_MUNICIPAL","15705","Municipalidad de Matina","15705 - Municipalidad de Matina","SECTOR_MUNICIPAL"]
["SECTOR_PUBLICO_NO_FINANCIERO","GOBIERNO_GENERAL","-","-","SECTOR_MUNICIPAL","15706","Municipalidad de Guácimo","15706 - Municipalidad de Guácimo","SECTOR_MUNICIPAL"]
["SECTOR_PUBLICO_NO_FINANCIERO","-","-","-","EMPRESAS_PUBLICAS","16101","Consejo Nacional de Producción (CNP)","16101 - Consejo Nacional de Producción (CNP)","EMPRESAS_PUBLICAS"]
["SECTOR_PUBLICO_NO_FINANCIERO","-","-","-","EMPRESAS_PUBLICAS","16120","Correos de Costa Rica S.A.","16120 - Correos de Costa Rica S.A.","EMPRESAS_PUBLICAS"]
["SECTOR_PUBLICO_NO_FINANCIERO","-","-","-","EMPRESAS_PUBLICAS","16150","Instituto Costarricense de Acueductos y Alcantarillados (ICAA)","16150 - Instituto Costarricense de Acueductos y Alcantarillados (ICAA)","EMPRESAS_PUBLICAS"]
["SECTOR_PUBLICO_NO_FINANCIERO","-","-","-","EMPRESAS_PUBLICAS","16151","Instituto Nacional de Electricidad (ICE) (Casa Matriz)","16151 - Instituto Nacional de Electricidad (ICE) (Casa Matriz)","EMPRESAS_PUBLICAS"]
["SECTOR_PUBLICO_NO_FINANCIERO","-","-","-","EMPRESAS_PUBLICAS","16152","Instituto Costarricense de Ferrocarriles (INCOFER)","16152 - Instituto Costarricense de Ferrocarriles (INCOFER)","EMPRESAS_PUBLICAS"]
["SECTOR_PUBLICO_NO_FINANCIERO","-","-","-","EMPRESAS_PUBLICAS","16153","Instituto Costarricense Puertos del Pacifico (INCOP)","16153 - Instituto Costarricense Puertos del Pacifico (INCOP)","EMPRESAS_PUBLICAS"]
["SECTOR_PUBLICO_NO_FINANCIERO","-","-","-","EMPRESAS_PUBLICAS","16170","Junta de Administración Portuaria y de Desarrollo de la Vertiente Atlántica (JAPDEVA)","16170 - Junta de Administración Portuaria y de Desarrollo de la Vertiente Atlántica (JAPDEVA)","EMPRESAS_PUBLICAS"]
["SECTOR_PUBLICO_NO_FINANCIERO","-","-","-","EMPRESAS_PUBLICAS","16171","Junta de Protección Social (JPS)","16171 - Junta de Protección Social (JPS)","EMPRESAS_PUBLICAS"]
["SECTOR_PUBLICO_NO_FINANCIERO","-","-","-","EMPRESAS_PUBLICAS","16181","Refinadora Costarricense de Petroleo S.A (RECOPE)","16181 - Refinadora Costarricense de Petroleo S.A (RECOPE)","EMPRESAS_PUBLICAS"]
["SECTOR_PUBLICO_NO_FINANCIERO","-","-","-","EMPRESAS_PUBLICAS","16190","Sistema Nacional de Radio y Television S.A (SINART SA)","16190 - Sistema Nacional de Radio y Television S.A (SINART SA)","EMPRESAS_PUBLICAS"]
["SECTOR_PUBLICO_NO_FINANCIERO","-","-","-","EMPRESAS_PUBLICAS","22191","Instituto Nacional de Seguros (INS) (Casa Matriz)","22191 - Instituto Nacional de Seguros (INS) (Casa Matriz)","EMPRESAS_PUBLICAS"]

{"sheet":"BASE_DATOS","index":47,"n_rows":189,"n_cols":6,"rows_kept":189,"cut":false,"hidden":true,"merged":[]}
["CODIGO","ENTIDAD","ELEMENTO","GRUPO","ASPECTO","DETALLE"]
[{"$f":"DATOS!$D$12","v":""},{"$f":"DATOS!$D$13","v":""},"APLICACIÓN_NICSP","NICSP_1","NICSP_1_APL",{"$f":"VLOOKUP(D2,NICSP!$A:$H,6,0)","v":0}]
[{"$f":"DATOS!$D$12","v":""},{"$f":"DATOS!$D$13","v":""},"APLICACIÓN_NICSP","NICSP_2","NICSP_2_APL",{"$f":"VLOOKUP(D3,NICSP!$A:$H,6,0)","v":0}]
[{"$f":"DATOS!$D$12","v":""},{"$f":"DATOS!$D$13","v":""},"APLICACIÓN_NICSP","NICSP_3","NICSP_3_APL",{"$f":"VLOOKUP(D4,NICSP!$A:$H,6,0)","v":0}]
[{"$f":"DATOS!$D$12","v":""},{"$f":"DATOS!$D$13","v":""},"APLICACIÓN_NICSP","NICSP_4","NICSP_4_APL",{"$f":"VLOOKUP(D5,NICSP!$A:$H,6,0)","v":0}]
[{"$f":"DATOS!$D$12","v":""},{"$f":"DATOS!$D$13","v":""},"APLICACIÓN_NICSP","NICSP_5","NICSP_5_APL",{"$f":"VLOOKUP(D6,NICSP!$A:$H,6,0)","v":0}]
[{"$f":"DATOS!$D$12","v":""},{"$f":"DATOS!$D$13","v":""},"APLICACIÓN_NICSP","NICSP_9","NICSP_9_APL",{"$f":"VLOOKUP(D7,NICSP!$A:$H,6,0)","v":0}]
[{"$f":"DATOS!$D$12","v":""},{"$f":"DATOS!$D$13","v":""},"APLICACIÓN_NICSP","NICSP_10","NICSP_10_APL",{"$f":"VLOOKUP(D8,NICSP!$A:$H,6,0)","v":0}]
[{"$f":"DATOS!$D$12","v":""},{"$f":"DATOS!$D$13","v":""},"APLICACIÓN_NICSP","NICSP_11","NICSP_11_APL",{"$f":"VLOOKUP(D9,NICSP!$A:$H,6,0)","v":0}]
[{"$f":"DATOS!$D$12","v":""},{"$f":"DATOS!$D$13","v":""},"APLICACIÓN_NICSP","NICSP_12","NICSP_12_APL",{"$f":"VLOOKUP(D10,NICSP!$A:$H,6,0)","v":0}]
[{"$f":"DATOS!$D$12","v":""},{"$f":"DATOS!$D$13","v":""},"APLICACIÓN_NICSP","NICSP_13","NICSP_13_APL",{"$f":"VLOOKUP(D11,NICSP!$A:$H,6,0)","v":0}]
[{"$f":"DATOS!$D$12","v":""},{"$f":"DATOS!$D$13","v":""},"APLICACIÓN_NICSP","NICSP_14","NICSP_14_APL",{"$f":"VLOOKUP(D12,NICSP!$A:$H,6,0)","v":0}]
[{"$f":"DATOS!$D$12","v":""},{"$f":"DATOS!$D$13","v":""},"APLICACIÓN_NICSP","NICSP_16","NICSP_16_APL",{"$f":"VLOOKUP(D13,NICSP!$A:$H,6,0)","v":0}]
[{"$f":"DATOS!$D$12","v":""},{"$f":"DATOS!$D$13","v":""},"APLICACIÓN_NICSP","NICSP_17","NICSP_17_APL",{"$f":"VLOOKUP(D14,NICSP!$A:$H,6,0)","v":0}]
[{"$f":"DATOS!$D$12","v":""},{"$f":"DATOS!$D$13","v":""},"APLICACIÓN_NICSP","NICSP_18","NICSP_18_APL",{"$f":"VLOOKUP(D15,NICSP!$A:$H,6,0)","v":0}]
[{"$f":"DATOS!$D$12","v":""},{"$f":"DATOS!$D$13","v":""},"APLICACIÓN_NICSP","NICSP_19","NICSP_19_APL",{"$f":"VLOOKUP(D16,NICSP!$A:$H,6,0)","v":0}]
[{"$f":"DATOS!$D$12","v":""},{"$f":"DATOS!$D$13","v":""},"APLICACIÓN_NICSP","NICSP_20","NICSP_20_APL",{"$f":"VLOOKUP(D17,NICSP!$A:$H,6,0)","v":0}]
[{"$f":"DATOS!$D$12","v":""},{"$f":"DATOS!$D$13","v":""},"APLICACIÓN_NICSP","NICSP_21","NICSP_21_APL",{"$f":"VLOOKUP(D18,NICSP!$A:$H,6,0)","v":0}]
[{"$f":"DATOS!$D$12","v":""},{"$f":"DATOS!$D$13","v":""},"APLICACIÓN_NICSP","NICSP_22","NICSP_22_APL",{"$f":"VLOOKUP(D19,NICSP!$A:$H,6,0)","v":0}]
[{"$f":"DATOS!$D$12","v":""},{"$f":"DATOS!$D$13","v":""},"APLICACIÓN_NICSP","NICSP_23","NICSP_23_APL",{"$f":"VLOOKUP(D20,NICSP!$A:$H,6,0)","v":0}]
[{"$f":"DATOS!$D$12","v":""},{"$f":"DATOS!$D$13","v":""},"APLICACIÓN_NICSP","NICSP_24","NICSP_24_APL",{"$f":"VLOOKUP(D21,NICSP!$A:$H,6,0)","v":0}]
[{"$f":"DATOS!$D$12","v":""},{"$f":"DATOS!$D$13","v":""},"APLICACIÓN_NICSP","NICSP_26","NICSP_26_APL",{"$f":"VLOOKUP(D22,NICSP!$A:$H,6,0)","v":0}]
[{"$f":"DATOS!$D$12","v":""},{"$f":"DATOS!$D$13","v":""},"APLICACIÓN_NICSP","NICSP_27","NICSP_27_APL",{"$f":"VLOOKUP(D23,NICSP!$A:$H,6,0)","v":0}]
[{"$f":"DATOS!$D$12","v":""},{"$f":"DATOS!$D$13","v":""},"APLICACIÓN_NICSP","NICSP_28","NICSP_28_APL",{"$f":"VLOOKUP(D24,NICSP!$A:$H,6,0)","v":0}]
[{"$f":"DATOS!$D$12","v":""},{"$f":"DATOS!$D$13","v":""},"APLICACIÓN_NICSP","NICSP_29","NICSP_29_APL",{"$f":"VLOOKUP(D25,NICSP!$A:$H,6,0)","v":0}]
[{"$f":"DATOS!$D$12","v":""},{"$f":"DATOS!$D$13","v":""},"APLICACIÓN_NICSP","NICSP_30","NICSP_30_APL",{"$f":"VLOOKUP(D26,NICSP!$A:$H,6,0)","v":0}]
[{"$f":"DATOS!$D$12","v":""},{"$f":"DATOS!$D$13","v":""},"APLICACIÓN_NICSP","NICSP_31","NICSP_31_APL",{"$f":"VLOOKUP(D27,NICSP!$A:$H,6,0)","v":0}]
[{"$f":"DATOS!$D$12","v":""},{"$f":"DATOS!$D$13","v":""},"APLICACIÓN_NICSP","NICSP_32","NICSP_32_APL",{"$f":"VLOOKUP(D28,NICSP!$A:$H,6,0)","v":0}]
[{"$f":"DATOS!$D$12","v":""},{"$f":"DATOS!$D$13","v":""},"APLICACIÓN_NICSP","NICSP_33","NICSP_33_APL",{"$f":"VLOOKUP(D29,NICSP!$A:$H,6,0)","v":0}]
[{"$f":"DATOS!$D$12","v":""},{"$f":"DATOS!$D$13","v":""},"APLICACIÓN_NICSP","NICSP_34","NICSP_34_APL",{"$f":"VLOOKUP(D30,NICSP!$A:$H,6,0)","v":0}]
[{"$f":"DATOS!$D$12","v":""},{"$f":"DATOS!$D$13","v":""},"APLICACIÓN_NICSP","NICSP_35","NICSP_35_APL",{"$f":"VLOOKUP(D31,NICSP!$A:$H,6,0)","v":0}]
[{"$f":"DATOS!$D$12","v":""},{"$f":"DATOS!$D$13","v":""},"APLICACIÓN_NICSP","NICSP_36","NICSP_36_APL",{"$f":"VLOOKUP(D32,NICSP!$A:$H,6,0)","v":0}]
[{"$f":"DATOS!$D$12","v":""},{"$f":"DATOS!$D$13","v":""},"APLICACIÓN_NICSP","NICSP_37","NICSP_37_APL",{"$f":"VLOOKUP(D33,NICSP!$A:$H,6,0)","v":0}]
[{"$f":"DATOS!$D$12","v":""},{"$f":"DATOS!$D$13","v":""},"APLICACIÓN_NICSP","NICSP_38","NICSP_38_APL",{"$f":"VLOOKUP(D34,NICSP!$A:$H,6,0)","v":0}]
[{"$f":"DATOS!$D$12","v":""},{"$f":"DATOS!$D$13","v":""},"APLICACIÓN_NICSP","NICSP_39","NICSP_39_APL",{"$f":"VLOOKUP(D35,NICSP!$A:$H,6,0)","v":0}]
[{"$f":"DATOS!$D$12","v":""},{"$f":"DATOS!$D$13","v":""},"APLICACIÓN_NICSP","NICSP_40","NICSP_40_APL",{"$f":"VLOOKUP(D36,NICSP!$A:$H,6,0)","v":0}]
[{"$f":"DATOS!$D$12","v":""},{"$f":"DATOS!$D$13","v":""},"GRADO_AVANCE","NICSP_1","NICSP_1_GRA",{"$f":"VLOOKUP(D37,NICSP!$A:$H,7,0)","v":0}]
[{"$f":"DATOS!$D$12","v":""},{"$f":"DATOS!$D$13","v":""},"GRADO_AVANCE","NICSP_2","NICSP_2_GRA",{"$f":"VLOOKUP(D38,NICSP!$A:$H,7,0)","v":0}]
[{"$f":"DATOS!$D$12","v":""},{"$f":"DATOS!$D$13","v":""},"GRADO_AVANCE","NICSP_3","NICSP_3_GRA",{"$f":"VLOOKUP(D39,NICSP!$A:$H,7,0)","v":0}]
[{"$f":"DATOS!$D$12","v":""},{"$f":"DATOS!$D$13","v":""},"GRADO_AVANCE","NICSP_4","NICSP_4_GRA",{"$f":"VLOOKUP(D40,NICSP!$A:$H,7,0)","v":0}]
[{"$f":"DATOS!$D$12","v":""},{"$f":"DATOS!$D$13","v":""},"GRADO_AVANCE","NICSP_5","NICSP_5_GRA",{"$f":"VLOOKUP(D41,NICSP!$A:$H,7,0)","v":0}]
[{"$f":"DATOS!$D$12","v":""},{"$f":"DATOS!$D$13","v":""},"GRADO_AVANCE","NICSP_9","NICSP_9_GRA",{"$f":"VLOOKUP(D42,NICSP!$A:$H,7,0)","v":0}]
[{"$f":"DATOS!$D$12","v":""},{"$f":"DATOS!$D$13","v":""},"GRADO_AVANCE","NICSP_10","NICSP_10_GRA",{"$f":"VLOOKUP(D43,NICSP!$A:$H,7,0)","v":0}]
[{"$f":"DATOS!$D$12","v":""},{"$f":"DATOS!$D$13","v":""},"GRADO_AVANCE","NICSP_11","NICSP_11_GRA",{"$f":"VLOOKUP(D44,NICSP!$A:$H,7,0)","v":0}]
[{"$f":"DATOS!$D$12","v":""},{"$f":"DATOS!$D$13","v":""},"GRADO_AVANCE","NICSP_12","NICSP_12_GRA",{"$f":"VLOOKUP(D45,NICSP!$A:$H,7,0)","v":0}]
[{"$f":"DATOS!$D$12","v":""},{"$f":"DATOS!$D$13","v":""},"GRADO_AVANCE","NICSP_13","NICSP_13_GRA",{"$f":"VLOOKUP(D46,NICSP!$A:$H,7,0)","v":0}]
[{"$f":"DATOS!$D$12","v":""},{"$f":"DATOS!$D$13","v":""},"GRADO_AVANCE","NICSP_14","NICSP_14_GRA",{"$f":"VLOOKUP(D47,NICSP!$A:$H,7,0)","v":0}]
[{"$f":"DATOS!$D$12","v":""},{"$f":"DATOS!$D$13","v":""},"GRADO_AVANCE","NICSP_16","NICSP_16_GRA",{"$f":"VLOOKUP(D48,NICSP!$A:$H,7,0)","v":0}]
[{"$f":"DATOS!$D$12","v":""},{"$f":"DATOS!$D$13","v":""},"GRADO_AVANCE","NICSP_17","NICSP_17_GRA",{"$f":"VLOOKUP(D49,NICSP!$A:$H,7,0)","v":0}]
[{"$f":"DATOS!$D$12","v":""},{"$f":"DATOS!$D$13","v":""},"GRADO_AVANCE","NICSP_18","NICSP_18_GRA",{"$f":"VLOOKUP(D50,NICSP!$A:$H,7,0)","v":0}]
[{"$f":"DATOS!$D$12","v":""},{"$f":"DATOS!$D$13","v":""},"GRADO_AVANCE","NICSP_19","NICSP_19_GRA",{"$f":"VLOOKUP(D51,NICSP!$A:$H,7,0)","v":0}]
[{"$f":"DATOS!$D$12","v":""},{"$f":"DATOS!$D$13","v":""},"GRADO_AVANCE","NICSP_20","NICSP_20_GRA",{"$f":"VLOOKUP(D52,NICSP!$A:$H,7,0)","v":0}]
[{"$f":"DATOS!$D$12","v":""},{"$f":"DATOS!$D$13","v":""},"GRADO_AVANCE","NICSP_21","NICSP_21_GRA",{"$f":"VLOOKUP(D53,NICSP!$A:$H,7,0)","v":0}]
[{"$f":"DATOS!$D$12","v":""},{"$f":"DATOS!$D$13","v":""},"GRADO_AVANCE","NICSP_22","NICSP_22_GRA",{"$f":"VLOOKUP(D54,NICSP!$A:$H,7,0)","v":0}]
[{"$f":"DATOS!$D$12","v":""},{"$f":"DATOS!$D$13","v":""},"GRADO_AVANCE","NICSP_23","NICSP_23_GRA",{"$f":"VLOOKUP(D55,NICSP!$A:$H,7,0)","v":0}]
[{"$f":"DATOS!$D$12","v":""},{"$f":"DATOS!$D$13","v":""},"GRADO_AVANCE","NICSP_24","NICSP_24_GRA",{"$f":"VLOOKUP(D56,NICSP!$A:$H,7,0)","v":0}]
[{"$f":"DATOS!$D$12","v":""},{"$f":"DATOS!$D$13","v":""},"GRADO_AVANCE","NICSP_26","NICSP_26_GRA",{"$f":"VLOOKUP(D57,NICSP!$A:$H,7,0)","v":0}]
[{"$f":"DATOS!$D$12","v":""},{"$f":"DATOS!$D$13","v":""},"GRADO_AVANCE","NICSP_27","NICSP_27_GRA",{"$f":"VLOOKUP(D58,NICSP!$A:$H,7,0)","v":0}]
[{"$f":"DATOS!$D$12","v":""},{"$f":"DATOS!$D$13","v":""},"GRADO_AVANCE","NICSP_28","NICSP_28_GRA",{"$f":"VLOOKUP(D59,NICSP!$A:$H,7,0)","v":0}]
[{"$f":"DATOS!$D$12","v":""},{"$f":"DATOS!$D$13","v":""},"GRADO_AVANCE","NICSP_29","NICSP_29_GRA",{"$f":"VLOOKUP(D60,NICSP!$A:$H,7,0)","v":0}]
[{"$f":"DATOS!$D$12","v":""},{"$f":"DATOS!$D$13","v":""},"GRADO_AVANCE","NICSP_30","NICSP_30_GRA",{"$f":"VLOOKUP(D61,NICSP!$A:$H,7,0)","v":0}]
[{"$f":"DATOS!$D$12","v":""},{"$f":"DATOS!$D$13","v":""},"GRADO_AVANCE","NICSP_31","NICSP_31_GRA",{"$f":"VLOOKUP(D62,NICSP!$A:$H,7,0)","v":0}]
[{"$f":"DATOS!$D$12","v":""},{"$f":"DATOS!$D$13","v":""},"GRADO_AVANCE","NICSP_32","NICSP_32_GRA",{"$f":"VLOOKUP(D63,NICSP!$A:$H,7,0)","v":0}]
[{"$f":"DATOS!$D$12","v":""},{"$f":"DATOS!$D$13","v":""},"GRADO_AVANCE","NICSP_33","NICSP_33_GRA",{"$f":"VLOOKUP(D64,NICSP!$A:$H,7,0)","v":0}]
[{"$f":"DATOS!$D$12","v":""},{"$f":"DATOS!$D$13","v":""},"GRADO_AVANCE","NICSP_34","NICSP_34_GRA",{"$f":"VLOOKUP(D65,NICSP!$A:$H,7,0)","v":0}]
[{"$f":"DATOS!$D$12","v":""},{"$f":"DATOS!$D$13","v":""},"GRADO_AVANCE","NICSP_35","NICSP_35_GRA",{"$f":"VLOOKUP(D66,NICSP!$A:$H,7,0)","v":0}]
[{"$f":"DATOS!$D$12","v":""},{"$f":"DATOS!$D$13","v":""},"GRADO_AVANCE","NICSP_36","NICSP_36_GRA",{"$f":"VLOOKUP(D67,NICSP!$A:$H,7,0)","v":0}]
[{"$f":"DATOS!$D$12","v":""},{"$f":"DATOS!$D$13","v":""},"GRADO_AVANCE","NICSP_37","NICSP_37_GRA",{"$f":"VLOOKUP(D68,NICSP!$A:$H,7,0)","v":0}]
[{"$f":"DATOS!$D$12","v":""},{"$f":"DATOS!$D$13","v":""},"GRADO_AVANCE","NICSP_38","NICSP_38_GRA",{"$f":"VLOOKUP(D69,NICSP!$A:$H,7,0)","v":0}]
[{"$f":"DATOS!$D$12","v":""},{"$f":"DATOS!$D$13","v":""},"GRADO_AVANCE","NICSP_39","NICSP_39_GRA",{"$f":"VLOOKUP(D70,NICSP!$A:$H,7,0)","v":0}]
[{"$f":"DATOS!$D$12","v":""},{"$f":"DATOS!$D$13","v":""},"GRADO_AVANCE","NICSP_40","NICSP_40_GRA",{"$f":"VLOOKUP(D71,NICSP!$A:$H,7,0)","v":0}]
[{"$f":"DATOS!$D$12","v":""},{"$f":"DATOS!$D$13","v":""},"TRANSITORIOS","NICSP_1","NICSP_1_TRAN",{"$f":"VLOOKUP(D72,NICSP!$A:$H,8,0)","v":0}]
[{"$f":"DATOS!$D$12","v":""},{"$f":"DATOS!$D$13","v":""},"TRANSITORIOS","NICSP_2","NICSP_2_TRAN",{"$f":"VLOOKUP(D73,NICSP!$A:$H,8,0)","v":0}]
[{"$f":"DATOS!$D$12","v":""},{"$f":"DATOS!$D$13","v":""},"TRANSITORIOS","NICSP_3","NICSP_3_TRAN",{"$f":"VLOOKUP(D74,NICSP!$A:$H,8,0)","v":0}]
[{"$f":"DATOS!$D$12","v":""},{"$f":"DATOS!$D$13","v":""},"TRANSITORIOS","NICSP_4","NICSP_4_TRAN",{"$f":"VLOOKUP(D75,NICSP!$A:$H,8,0)","v":0}]
[{"$f":"DATOS!$D$12","v":""},{"$f":"DATOS!$D$13","v":""},"TRANSITORIOS","NICSP_5","NICSP_5_TRAN",{"$f":"VLOOKUP(D76,NICSP!$A:$H,8,0)","v":0}]
[{"$f":"DATOS!$D$12","v":""},{"$f":"DATOS!$D$13","v":""},"TRANSITORIOS","NICSP_9","NICSP_9_TRAN",{"$f":"VLOOKUP(D77,NICSP!$A:$H,8,0)","v":0}]
[{"$f":"DATOS!$D$12","v":""},{"$f":"DATOS!$D$13","v":""},"TRANSITORIOS","NICSP_10","NICSP_10_TRAN",{"$f":"VLOOKUP(D78,NICSP!$A:$H,8,0)","v":0}]
[{"$f":"DATOS!$D$12","v":""},{"$f":"DATOS!$D$13","v":""},"TRANSITORIOS","NICSP_11","NICSP_11_TRAN",{"$f":"VLOOKUP(D79,NICSP!$A:$H,8,0)","v":0}]
[{"$f":"DATOS!$D$12","v":""},{"$f":"DATOS!$D$13","v":""},"TRANSITORIOS","NICSP_12","NICSP_12_TRAN",{"$f":"VLOOKUP(D80,NICSP!$A:$H,8,0)","v":0}]
[{"$f":"DATOS!$D$12","v":""},{"$f":"DATOS!$D$13","v":""},"TRANSITORIOS","NICSP_13","NICSP_13_TRAN",{"$f":"VLOOKUP(D81,NICSP!$A:$H,8,0)","v":0}]
[{"$f":"DATOS!$D$12","v":""},{"$f":"DATOS!$D$13","v":""},"TRANSITORIOS","NICSP_14","NICSP_14_TRAN",{"$f":"VLOOKUP(D82,NICSP!$A:$H,8,0)","v":0}]
[{"$f":"DATOS!$D$12","v":""},{"$f":"DATOS!$D$13","v":""},"TRANSITORIOS","NICSP_16","NICSP_16_TRAN",{"$f":"VLOOKUP(D83,NICSP!$A:$H,8,0)","v":0}]
[{"$f":"DATOS!$D$12","v":""},{"$f":"DATOS!$D$13","v":""},"TRANSITORIOS","NICSP_17","NICSP_17_TRAN",{"$f":"VLOOKUP(D84,NICSP!$A:$H,8,0)","v":0}]
[{"$f":"DATOS!$D$12","v":""},{"$f":"DATOS!$D$13","v":""},"TRANSITORIOS","NICSP_18","NICSP_18_TRAN",{"$f":"VLOOKUP(D85,NICSP!$A:$H,8,0)","v":0}]
[{"$f":"DATOS!$D$12","v":""},{"$f":"DATOS!$D$13","v":""},"TRANSITORIOS","NICSP_19","NICSP_19_TRAN",{"$f":"VLOOKUP(D86,NICSP!$A:$H,8,0)","v":0}]
[{"$f":"DATOS!$D$12","v":""},{"$f":"DATOS!$D$13","v":""},"TRANSITORIOS","NICSP_20","NICSP_20_TRAN",{"$f":"VLOOKUP(D87,NICSP!$A:$H,8,0)","v":0}]
[{"$f":"DATOS!$D$12","v":""},{"$f":"DATOS!$D$13","v":""},"TRANSITORIOS","NICSP_21","NICSP_21_TRAN",{"$f":"VLOOKUP(D88,NICSP!$A:$H,8,0)","v":0}]
[{"$f":"DATOS!$D$12","v":""},{"$f":"DATOS!$D$13","v":""},"TRANSITORIOS","NICSP_22","NICSP_22_TRAN",{"$f":"VLOOKUP(D89,NICSP!$A:$H,8,0)","v":0}]
[{"$f":"DATOS!$D$12","v":""},{"$f":"DATOS!$D$13","v":""},"TRANSITORIOS","NICSP_23","NICSP_23_TRAN",{"$f":"VLOOKUP(D90,NICSP!$A:$H,8,0)","v":0}]
[{"$f":"DATOS!$D$12","v":""},{"$f":"DATOS!$D$13","v":""},"TRANSITORIOS","NICSP_24","NICSP_24_TRAN",{"$f":"VLOOKUP(D91,NICSP!$A:$H,8,0)","v":0}]
[{"$f":"DATOS!$D$12","v":""},{"$f":"DATOS!$D$13","v":""},"TRANSITORIOS","NICSP_26","NICSP_26_TRAN",{"$f":"VLOOKUP(D92,NICSP!$A:$H,8,0)","v":0}]
[{"$f":"DATOS!$D$12","v":""},{"$f":"DATOS!$D$13","v":""},"TRANSITORIOS","NICSP_27","NICSP_27_TRAN",{"$f":"VLOOKUP(D93,NICSP!$A:$H,8,0)","v":0}]
[{"$f":"DATOS!$D$12","v":""},{"$f":"DATOS!$D$13","v":""},"TRANSITORIOS","NICSP_28","NICSP_28_TRAN",{"$f":"VLOOKUP(D94,NICSP!$A:$H,8,0)","v":0}]
[{"$f":"DATOS!$D$12","v":""},{"$f":"DATOS!$D$13","v":""},"TRANSITORIOS","NICSP_29","NICSP_29_TRAN",{"$f":"VLOOKUP(D95,NICSP!$A:$H,8,0)","v":0}]
[{"$f":"DATOS!$D$12","v":""},{"$f":"DATOS!$D$13","v":""},"TRANSITORIOS","NICSP_30","NICSP_30_TRAN",{"$f":"VLOOKUP(D96,NICSP!$A:$H,8,0)","v":0}]
[{"$f":"DATOS!$D$12","v":""},{"$f":"DATOS!$D$13","v":""},"TRANSITORIOS","NICSP_31","NICSP_31_TRAN",{"$f":"VLOOKUP(D97,NICSP!$A:$H,8,0)","v":0}]
[{"$f":"DATOS!$D$12","v":""},{"$f":"DATOS!$D$13","v":""},"TRANSITORIOS","NICSP_32","NICSP_32_TRAN",{"$f":"VLOOKUP(D98,NICSP!$A:$H,8,0)","v":0}]
[{"$f":"DATOS!$D$12","v":""},{"$f":"DATOS!$D$13","v":""},"TRANSITORIOS","NICSP_33","NICSP_33_TRAN",{"$f":"VLOOKUP(D99,NICSP!$A:$H,8,0)","v":0}]
[{"$f":"DATOS!$D$12","v":""},{"$f":"DATOS!$D$13","v":""},"TRANSITORIOS","NICSP_34","NICSP_34_TRAN",{"$f":"VLOOKUP(D100,NICSP!$A:$H,8,0)","v":0}]
[{"$f":"DATOS!$D$12","v":""},{"$f":"DATOS!$D$13","v":""},"TRANSITORIOS","NICSP_35","NICSP_35_TRAN",{"$f":"VLOOKUP(D101,NICSP!$A:$H,8,0)","v":0}]
[{"$f":"DATOS!$D$12","v":""},{"$f":"DATOS!$D$13","v":""},"TRANSITORIOS","NICSP_36","NICSP_36_TRAN",{"$f":"VLOOKUP(D102,NICSP!$A:$H,8,0)","v":0}]
[{"$f":"DATOS!$D$12","v":""},{"$f":"DATOS!$D$13","v":""},"TRANSITORIOS","NICSP_37","NICSP_37_TRAN",{"$f":"VLOOKUP(D103,NICSP!$A:$H,8,0)","v":0}]
[{"$f":"DATOS!$D$12","v":""},{"$f":"DATOS!$D$13","v":""},"TRANSITORIOS","NICSP_38","NICSP_38_TRAN",{"$f":"VLOOKUP(D104,NICSP!$A:$H,8,0)","v":0}]
[{"$f":"DATOS!$D$12","v":""},{"$f":"DATOS!$D$13","v":""},"TRANSITORIOS","NICSP_39","NICSP_39_TRAN",{"$f":"VLOOKUP(D105,NICSP!$A:$H,8,0)","v":0}]
[{"$f":"DATOS!$D$12","v":""},{"$f":"DATOS!$D$13","v":""},"TRANSITORIOS","NICSP_40","NICSP_40_TRAN",{"$f":"VLOOKUP(D106,NICSP!$A:$H,8,0)","v":0}]
[{"$f":"DATOS!$D$12","v":""},{"$f":"DATOS!$D$13","v":""},"ARRENDAMIENTOS","CANTIDAD","NICSP_13_ARR_OPE",{"$f":"VLOOKUP(E107,NICSP_13!$B:$E,3,0)","v":0}]
[{"$f":"DATOS!$D$12","v":""},{"$f":"DATOS!$D$13","v":""},"ARRENDAMIENTOS","MONTO","NICSP_13_ARR_OPE",{"$f":"VLOOKUP(E108,NICSP_13!$B:$E,4,0)","v":0}]
[{"$f":"DATOS!$D$12","v":""},{"$f":"DATOS!$D$13","v":""},"ARRENDAMIENTOS","CANTIDAD","NICSP_13_ARR_FIN",{"$f":"VLOOKUP(E109,NICSP_13!$B:$E,3,0)","v":0}]
[{"$f":"DATOS!$D$12","v":""},{"$f":"DATOS!$D$13","v":""},"ARRENDAMIENTOS","MONTO","NICSP_13_ARR_FIN",{"$f":"VLOOKUP(E110,NICSP_13!$B:$E,4,0)","v":0}]
[{"$f":"DATOS!$D$12","v":""},{"$f":"DATOS!$D$13","v":""},"PROPIEDADES_INVERSION","CANTIDAD","NICSP_16_PROP_INV",{"$f":"VLOOKUP(E111,NICSP_16!$B:$E,3,0)","v":0}]
[{"$f":"DATOS!$D$12","v":""},{"$f":"DATOS!$D$13","v":""},"PROPIEDADES_INVERSION","MONTO","NICSP_16_PROP_INV",{"$f":"VLOOKUP(E112,NICSP_16!$B:$E,4,0)","v":0}]
[{"$f":"DATOS!$D$12","v":""},{"$f":"DATOS!$D$13","v":""},"PROPIEDAD_PLANTA_EQUIPO","CANTIDAD","NICSP_17_C",{"$f":"VLOOKUP(E113,NICSP_17!$B:$D,3,0)","v":0}]
[{"$f":"DATOS!$D$12","v":""},{"$f":"DATOS!$D$13","v":""},"PROPIEDAD_PLANTA_EQUIPO","MONTO","NICSP_17_VI",{"$f":"VLOOKUP(E114,NICSP_17!$B:$D,3,0)","v":0}]
[{"$f":"DATOS!$D$12","v":""},{"$f":"DATOS!$D$13","v":""},"PROPIEDAD_PLANTA_EQUIPO","MONTO","NICSP_17_ALT",{"$f":"VLOOKUP(E115,NICSP_17!$B:$D,3,0)","v":0}]
[{"$f":"DATOS!$D$12","v":""},{"$f":"DATOS!$D$13","v":""},"PROPIEDAD_PLANTA_EQUIPO","MONTO","NICSP_17_BAJ",{"$f":"VLOOKUP(E116,NICSP_17!$B:$D,3,0)","v":0}]
[{"$f":"DATOS!$D$12","v":""},{"$f":"DATOS!$D$13","v":""},"PROPIEDAD_PLANTA_EQUIPO","MONTO","NICSP_17_DEPR",{"$f":"VLOOKUP(E117,NICSP_17!$B:$D,3,0)","v":0}]
[{"$f":"DATOS!$D$12","v":""},{"$f":"DATOS!$D$13","v":""},"PROPIEDAD_PLANTA_EQUIPO","MONTO","NICSP_17_DET",{"$f":"VLOOKUP(E118,NICSP_17!$B:$D,3,0)","v":0}]
[{"$f":"DATOS!$D$12","v":""},{"$f":"DATOS!$D$13","v":""},"PROPIEDAD_PLANTA_EQUIPO","MONTO","NICSP_17_AJ_DET",{"$f":"VLOOKUP(E119,NICSP_17!$B:$D,3,0)","v":0}]
[{"$f":"DATOS!$D$12","v":""},{"$f":"DATOS!$D$13","v":""},"PROPIEDAD_PLANTA_EQUIPO","MONTO","NICSP_17_AJ_TC",{"$f":"VLOOKUP(E120,NICSP_17!$B:$D,3,0)","v":0}]
[{"$f":"DATOS!$D$12","v":""},{"$f":"DATOS!$D$13","v":""},"PROPIEDAD_PLANTA_EQUIPO","MONTO","NICSP_17_VC",{"$f":"VLOOKUP(E121,NICSP_17!$B:$D,3,0)","v":0}]
[{"$f":"DATOS!$D$12","v":""},{"$f":"DATOS!$D$13","v":""},"ACTIVOS_CONTINGENTES","MONTO","NICSP_19_A_PI",{"$f":"VLOOKUP(E122,NICSP_19_ACTIVO!$B:$J,6,0)","v":0}]
[{"$f":"DATOS!$D$12","v":""},{"$f":"DATOS!$D$13","v":""},"ACTIVOS_CONTINGENTES","MONTO","NICSP_19_A_P1",{"$f":"VLOOKUP(E123,NICSP_19_ACTIVO!$B:$J,6,0)","v":0}]
[{"$f":"DATOS!$D$12","v":""},{"$f":"DATOS!$D$13","v":""},"ACTIVOS_CONTINGENTES","MONTO","NICSP_19_A_P2",{"$f":"VLOOKUP(E124,NICSP_19_ACTIVO!$B:$J,6,0)","v":0}]
[{"$f":"DATOS!$D$12","v":""},{"$f":"DATOS!$D$13","v":""},"ACTIVOS_CONTINGENTES","MONTO","NICSP_19_A_RF",{"$f":"VLOOKUP(E125,NICSP_19_ACTIVO!$B:$J,6,0)","v":0}]
[{"$f":"DATOS!$D$12","v":""},{"$f":"DATOS!$D$13","v":""},"ACTIVOS_CONTINGENTES","MONTO","NICSP_19_A_TOTAL",{"$f":"VLOOKUP(E126,NICSP_19_ACTIVO!$B:$J,6,0)","v":0}]
[{"$f":"DATOS!$D$12","v":""},{"$f":"DATOS!$D$13","v":""},"ACTIVOS_CONTINGENTES","CANTIDAD","NICSP_19_A_PI",{"$f":"VLOOKUP(E127,NICSP_19_ACTIVO!$B:$J,9,0)","v":0}]
[{"$f":"DATOS!$D$12","v":""},{"$f":"DATOS!$D$13","v":""},"ACTIVOS_CONTINGENTES","CANTIDAD","NICSP_19_A_P1",{"$f":"VLOOKUP(E128,NICSP_19_ACTIVO!$B:$J,9,0)","v":0}]
[{"$f":"DATOS!$D$12","v":""},{"$f":"DATOS!$D$13","v":""},"ACTIVOS_CONTINGENTES","CANTIDAD","NICSP_19_A_P2",{"$f":"VLOOKUP(E129,NICSP_19_ACTIVO!$B:$J,9,0)","v":0}]
[{"$f":"DATOS!$D$12","v":""},{"$f":"DATOS!$D$13","v":""},"ACTIVOS_CONTINGENTES","CANTIDAD","NICSP_19_A_RF",{"$f":"VLOOKUP(E130,NICSP_19_ACTIVO!$B:$J,9,0)","v":0}]
[{"$f":"DATOS!$D$12","v":""},{"$f":"DATOS!$D$13","v":""},"ACTIVOS_CONTINGENTES","CANTIDAD","NICSP_19_A_TOTAL",{"$f":"VLOOKUP(E131,NICSP_19_ACTIVO!$B:$J,9,0)","v":0}]
[{"$f":"DATOS!$D$12","v":""},{"$f":"DATOS!$D$13","v":""},"PASIVOS_CONTINGENTES","MONTO","NICSP_19_P_PI",{"$f":"VLOOKUP(E132,NICSP_19_PASIVO!$B:$J,6,0)","v":0}]
[{"$f":"DATOS!$D$12","v":""},{"$f":"DATOS!$D$13","v":""},"PASIVOS_CONTINGENTES","MONTO","NICSP_19_P_P1",{"$f":"VLOOKUP(E133,NICSP_19_PASIVO!$B:$J,6,0)","v":0}]
[{"$f":"DATOS!$D$12","v":""},{"$f":"DATOS!$D$13","v":""},"PASIVOS_CONTINGENTES","MONTO","NICSP_19_P_P2",{"$f":"VLOOKUP(E134,NICSP_19_PASIVO!$B:$J,6,0)","v":0}]
[{"$f":"DATOS!$D$12","v":""},{"$f":"DATOS!$D$13","v":""},"PASIVOS_CONTINGENTES","MONTO","NICSP_19_P_RF",{"$f":"VLOOKUP(E135,NICSP_19_PASIVO!$B:$J,6,0)","v":0}]
[{"$f":"DATOS!$D$12","v":""},{"$f":"DATOS!$D$13","v":""},"PASIVOS_CONTINGENTES","MONTO","NICSP_19_P_TOTAL",{"$f":"VLOOKUP(E136,NICSP_19_PASIVO!$B:$J,6,0)","v":0}]
[{"$f":"DATOS!$D$12","v":""},{"$f":"DATOS!$D$13","v":""},"PASIVOS_CONTINGENTES","CANTIDAD","NICSP_19_P_PI",{"$f":"VLOOKUP(E137,NICSP_19_PASIVO!$B:$J,9,0)","v":0}]
[{"$f":"DATOS!$D$12","v":""},{"$f":"DATOS!$D$13","v":""},"PASIVOS_CONTINGENTES","CANTIDAD","NICSP_19_P_P1",{"$f":"VLOOKUP(E138,NICSP_19_PASIVO!$B:$J,9,0)","v":0}]
[{"$f":"DATOS!$D$12","v":""},{"$f":"DATOS!$D$13","v":""},"PASIVOS_CONTINGENTES","CANTIDAD","NICSP_19_P_P2",{"$f":"VLOOKUP(E139,NICSP_19_PASIVO!$B:$J,9,0)","v":0}]
[{"$f":"DATOS!$D$12","v":""},{"$f":"DATOS!$D$13","v":""},"PASIVOS_CONTINGENTES","CANTIDAD","NICSP_19_P_RF",{"$f":"VLOOKUP(E140,NICSP_19_PASIVO!$B:$J,9,0)","v":0}]
[{"$f":"DATOS!$D$12","v":""},{"$f":"DATOS!$D$13","v":""},"PASIVOS_CONTINGENTES","CANTIDAD","NICSP_19_P_TOTAL",{"$f":"VLOOKUP(E141,NICSP_19_PASIVO!$B:$J,9,0)","v":0}]
[{"$f":"DATOS!$D$12","v":""},{"$f":"DATOS!$D$13","v":""},"AGRICULTURA","ACTIVOS_BIOLOGICOS","NICSP_27_CAN",{"$f":"VLOOKUP(E142,NICSP_27!$B:$I,6,0)","v":0}]
[{"$f":"DATOS!$D$12","v":""},{"$f":"DATOS!$D$13","v":""},"AGRICULTURA","ACTIVOS_BIOLOGICOS","NICSP_27_MON",{"$f":"VLOOKUP(E143,NICSP_27!$B:$I,6,0)","v":0}]
[{"$f":"DATOS!$D$12","v":""},{"$f":"DATOS!$D$13","v":""},"AGRICULTURA","PRODUCTO_AGRICOLA","NICSP_27_CAN",{"$f":"VLOOKUP(E144,NICSP_27!$B:$I,7,0)","v":0}]
[{"$f":"DATOS!$D$12","v":""},{"$f":"DATOS!$D$13","v":""},"AGRICULTURA","PRODUCTO_AGRICOLA","NICSP_27_MON",{"$f":"VLOOKUP(E145,NICSP_27!$B:$I,7,0)","v":0}]
[{"$f":"DATOS!$D$12","v":""},{"$f":"DATOS!$D$13","v":""},"AGRICULTURA","PRODUCTOS_RESULTANTE","NICSP_27_CAN",{"$f":"VLOOKUP(E146,NICSP_27!$B:$I,8,0)","v":0}]
[{"$f":"DATOS!$D$12","v":""},{"$f":"DATOS!$D$13","v":""},"AGRICULTURA","PRODUCTOS_RESULTANTE","NICSP_27_MON",{"$f":"VLOOKUP(E147,NICSP_27!$B:$I,8,0)","v":0}]
[{"$f":"DATOS!$D$12","v":""},{"$f":"DATOS!$D$13","v":""},"FIDEICOMISOS","CANTIDAD","FIDEI_CANT",{"$f":"VLOOKUP(E148,FIDEICOMISOS!$B:$D,3,0)","v":0}]
[{"$f":"DATOS!$D$12","v":""},{"$f":"DATOS!$D$13","v":""},"FIDEICOMISOS","APLICACIÓN","FIDEI",{"$f":"VLOOKUP(E149,FIDEICOMISOS!B9:D9,3,0)","v":0}]
[{"$f":"DATOS!$D$12","v":""},{"$f":"DATOS!$D$13","v":""},"INSTRUMENTOS_FINANCIEROS","ACTIVOS_FINANCIEROS","NICSP_30_CANT",{"$f":"VLOOKUP(BASE_DATOS!E150,NICSP_28_29_30!$B:$G,5,0)","v":0}]
[{"$f":"DATOS!$D$12","v":""},{"$f":"DATOS!$D$13","v":""},"INSTRUMENTOS_FINANCIEROS","ACTIVOS_FINANCIEROS","NICSP_30_VL",{"$f":"VLOOKUP(BASE_DATOS!E151,NICSP_28_29_30!$B:$G,5,0)","v":0}]
[{"$f":"DATOS!$D$12","v":""},{"$f":"DATOS!$D$13","v":""},"INSTRUMENTOS_FINANCIEROS","ACTIVOS_FINANCIEROS","NICSP_30_VR",{"$f":"VLOOKUP(BASE_DATOS!E152,NICSP_28_29_30!$B:$G,5,0)","v":0}]
[{"$f":"DATOS!$D$12","v":""},{"$f":"DATOS!$D$13","v":""},"INSTRUMENTOS_FINANCIEROS","PASIVOS_FINANCIEROS","NICSP_30_CANT",{"$f":"VLOOKUP(BASE_DATOS!E153,NICSP_28_29_30!$B:$G,6,0)","v":0}]
[{"$f":"DATOS!$D$12","v":""},{"$f":"DATOS!$D$13","v":""},"INSTRUMENTOS_FINANCIEROS","PASIVOS_FINANCIEROS","NICSP_30_VL",{"$f":"VLOOKUP(BASE_DATOS!E154,NICSP_28_29_30!$B:$G,6,0)","v":0}]
[{"$f":"DATOS!$D$12","v":""},{"$f":"DATOS!$D$13","v":""},"INSTRUMENTOS_FINANCIEROS","PASIVOS_FINANCIEROS","NICSP_30_VR",{"$f":"VLOOKUP(BASE_DATOS!E155,NICSP_28_29_30!$B:$G,6,0)","v":0}]
[{"$f":"DATOS!$D$12","v":""},{"$f":"DATOS!$D$13","v":""},"ACTIVOS_INTANGIBLES","CANTIDAD","NICSP_31_CAN",{"$f":"VLOOKUP(E156,NICSP_31!$B:$D,3,0)","v":0}]
[{"$f":"DATOS!$D$12","v":""},{"$f":"DATOS!$D$13","v":""},"ACTIVOS_INTANGIBLES","MONTO","NICSP_31_VI",{"$f":"VLOOKUP(E157,NICSP_31!$B:$D,3,0)","v":0}]
[{"$f":"DATOS!$D$12","v":""},{"$f":"DATOS!$D$13","v":""},"ACTIVOS_INTANGIBLES","MONTO","NICSP_31_ALT",{"$f":"VLOOKUP(E158,NICSP_31!$B:$D,3,0)","v":0}]
[{"$f":"DATOS!$D$12","v":""},{"$f":"DATOS!$D$13","v":""},"ACTIVOS_INTANGIBLES","MONTO","NICSP_31_BAJ",{"$f":"VLOOKUP(E159,NICSP_31!$B:$D,3,0)","v":0}]
[{"$f":"DATOS!$D$12","v":""},{"$f":"DATOS!$D$13","v":""},"ACTIVOS_INTANGIBLES","MONTO","NICSP_31_AMO",{"$f":"VLOOKUP(E160,NICSP_31!$B:$D,3,0)","v":0}]
[{"$f":"DATOS!$D$12","v":""},{"$f":"DATOS!$D$13","v":""},"ACTIVOS_INTANGIBLES","MONTO","NICSP_31_DET",{"$f":"VLOOKUP(E161,NICSP_31!$B:$D,3,0)","v":0}]
[{"$f":"DATOS!$D$12","v":""},{"$f":"DATOS!$D$13","v":""},"ACTIVOS_INTANGIBLES","MONTO","NICSP_31_AJU_DET",{"$f":"VLOOKUP(E162,NICSP_31!$B:$D,3,0)","v":0}]
[{"$f":"DATOS!$D$12","v":""},{"$f":"DATOS!$D$13","v":""},"ACTIVOS_INTANGIBLES","MONTO","NICSP_31_AJU_TC",{"$f":"VLOOKUP(E163,NICSP_31!$B:$D,3,0)","v":0}]
[{"$f":"DATOS!$D$12","v":""},{"$f":"DATOS!$D$13","v":""},"ACTIVOS_INTANGIBLES","MONTO","NICSP_31_VC",{"$f":"VLOOKUP(E164,NICSP_31!$B:$D,3,0)","v":0}]
[{"$f":"DATOS!$D$12","v":""},{"$f":"DATOS!$D$13","v":""},"BENEFICIOS_EMPLEADOS","MONTO","NICSP_39_VAC",{"$f":"VLOOKUP(E165,NICSP_39!$B:$J,7,0)","v":0}]
[{"$f":"DATOS!$D$12","v":""},{"$f":"DATOS!$D$13","v":""},"BENEFICIOS_EMPLEADOS","CANTIDAD","NICSP_39_VAC",{"$f":"VLOOKUP(E166,NICSP_39!$B:$J,8,0)","v":0}]
[{"$f":"DATOS!$D$12","v":""},{"$f":"DATOS!$D$13","v":""},"BENEFICIOS_EMPLEADOS","MONTO","NICSP_39_CC",{"$f":"VLOOKUP(E167,NICSP_39!$B:$J,7,0)","v":0}]
[{"$f":"DATOS!$D$12","v":""},{"$f":"DATOS!$D$13","v":""},"BENEFICIOS_EMPLEADOS","CANTIDAD","NICSP_39_CC",{"$f":"VLOOKUP(E168,NICSP_39!$B:$J,9,0)","v":0}]
[{"$f":"DATOS!$D$12","v":""},{"$f":"DATOS!$D$13","v":""},"BENEFICIOS_EMPLEADOS","MONTO","NICSP_39_CES",{"$f":"VLOOKUP(E169,NICSP_39!$B:$J,7,0)","v":0}]
[{"$f":"DATOS!$D$12","v":""},{"$f":"DATOS!$D$13","v":""},"BENEFICIOS_EMPLEADOS","MONTO","NICSP_39_PRE",{"$f":"VLOOKUP(E170,NICSP_39!$B:$J,7,0)","v":0}]
[{"$f":"DATOS!$D$12","v":""},{"$f":"DATOS!$D$13","v":""},"BENEFICIOS_EMPLEADOS","SERV_MEDICOS","NICSP_39_SER",{"$f":"IF(NICSP_39!I21<>\" \",\"NO\",\"SI\")","v":"NO"}]
[{"$f":"DATOS!$D$12","v":""},{"$f":"DATOS!$D$13","v":""},"NOTAS_PARTICULARES","NOTAS_PARTICULARES_1","N_PART_1",{"$f":"VLOOKUP(E172,NOTAS_PARTICULAR!$A:$D,4,0)","v":0}]
[{"$f":"DATOS!$D$12","v":""},{"$f":"DATOS!$D$13","v":""},"NOTAS_PARTICULARES","NOTAS_PARTICULARES_2","N_PART_2",{"$f":"VLOOKUP(E173,NOTAS_PARTICULAR!$A:$D,4,0)","v":0}]
[{"$f":"DATOS!$D$12","v":""},{"$f":"DATOS!$D$13","v":""},"NOTAS_PARTICULARES","NOTAS_PARTICULARES_3","N_PART_3",{"$f":"VLOOKUP(E174,NOTAS_PARTICULAR!$A:$D,4,0)","v":0}]
[{"$f":"DATOS!$D$12","v":""},{"$f":"DATOS!$D$13","v":""},"NOTAS_PARTICULARES","NOTAS_PARTICULARES_4","N_PART_4",{"$f":"VLOOKUP(E175,NOTAS_PARTICULAR!$A:$D,4,0)","v":0}]
[{"$f":"DATOS!$D$12","v":""},{"$f":"DATOS!$D$13","v":""},"NOTAS_PARTICULARES","NOTAS_PARTICULARES_5","N_PART_5",{"$f":"VLOOKUP(E176,NOTAS_PARTICULAR!$A:$D,4,0)","v":0}]
[{"$f":"DATOS!$D$12","v":""},{"$f":"DATOS!$D$13","v":""},"NOTAS_PARTICULARES","NOTAS_PARTICULARES_6","N_PART_6",{"$f":"VLOOKUP(E177,NOTAS_PARTICULAR!$A:$D,4,0)","v":0}]
[{"$f":"DATOS!$D$12","v":""},{"$f":"DATOS!$D$13","v":""},"NOTAS_PARTICULARES","NOTAS_PARTICULARES_7","N_PART_7",{"$f":"VLOOKUP(E178,NOTAS_PARTICULAR!$A:$D,4,0)","v":0}]
[{"$f":"DATOS!$D$12","v":""},{"$f":"DATOS!$D$13","v":""},"NOTAS_PARTICULARES","NOTAS_PARTICULARES_8","N_PART_8",{"$f":"VLOOKUP(E179,NOTAS_PARTICULAR!$A:$D,4,0)","v":0}]
[{"$f":"DATOS!$D$12","v":""},{"$f":"DATOS!$D$13","v":""},"NOTAS_PARTICULARES","NOTAS_PARTICULARES_9","N_PART_9",{"$f":"VLOOKUP(E180,NOTAS_PARTICULAR!$A:$D,4,0)","v":0}]
[{"$f":"DATOS!$D$12","v":""},{"$f":"DATOS!$D$13","v":""},"NOTAS_PARTICULARES","NOTAS_PARTICULARES_10","N_PART_10",{"$f":"VLOOKUP(E181,NOTAS_PARTICULAR!$A:$D,4,0)","v":0}]
[{"$f":"DATOS!$D$12","v":""},{"$f":"DATOS!$D$13","v":""},"NOTAS_PARTICULARES","NOTAS_PARTICULARES_11","N_PART_11",{"$f":"VLOOKUP(E182,NOTAS_PARTICULAR!$A:$D,4,0)","v":0}]
[{"$f":"DATOS!$D$12","v":""},{"$f":"DATOS!$D$13","v":""},"NOTAS_PARTICULARES","NOTAS_PARTICULARES_12","N_PART_12",{"$f":"VLOOKUP(E183,NOTAS_PARTICULAR!$A:$D,4,0)","v":0}]
[{"$f":"DATOS!$D$12","v":""},{"$f":"DATOS!$D$13","v":""},"NOTAS_PARTICULARES","NOTAS_PARTICULARES_13","N_PART_13",{"$f":"VLOOKUP(E184,NOTAS_PARTICULAR!$A:$D,4,0)","v":0}]
[{"$f":"DATOS!$D$12","v":""},{"$f":"DATOS!$D$13","v":""},"NOTAS_PARTICULARES","NOTAS_PARTICULARES_14","N_PART_14",{"$f":"VLOOKUP(E185,NOTAS_PARTICULAR!$A:$D,4,0)","v":0}]
[{"$f":"DATOS!$D$12","v":""},{"$f":"DATOS!$D$13","v":""},"NOTAS_PARTICULARES","NOTAS_PARTICULARES_15","N_PART_15",{"$f":"VLOOKUP(E186,NOTAS_PARTICULAR!$A:$D,4,0)","v":0}]
[{"$f":"DATOS!$D$12","v":""},{"$f":"DATOS!$D$13","v":""},"NOTAS_PARTICULARES","NOTAS_PARTICULARES_16","N_PART_16",{"$f":"VLOOKUP(E187,NOTAS_PARTICULAR!$A:$D,4,0)","v":0}]
[{"$f":"DATOS!$D$12","v":""},{"$f":"DATOS!$D$13","v":""},"NOTAS_PARTICULARES","NOTAS_PARTICULARES_17","N_PART_17",{"$f":"VLOOKUP(E188,NOTAS_PARTICULAR!$A:$D,4,0)","v":0}]
[{"$f":"DATOS!$D$12","v":""},{"$f":"DATOS!$D$13","v":""},"NOTAS_PARTICULARES","NOTAS_PARTICULARES_18","N_PART_18",{"$f":"VLOOKUP(E189,NOTAS_PARTICULAR!$A:$D,4,0)","v":0}]